{
  "JudgementSection": "audit judgements",
  "AuditorDecision": "auditor decision",
  "AuditDate": "audit date",
  "AssignAuditor": "assign auditor",
  "InternalRemarks": "internal remarks",
  "OtherRemarks": "other remarks",
  "OtherRemarksSave": "other remarks save",
  "PhysicalReaudit": "physical reaudit",
  "EvaluationActions": "evaluation actions",
  "ShareWithAuditor": "share with auditor",
  "ShareWithCoordinator": "share with coordinator",
  "DocumentReview": "document review",
  "ConfirmJudgement": "confirm judgement",
  "MutationLogs": "mutation logs",
  "AssessmentLogs": "assessment logs",
  "CropsApp": "crops app",
  "ReviewTab": "review tab",
  "JudgementLogs": "judgement logs",
  "ConfirmAll": "confirm all"
}
