<?xml version="1.0" standalone="no"?>
<!DOCTYPE svg PUBLIC "-//W3C//DTD SVG 20010904//EN"
 "http://www.w3.org/TR/2001/REC-SVG-20010904/DTD/svg10.dtd">
<svg version="1.0" xmlns="http://www.w3.org/2000/svg"
 width="512.000000pt" height="512.000000pt" viewBox="0 0 512.000000 512.000000"
 preserveAspectRatio="xMidYMid meet">
<metadata></metadata>
<g transform="translate(0.000000,512.000000) scale(0.100000,-0.100000)"
fill="#ffffff" stroke="none">
<path d="M3114 3835 l1 -425 -60 -1 c-33 0 -656 -1 -1385 -2 l-1325 -2 -3
-862 -2 -862 1381 0 c760 0 1384 -3 1387 -5 3 -3 5 -194 5 -423 -1 -230 1
-421 3 -425 2 -3 391 381 865 855 l860 861 -858 858 c-472 472 -861 858 -864
858 -4 0 -6 -191 -5 -425z"/>
</g>
</svg>
