%YAML 1.1
%TAG !u! tag:unity3d.com,2011:
--- !u!1 &6190944761815936182
GameObject:
  m_ObjectHideFlags: 0
  m_CorrespondingSourceObject: {fileID: 0}
  m_PrefabInstance: {fileID: 0}
  m_PrefabAsset: {fileID: 0}
  serializedVersion: 6
  m_Component:
  - component: {fileID: 6670602815884321051}
  m_Layer: 6
  m_Name: CameraTarget
  m_TagString: Untagged
  m_Icon: {fileID: 0}
  m_NavMeshLayer: 0
  m_StaticEditorFlags: 0
  m_IsActive: 1
--- !u!4 &6670602815884321051
Transform:
  m_ObjectHideFlags: 0
  m_CorrespondingSourceObject: {fileID: 0}
  m_PrefabInstance: {fileID: 0}
  m_PrefabAsset: {fileID: 0}
  m_GameObject: {fileID: 6190944761815936182}
  m_LocalRotation: {x: -0, y: -0, z: -0, w: 1}
  m_LocalPosition: {x: 0, y: 1.5, z: 0}
  m_LocalScale: {x: 1, y: 1, z: 1}
  m_Children: []
  m_Father: {fileID: 38763592906786495}
  m_RootOrder: 34
  m_LocalEulerAnglesHint: {x: 0, y: 0, z: 0}
--- !u!1001 &42790328143203807
PrefabInstance:
  m_ObjectHideFlags: 0
  serializedVersion: 2
  m_Modification:
    m_TransformParent: {fileID: 0}
    m_Modifications:
    - target: {fileID: 1039145981656004, guid: a28775a11e80de44baa17ef63cd37f4b, type: 3}
      propertyPath: m_Layer
      value: 6
      objectReference: {fileID: 0}
    - target: {fileID: 1041407635772138, guid: a28775a11e80de44baa17ef63cd37f4b, type: 3}
      propertyPath: m_Layer
      value: 6
      objectReference: {fileID: 0}
    - target: {fileID: 1041407635772138, guid: a28775a11e80de44baa17ef63cd37f4b, type: 3}
      propertyPath: m_IsActive
      value: 0
      objectReference: {fileID: 0}
    - target: {fileID: 1055956219020028, guid: a28775a11e80de44baa17ef63cd37f4b, type: 3}
      propertyPath: m_Layer
      value: 6
      objectReference: {fileID: 0}
    - target: {fileID: 1059019137776188, guid: a28775a11e80de44baa17ef63cd37f4b, type: 3}
      propertyPath: m_Layer
      value: 6
      objectReference: {fileID: 0}
    - target: {fileID: 1059197146876264, guid: a28775a11e80de44baa17ef63cd37f4b, type: 3}
      propertyPath: m_Layer
      value: 6
      objectReference: {fileID: 0}
    - target: {fileID: 1071757896143126, guid: a28775a11e80de44baa17ef63cd37f4b, type: 3}
      propertyPath: m_Layer
      value: 6
      objectReference: {fileID: 0}
    - target: {fileID: 1087081531284646, guid: a28775a11e80de44baa17ef63cd37f4b, type: 3}
      propertyPath: m_Layer
      value: 6
      objectReference: {fileID: 0}
    - target: {fileID: 1089915031685890, guid: a28775a11e80de44baa17ef63cd37f4b, type: 3}
      propertyPath: m_Layer
      value: 6
      objectReference: {fileID: 0}
    - target: {fileID: 1099424881723704, guid: a28775a11e80de44baa17ef63cd37f4b, type: 3}
      propertyPath: m_Layer
      value: 6
      objectReference: {fileID: 0}
    - target: {fileID: 1099424881723704, guid: a28775a11e80de44baa17ef63cd37f4b, type: 3}
      propertyPath: m_IsActive
      value: 0
      objectReference: {fileID: 0}
    - target: {fileID: 1100269232947882, guid: a28775a11e80de44baa17ef63cd37f4b, type: 3}
      propertyPath: m_Layer
      value: 6
      objectReference: {fileID: 0}
    - target: {fileID: 1106148357707202, guid: a28775a11e80de44baa17ef63cd37f4b, type: 3}
      propertyPath: m_Layer
      value: 6
      objectReference: {fileID: 0}
    - target: {fileID: 1122393184370058, guid: a28775a11e80de44baa17ef63cd37f4b, type: 3}
      propertyPath: m_Layer
      value: 6
      objectReference: {fileID: 0}
    - target: {fileID: 1129532639472012, guid: a28775a11e80de44baa17ef63cd37f4b, type: 3}
      propertyPath: m_Layer
      value: 6
      objectReference: {fileID: 0}
    - target: {fileID: 1149888114929738, guid: a28775a11e80de44baa17ef63cd37f4b, type: 3}
      propertyPath: m_Layer
      value: 6
      objectReference: {fileID: 0}
    - target: {fileID: 1156696460874848, guid: a28775a11e80de44baa17ef63cd37f4b, type: 3}
      propertyPath: m_Layer
      value: 6
      objectReference: {fileID: 0}
    - target: {fileID: 1196507882079996, guid: a28775a11e80de44baa17ef63cd37f4b, type: 3}
      propertyPath: m_Layer
      value: 6
      objectReference: {fileID: 0}
    - target: {fileID: 1199204317303450, guid: a28775a11e80de44baa17ef63cd37f4b, type: 3}
      propertyPath: m_Layer
      value: 6
      objectReference: {fileID: 0}
    - target: {fileID: 1199910238074488, guid: a28775a11e80de44baa17ef63cd37f4b, type: 3}
      propertyPath: m_Layer
      value: 6
      objectReference: {fileID: 0}
    - target: {fileID: 1202643133146616, guid: a28775a11e80de44baa17ef63cd37f4b, type: 3}
      propertyPath: m_Layer
      value: 6
      objectReference: {fileID: 0}
    - target: {fileID: 1202643133146616, guid: a28775a11e80de44baa17ef63cd37f4b, type: 3}
      propertyPath: m_IsActive
      value: 0
      objectReference: {fileID: 0}
    - target: {fileID: 1208289631886030, guid: a28775a11e80de44baa17ef63cd37f4b, type: 3}
      propertyPath: m_Layer
      value: 6
      objectReference: {fileID: 0}
    - target: {fileID: 1241338609804248, guid: a28775a11e80de44baa17ef63cd37f4b, type: 3}
      propertyPath: m_Layer
      value: 6
      objectReference: {fileID: 0}
    - target: {fileID: 1241338609804248, guid: a28775a11e80de44baa17ef63cd37f4b, type: 3}
      propertyPath: m_IsActive
      value: 0
      objectReference: {fileID: 0}
    - target: {fileID: 1246026976313846, guid: a28775a11e80de44baa17ef63cd37f4b, type: 3}
      propertyPath: m_Layer
      value: 6
      objectReference: {fileID: 0}
    - target: {fileID: 1249522526854576, guid: a28775a11e80de44baa17ef63cd37f4b, type: 3}
      propertyPath: m_Layer
      value: 6
      objectReference: {fileID: 0}
    - target: {fileID: 1249522526854576, guid: a28775a11e80de44baa17ef63cd37f4b, type: 3}
      propertyPath: m_IsActive
      value: 0
      objectReference: {fileID: 0}
    - target: {fileID: 1254772469543754, guid: a28775a11e80de44baa17ef63cd37f4b, type: 3}
      propertyPath: m_Layer
      value: 6
      objectReference: {fileID: 0}
    - target: {fileID: 1256674248762128, guid: a28775a11e80de44baa17ef63cd37f4b, type: 3}
      propertyPath: m_Layer
      value: 6
      objectReference: {fileID: 0}
    - target: {fileID: 1263618834436856, guid: a28775a11e80de44baa17ef63cd37f4b, type: 3}
      propertyPath: m_Layer
      value: 6
      objectReference: {fileID: 0}
    - target: {fileID: 1297240286886108, guid: a28775a11e80de44baa17ef63cd37f4b, type: 3}
      propertyPath: m_Layer
      value: 6
      objectReference: {fileID: 0}
    - target: {fileID: 1300551886370318, guid: a28775a11e80de44baa17ef63cd37f4b, type: 3}
      propertyPath: m_Layer
      value: 6
      objectReference: {fileID: 0}
    - target: {fileID: 1310630787994820, guid: a28775a11e80de44baa17ef63cd37f4b, type: 3}
      propertyPath: m_Layer
      value: 6
      objectReference: {fileID: 0}
    - target: {fileID: 1322166870486758, guid: a28775a11e80de44baa17ef63cd37f4b, type: 3}
      propertyPath: m_Layer
      value: 6
      objectReference: {fileID: 0}
    - target: {fileID: 1322166870486758, guid: a28775a11e80de44baa17ef63cd37f4b, type: 3}
      propertyPath: m_IsActive
      value: 0
      objectReference: {fileID: 0}
    - target: {fileID: 1324460307522724, guid: a28775a11e80de44baa17ef63cd37f4b, type: 3}
      propertyPath: m_Layer
      value: 6
      objectReference: {fileID: 0}
    - target: {fileID: 1338340391078354, guid: a28775a11e80de44baa17ef63cd37f4b, type: 3}
      propertyPath: m_Layer
      value: 6
      objectReference: {fileID: 0}
    - target: {fileID: 1339303357341652, guid: a28775a11e80de44baa17ef63cd37f4b, type: 3}
      propertyPath: m_Layer
      value: 6
      objectReference: {fileID: 0}
    - target: {fileID: 1348225873420258, guid: a28775a11e80de44baa17ef63cd37f4b, type: 3}
      propertyPath: m_Layer
      value: 6
      objectReference: {fileID: 0}
    - target: {fileID: 1357323700246140, guid: a28775a11e80de44baa17ef63cd37f4b, type: 3}
      propertyPath: m_Layer
      value: 6
      objectReference: {fileID: 0}
    - target: {fileID: 1366982314532320, guid: a28775a11e80de44baa17ef63cd37f4b, type: 3}
      propertyPath: m_Layer
      value: 6
      objectReference: {fileID: 0}
    - target: {fileID: 1367316764421460, guid: a28775a11e80de44baa17ef63cd37f4b, type: 3}
      propertyPath: m_Layer
      value: 6
      objectReference: {fileID: 0}
    - target: {fileID: 1430659816303826, guid: a28775a11e80de44baa17ef63cd37f4b, type: 3}
      propertyPath: m_Layer
      value: 6
      objectReference: {fileID: 0}
    - target: {fileID: 1442715684194320, guid: a28775a11e80de44baa17ef63cd37f4b, type: 3}
      propertyPath: m_Layer
      value: 6
      objectReference: {fileID: 0}
    - target: {fileID: 1454846851618248, guid: a28775a11e80de44baa17ef63cd37f4b, type: 3}
      propertyPath: m_Layer
      value: 6
      objectReference: {fileID: 0}
    - target: {fileID: 1458266752454034, guid: a28775a11e80de44baa17ef63cd37f4b, type: 3}
      propertyPath: m_Layer
      value: 6
      objectReference: {fileID: 0}
    - target: {fileID: 1467384817370286, guid: a28775a11e80de44baa17ef63cd37f4b, type: 3}
      propertyPath: m_Layer
      value: 6
      objectReference: {fileID: 0}
    - target: {fileID: 1502253051409670, guid: a28775a11e80de44baa17ef63cd37f4b, type: 3}
      propertyPath: m_Layer
      value: 6
      objectReference: {fileID: 0}
    - target: {fileID: 1505123931854142, guid: a28775a11e80de44baa17ef63cd37f4b, type: 3}
      propertyPath: m_Layer
      value: 6
      objectReference: {fileID: 0}
    - target: {fileID: 1505123931854142, guid: a28775a11e80de44baa17ef63cd37f4b, type: 3}
      propertyPath: m_IsActive
      value: 0
      objectReference: {fileID: 0}
    - target: {fileID: 1520945651930122, guid: a28775a11e80de44baa17ef63cd37f4b, type: 3}
      propertyPath: m_Layer
      value: 6
      objectReference: {fileID: 0}
    - target: {fileID: 1521232103051500, guid: a28775a11e80de44baa17ef63cd37f4b, type: 3}
      propertyPath: m_Layer
      value: 6
      objectReference: {fileID: 0}
    - target: {fileID: 1541422800439102, guid: a28775a11e80de44baa17ef63cd37f4b, type: 3}
      propertyPath: m_Layer
      value: 6
      objectReference: {fileID: 0}
    - target: {fileID: 1541911486692006, guid: a28775a11e80de44baa17ef63cd37f4b, type: 3}
      propertyPath: m_Layer
      value: 6
      objectReference: {fileID: 0}
    - target: {fileID: 1549806894841100, guid: a28775a11e80de44baa17ef63cd37f4b, type: 3}
      propertyPath: m_Layer
      value: 6
      objectReference: {fileID: 0}
    - target: {fileID: 1551908137856142, guid: a28775a11e80de44baa17ef63cd37f4b, type: 3}
      propertyPath: m_Layer
      value: 6
      objectReference: {fileID: 0}
    - target: {fileID: 1558953762524612, guid: a28775a11e80de44baa17ef63cd37f4b, type: 3}
      propertyPath: m_Layer
      value: 6
      objectReference: {fileID: 0}
    - target: {fileID: 1561888525797304, guid: a28775a11e80de44baa17ef63cd37f4b, type: 3}
      propertyPath: m_Layer
      value: 6
      objectReference: {fileID: 0}
    - target: {fileID: 1564620857892098, guid: a28775a11e80de44baa17ef63cd37f4b, type: 3}
      propertyPath: m_Layer
      value: 6
      objectReference: {fileID: 0}
    - target: {fileID: 1564620857892098, guid: a28775a11e80de44baa17ef63cd37f4b, type: 3}
      propertyPath: m_IsActive
      value: 0
      objectReference: {fileID: 0}
    - target: {fileID: 1570013127311240, guid: a28775a11e80de44baa17ef63cd37f4b, type: 3}
      propertyPath: m_Layer
      value: 6
      objectReference: {fileID: 0}
    - target: {fileID: 1570013127311240, guid: a28775a11e80de44baa17ef63cd37f4b, type: 3}
      propertyPath: m_IsActive
      value: 0
      objectReference: {fileID: 0}
    - target: {fileID: 1574820801867816, guid: a28775a11e80de44baa17ef63cd37f4b, type: 3}
      propertyPath: m_Layer
      value: 6
      objectReference: {fileID: 0}
    - target: {fileID: 1579983485315214, guid: a28775a11e80de44baa17ef63cd37f4b, type: 3}
      propertyPath: m_Layer
      value: 6
      objectReference: {fileID: 0}
    - target: {fileID: 1601095685695802, guid: a28775a11e80de44baa17ef63cd37f4b, type: 3}
      propertyPath: m_Layer
      value: 6
      objectReference: {fileID: 0}
    - target: {fileID: 1601977029474202, guid: a28775a11e80de44baa17ef63cd37f4b, type: 3}
      propertyPath: m_Layer
      value: 6
      objectReference: {fileID: 0}
    - target: {fileID: 1611354765745864, guid: a28775a11e80de44baa17ef63cd37f4b, type: 3}
      propertyPath: m_Layer
      value: 6
      objectReference: {fileID: 0}
    - target: {fileID: 1614531578873054, guid: a28775a11e80de44baa17ef63cd37f4b, type: 3}
      propertyPath: m_Layer
      value: 6
      objectReference: {fileID: 0}
    - target: {fileID: 1626748051434766, guid: a28775a11e80de44baa17ef63cd37f4b, type: 3}
      propertyPath: m_Layer
      value: 6
      objectReference: {fileID: 0}
    - target: {fileID: 1649195753342396, guid: a28775a11e80de44baa17ef63cd37f4b, type: 3}
      propertyPath: m_Layer
      value: 6
      objectReference: {fileID: 0}
    - target: {fileID: 1649615931663726, guid: a28775a11e80de44baa17ef63cd37f4b, type: 3}
      propertyPath: m_Layer
      value: 6
      objectReference: {fileID: 0}
    - target: {fileID: 1660454970037922, guid: a28775a11e80de44baa17ef63cd37f4b, type: 3}
      propertyPath: m_Layer
      value: 6
      objectReference: {fileID: 0}
    - target: {fileID: 1664702520767368, guid: a28775a11e80de44baa17ef63cd37f4b, type: 3}
      propertyPath: m_Layer
      value: 6
      objectReference: {fileID: 0}
    - target: {fileID: 1689367355446980, guid: a28775a11e80de44baa17ef63cd37f4b, type: 3}
      propertyPath: m_Layer
      value: 6
      objectReference: {fileID: 0}
    - target: {fileID: 1689367355446980, guid: a28775a11e80de44baa17ef63cd37f4b, type: 3}
      propertyPath: m_IsActive
      value: 0
      objectReference: {fileID: 0}
    - target: {fileID: 1693544360620136, guid: a28775a11e80de44baa17ef63cd37f4b, type: 3}
      propertyPath: m_Layer
      value: 6
      objectReference: {fileID: 0}
    - target: {fileID: 1704170803448426, guid: a28775a11e80de44baa17ef63cd37f4b, type: 3}
      propertyPath: m_Layer
      value: 6
      objectReference: {fileID: 0}
    - target: {fileID: 1704228935458534, guid: a28775a11e80de44baa17ef63cd37f4b, type: 3}
      propertyPath: m_Layer
      value: 6
      objectReference: {fileID: 0}
    - target: {fileID: 1724272177738020, guid: a28775a11e80de44baa17ef63cd37f4b, type: 3}
      propertyPath: m_Layer
      value: 6
      objectReference: {fileID: 0}
    - target: {fileID: 1734650623451952, guid: a28775a11e80de44baa17ef63cd37f4b, type: 3}
      propertyPath: m_Layer
      value: 6
      objectReference: {fileID: 0}
    - target: {fileID: 1744669949119088, guid: a28775a11e80de44baa17ef63cd37f4b, type: 3}
      propertyPath: m_Layer
      value: 6
      objectReference: {fileID: 0}
    - target: {fileID: 1754043706778328, guid: a28775a11e80de44baa17ef63cd37f4b, type: 3}
      propertyPath: m_Layer
      value: 6
      objectReference: {fileID: 0}
    - target: {fileID: 1759374006019264, guid: a28775a11e80de44baa17ef63cd37f4b, type: 3}
      propertyPath: m_Layer
      value: 6
      objectReference: {fileID: 0}
    - target: {fileID: 1769469743122634, guid: a28775a11e80de44baa17ef63cd37f4b, type: 3}
      propertyPath: m_Layer
      value: 6
      objectReference: {fileID: 0}
    - target: {fileID: 1770604227611496, guid: a28775a11e80de44baa17ef63cd37f4b, type: 3}
      propertyPath: m_Layer
      value: 6
      objectReference: {fileID: 0}
    - target: {fileID: 1771802498390938, guid: a28775a11e80de44baa17ef63cd37f4b, type: 3}
      propertyPath: m_Layer
      value: 6
      objectReference: {fileID: 0}
    - target: {fileID: 1775214464343450, guid: a28775a11e80de44baa17ef63cd37f4b, type: 3}
      propertyPath: m_Name
      value: PlayableCharacter_HeavyWeight (2)
      objectReference: {fileID: 0}
    - target: {fileID: 1775214464343450, guid: a28775a11e80de44baa17ef63cd37f4b, type: 3}
      propertyPath: m_Layer
      value: 6
      objectReference: {fileID: 0}
    - target: {fileID: 1776847333147734, guid: a28775a11e80de44baa17ef63cd37f4b, type: 3}
      propertyPath: m_Layer
      value: 6
      objectReference: {fileID: 0}
    - target: {fileID: 1814556223809076, guid: a28775a11e80de44baa17ef63cd37f4b, type: 3}
      propertyPath: m_Layer
      value: 6
      objectReference: {fileID: 0}
    - target: {fileID: 1817654675788064, guid: a28775a11e80de44baa17ef63cd37f4b, type: 3}
      propertyPath: m_Layer
      value: 6
      objectReference: {fileID: 0}
    - target: {fileID: 1833375620967750, guid: a28775a11e80de44baa17ef63cd37f4b, type: 3}
      propertyPath: m_Layer
      value: 6
      objectReference: {fileID: 0}
    - target: {fileID: 1848412067776822, guid: a28775a11e80de44baa17ef63cd37f4b, type: 3}
      propertyPath: m_Layer
      value: 6
      objectReference: {fileID: 0}
    - target: {fileID: 1848741858985990, guid: a28775a11e80de44baa17ef63cd37f4b, type: 3}
      propertyPath: m_Layer
      value: 6
      objectReference: {fileID: 0}
    - target: {fileID: 1853551172033518, guid: a28775a11e80de44baa17ef63cd37f4b, type: 3}
      propertyPath: m_Layer
      value: 6
      objectReference: {fileID: 0}
    - target: {fileID: 1871206328621706, guid: a28775a11e80de44baa17ef63cd37f4b, type: 3}
      propertyPath: m_Layer
      value: 6
      objectReference: {fileID: 0}
    - target: {fileID: 1873922655476282, guid: a28775a11e80de44baa17ef63cd37f4b, type: 3}
      propertyPath: m_Layer
      value: 6
      objectReference: {fileID: 0}
    - target: {fileID: 1874899031778498, guid: a28775a11e80de44baa17ef63cd37f4b, type: 3}
      propertyPath: m_Layer
      value: 6
      objectReference: {fileID: 0}
    - target: {fileID: 1879818814564998, guid: a28775a11e80de44baa17ef63cd37f4b, type: 3}
      propertyPath: m_Layer
      value: 6
      objectReference: {fileID: 0}
    - target: {fileID: 1903365997799868, guid: a28775a11e80de44baa17ef63cd37f4b, type: 3}
      propertyPath: m_Layer
      value: 6
      objectReference: {fileID: 0}
    - target: {fileID: 1912212442871922, guid: a28775a11e80de44baa17ef63cd37f4b, type: 3}
      propertyPath: m_Layer
      value: 6
      objectReference: {fileID: 0}
    - target: {fileID: 1912212442871922, guid: a28775a11e80de44baa17ef63cd37f4b, type: 3}
      propertyPath: m_IsActive
      value: 0
      objectReference: {fileID: 0}
    - target: {fileID: 1942934801248536, guid: a28775a11e80de44baa17ef63cd37f4b, type: 3}
      propertyPath: m_Layer
      value: 6
      objectReference: {fileID: 0}
    - target: {fileID: 1944998968218356, guid: a28775a11e80de44baa17ef63cd37f4b, type: 3}
      propertyPath: m_Layer
      value: 6
      objectReference: {fileID: 0}
    - target: {fileID: 1959346010094940, guid: a28775a11e80de44baa17ef63cd37f4b, type: 3}
      propertyPath: m_Layer
      value: 6
      objectReference: {fileID: 0}
    - target: {fileID: 1962758058139092, guid: a28775a11e80de44baa17ef63cd37f4b, type: 3}
      propertyPath: m_Layer
      value: 6
      objectReference: {fileID: 0}
    - target: {fileID: 1968682793000302, guid: a28775a11e80de44baa17ef63cd37f4b, type: 3}
      propertyPath: m_Layer
      value: 6
      objectReference: {fileID: 0}
    - target: {fileID: 1999668999922452, guid: a28775a11e80de44baa17ef63cd37f4b, type: 3}
      propertyPath: m_Layer
      value: 6
      objectReference: {fileID: 0}
    - target: {fileID: 4000675166277358, guid: a28775a11e80de44baa17ef63cd37f4b, type: 3}
      propertyPath: m_LocalPosition.x
      value: -0.17903723
      objectReference: {fileID: 0}
    - target: {fileID: 4000675166277358, guid: a28775a11e80de44baa17ef63cd37f4b, type: 3}
      propertyPath: m_LocalPosition.y
      value: -0.000000014901161
      objectReference: {fileID: 0}
    - target: {fileID: 4000675166277358, guid: a28775a11e80de44baa17ef63cd37f4b, type: 3}
      propertyPath: m_LocalPosition.z
      value: -0.000000011175871
      objectReference: {fileID: 0}
    - target: {fileID: 4000675166277358, guid: a28775a11e80de44baa17ef63cd37f4b, type: 3}
      propertyPath: m_LocalRotation.w
      value: -0.030460436
      objectReference: {fileID: 0}
    - target: {fileID: 4000675166277358, guid: a28775a11e80de44baa17ef63cd37f4b, type: 3}
      propertyPath: m_LocalRotation.x
      value: 0.99365634
      objectReference: {fileID: 0}
    - target: {fileID: 4000675166277358, guid: a28775a11e80de44baa17ef63cd37f4b, type: 3}
      propertyPath: m_LocalRotation.y
      value: -0.10808838
      objectReference: {fileID: 0}
    - target: {fileID: 4000675166277358, guid: a28775a11e80de44baa17ef63cd37f4b, type: 3}
      propertyPath: m_LocalRotation.z
      value: 0.006013623
      objectReference: {fileID: 0}
    - target: {fileID: 4009814004231440, guid: a28775a11e80de44baa17ef63cd37f4b, type: 3}
      propertyPath: m_LocalPosition.x
      value: -0.06370216
      objectReference: {fileID: 0}
    - target: {fileID: 4009814004231440, guid: a28775a11e80de44baa17ef63cd37f4b, type: 3}
      propertyPath: m_LocalPosition.y
      value: 0.00000006146729
      objectReference: {fileID: 0}
    - target: {fileID: 4009814004231440, guid: a28775a11e80de44baa17ef63cd37f4b, type: 3}
      propertyPath: m_LocalPosition.z
      value: -0.000000014901161
      objectReference: {fileID: 0}
    - target: {fileID: 4009814004231440, guid: a28775a11e80de44baa17ef63cd37f4b, type: 3}
      propertyPath: m_LocalRotation.w
      value: 0.99086297
      objectReference: {fileID: 0}
    - target: {fileID: 4009814004231440, guid: a28775a11e80de44baa17ef63cd37f4b, type: 3}
      propertyPath: m_LocalRotation.x
      value: -0.067228176
      objectReference: {fileID: 0}
    - target: {fileID: 4009814004231440, guid: a28775a11e80de44baa17ef63cd37f4b, type: 3}
      propertyPath: m_LocalRotation.y
      value: -0.11524537
      objectReference: {fileID: 0}
    - target: {fileID: 4009814004231440, guid: a28775a11e80de44baa17ef63cd37f4b, type: 3}
      propertyPath: m_LocalRotation.z
      value: 0.019736668
      objectReference: {fileID: 0}
    - target: {fileID: 4013454093930752, guid: a28775a11e80de44baa17ef63cd37f4b, type: 3}
      propertyPath: m_LocalPosition.y
      value: 0.003987161
      objectReference: {fileID: 0}
    - target: {fileID: 4013454093930752, guid: a28775a11e80de44baa17ef63cd37f4b, type: 3}
      propertyPath: m_LocalRotation.w
      value: 0.9927692
      objectReference: {fileID: 0}
    - target: {fileID: 4013454093930752, guid: a28775a11e80de44baa17ef63cd37f4b, type: 3}
      propertyPath: m_LocalRotation.x
      value: -0.058274023
      objectReference: {fileID: 0}
    - target: {fileID: 4013454093930752, guid: a28775a11e80de44baa17ef63cd37f4b, type: 3}
      propertyPath: m_LocalRotation.y
      value: 0.095588274
      objectReference: {fileID: 0}
    - target: {fileID: 4013454093930752, guid: a28775a11e80de44baa17ef63cd37f4b, type: 3}
      propertyPath: m_LocalRotation.z
      value: -0.043318752
      objectReference: {fileID: 0}
    - target: {fileID: 4045725329740858, guid: a28775a11e80de44baa17ef63cd37f4b, type: 3}
      propertyPath: m_LocalPosition.x
      value: -0.11284036
      objectReference: {fileID: 0}
    - target: {fileID: 4045725329740858, guid: a28775a11e80de44baa17ef63cd37f4b, type: 3}
      propertyPath: m_LocalPosition.y
      value: 0
      objectReference: {fileID: 0}
    - target: {fileID: 4045725329740858, guid: a28775a11e80de44baa17ef63cd37f4b, type: 3}
      propertyPath: m_LocalPosition.z
      value: 0
      objectReference: {fileID: 0}
    - target: {fileID: 4045725329740858, guid: a28775a11e80de44baa17ef63cd37f4b, type: 3}
      propertyPath: m_LocalRotation.w
      value: 0.9677637
      objectReference: {fileID: 0}
    - target: {fileID: 4045725329740858, guid: a28775a11e80de44baa17ef63cd37f4b, type: 3}
      propertyPath: m_LocalRotation.x
      value: -0.000000004701481
      objectReference: {fileID: 0}
    - target: {fileID: 4045725329740858, guid: a28775a11e80de44baa17ef63cd37f4b, type: 3}
      propertyPath: m_LocalRotation.y
      value: -0.0000000023735305
      objectReference: {fileID: 0}
    - target: {fileID: 4045725329740858, guid: a28775a11e80de44baa17ef63cd37f4b, type: 3}
      propertyPath: m_LocalRotation.z
      value: -0.2518598
      objectReference: {fileID: 0}
    - target: {fileID: 4067480355795694, guid: a28775a11e80de44baa17ef63cd37f4b, type: 3}
      propertyPath: m_LocalPosition.y
      value: 0
      objectReference: {fileID: 0}
    - target: {fileID: 4067480355795694, guid: a28775a11e80de44baa17ef63cd37f4b, type: 3}
      propertyPath: m_LocalPosition.z
      value: -0.0000000018626451
      objectReference: {fileID: 0}
    - target: {fileID: 4067480355795694, guid: a28775a11e80de44baa17ef63cd37f4b, type: 3}
      propertyPath: m_LocalRotation.w
      value: -0.14251876
      objectReference: {fileID: 0}
    - target: {fileID: 4067480355795694, guid: a28775a11e80de44baa17ef63cd37f4b, type: 3}
      propertyPath: m_LocalRotation.x
      value: 0.83307344
      objectReference: {fileID: 0}
    - target: {fileID: 4067480355795694, guid: a28775a11e80de44baa17ef63cd37f4b, type: 3}
      propertyPath: m_LocalRotation.y
      value: 0.5338524
      objectReference: {fileID: 0}
    - target: {fileID: 4067480355795694, guid: a28775a11e80de44baa17ef63cd37f4b, type: 3}
      propertyPath: m_LocalRotation.z
      value: 0.026052518
      objectReference: {fileID: 0}
    - target: {fileID: 4084903921884064, guid: a28775a11e80de44baa17ef63cd37f4b, type: 3}
      propertyPath: m_LocalPosition.x
      value: -0.13197874
      objectReference: {fileID: 0}
    - target: {fileID: 4084903921884064, guid: a28775a11e80de44baa17ef63cd37f4b, type: 3}
      propertyPath: m_LocalPosition.y
      value: 0.000000020416337
      objectReference: {fileID: 0}
    - target: {fileID: 4084903921884064, guid: a28775a11e80de44baa17ef63cd37f4b, type: 3}
      propertyPath: m_LocalPosition.z
      value: 0.000000002561137
      objectReference: {fileID: 0}
    - target: {fileID: 4084903921884064, guid: a28775a11e80de44baa17ef63cd37f4b, type: 3}
      propertyPath: m_LocalRotation.w
      value: 0.7880715
      objectReference: {fileID: 0}
    - target: {fileID: 4084903921884064, guid: a28775a11e80de44baa17ef63cd37f4b, type: 3}
      propertyPath: m_LocalRotation.x
      value: 0.20090196
      objectReference: {fileID: 0}
    - target: {fileID: 4084903921884064, guid: a28775a11e80de44baa17ef63cd37f4b, type: 3}
      propertyPath: m_LocalRotation.y
      value: 0.1330589
      objectReference: {fileID: 0}
    - target: {fileID: 4084903921884064, guid: a28775a11e80de44baa17ef63cd37f4b, type: 3}
      propertyPath: m_LocalRotation.z
      value: 0.56646
      objectReference: {fileID: 0}
    - target: {fileID: 4120628519299126, guid: a28775a11e80de44baa17ef63cd37f4b, type: 3}
      propertyPath: m_LocalPosition.x
      value: -0.121644385
      objectReference: {fileID: 0}
    - target: {fileID: 4120628519299126, guid: a28775a11e80de44baa17ef63cd37f4b, type: 3}
      propertyPath: m_LocalPosition.y
      value: -0.000000044703484
      objectReference: {fileID: 0}
    - target: {fileID: 4120628519299126, guid: a28775a11e80de44baa17ef63cd37f4b, type: 3}
      propertyPath: m_LocalPosition.z
      value: 0.000000037252903
      objectReference: {fileID: 0}
    - target: {fileID: 4120628519299126, guid: a28775a11e80de44baa17ef63cd37f4b, type: 3}
      propertyPath: m_LocalRotation.w
      value: 0.56186855
      objectReference: {fileID: 0}
    - target: {fileID: 4120628519299126, guid: a28775a11e80de44baa17ef63cd37f4b, type: 3}
      propertyPath: m_LocalRotation.x
      value: 0.4620744
      objectReference: {fileID: 0}
    - target: {fileID: 4120628519299126, guid: a28775a11e80de44baa17ef63cd37f4b, type: 3}
      propertyPath: m_LocalRotation.y
      value: -0.48628637
      objectReference: {fileID: 0}
    - target: {fileID: 4120628519299126, guid: a28775a11e80de44baa17ef63cd37f4b, type: 3}
      propertyPath: m_LocalRotation.z
      value: 0.48406264
      objectReference: {fileID: 0}
    - target: {fileID: 4155530697942758, guid: a28775a11e80de44baa17ef63cd37f4b, type: 3}
      propertyPath: m_LocalPosition.x
      value: -0.18151172
      objectReference: {fileID: 0}
    - target: {fileID: 4155530697942758, guid: a28775a11e80de44baa17ef63cd37f4b, type: 3}
      propertyPath: m_LocalPosition.y
      value: -0.000000029802322
      objectReference: {fileID: 0}
    - target: {fileID: 4155530697942758, guid: a28775a11e80de44baa17ef63cd37f4b, type: 3}
      propertyPath: m_LocalPosition.z
      value: 0.000000013969839
      objectReference: {fileID: 0}
    - target: {fileID: 4155530697942758, guid: a28775a11e80de44baa17ef63cd37f4b, type: 3}
      propertyPath: m_LocalRotation.w
      value: 0.024939287
      objectReference: {fileID: 0}
    - target: {fileID: 4155530697942758, guid: a28775a11e80de44baa17ef63cd37f4b, type: 3}
      propertyPath: m_LocalRotation.x
      value: 0.9958762
      objectReference: {fileID: 0}
    - target: {fileID: 4155530697942758, guid: a28775a11e80de44baa17ef63cd37f4b, type: 3}
      propertyPath: m_LocalRotation.y
      value: -0.08496841
      objectReference: {fileID: 0}
    - target: {fileID: 4155530697942758, guid: a28775a11e80de44baa17ef63cd37f4b, type: 3}
      propertyPath: m_LocalRotation.z
      value: -0.019726396
      objectReference: {fileID: 0}
    - target: {fileID: 4261942839388412, guid: a28775a11e80de44baa17ef63cd37f4b, type: 3}
      propertyPath: m_LocalPosition.x
      value: -0.11188972
      objectReference: {fileID: 0}
    - target: {fileID: 4261942839388412, guid: a28775a11e80de44baa17ef63cd37f4b, type: 3}
      propertyPath: m_LocalPosition.y
      value: -0.000000014901161
      objectReference: {fileID: 0}
    - target: {fileID: 4261942839388412, guid: a28775a11e80de44baa17ef63cd37f4b, type: 3}
      propertyPath: m_LocalPosition.z
      value: 0.000000013969839
      objectReference: {fileID: 0}
    - target: {fileID: 4261942839388412, guid: a28775a11e80de44baa17ef63cd37f4b, type: 3}
      propertyPath: m_LocalRotation.w
      value: 0.99551916
      objectReference: {fileID: 0}
    - target: {fileID: 4261942839388412, guid: a28775a11e80de44baa17ef63cd37f4b, type: 3}
      propertyPath: m_LocalRotation.x
      value: 0.055083964
      objectReference: {fileID: 0}
    - target: {fileID: 4261942839388412, guid: a28775a11e80de44baa17ef63cd37f4b, type: 3}
      propertyPath: m_LocalRotation.y
      value: -0.005371725
      objectReference: {fileID: 0}
    - target: {fileID: 4261942839388412, guid: a28775a11e80de44baa17ef63cd37f4b, type: 3}
      propertyPath: m_LocalRotation.z
      value: 0.07667184
      objectReference: {fileID: 0}
    - target: {fileID: 4270117070864828, guid: a28775a11e80de44baa17ef63cd37f4b, type: 3}
      propertyPath: m_LocalPosition.x
      value: -0.058011733
      objectReference: {fileID: 0}
    - target: {fileID: 4270117070864828, guid: a28775a11e80de44baa17ef63cd37f4b, type: 3}
      propertyPath: m_LocalPosition.y
      value: -0.041914493
      objectReference: {fileID: 0}
    - target: {fileID: 4270117070864828, guid: a28775a11e80de44baa17ef63cd37f4b, type: 3}
      propertyPath: m_LocalPosition.z
      value: -0.07447155
      objectReference: {fileID: 0}
    - target: {fileID: 4270117070864828, guid: a28775a11e80de44baa17ef63cd37f4b, type: 3}
      propertyPath: m_LocalRotation.w
      value: -0.41080722
      objectReference: {fileID: 0}
    - target: {fileID: 4270117070864828, guid: a28775a11e80de44baa17ef63cd37f4b, type: 3}
      propertyPath: m_LocalRotation.x
      value: -0.517186
      objectReference: {fileID: 0}
    - target: {fileID: 4270117070864828, guid: a28775a11e80de44baa17ef63cd37f4b, type: 3}
      propertyPath: m_LocalRotation.y
      value: 0.6214664
      objectReference: {fileID: 0}
    - target: {fileID: 4270117070864828, guid: a28775a11e80de44baa17ef63cd37f4b, type: 3}
      propertyPath: m_LocalRotation.z
      value: -0.4213497
      objectReference: {fileID: 0}
    - target: {fileID: 4276989412993932, guid: a28775a11e80de44baa17ef63cd37f4b, type: 3}
      propertyPath: m_LocalPosition.y
      value: -0.00000003486639
      objectReference: {fileID: 0}
    - target: {fileID: 4276989412993932, guid: a28775a11e80de44baa17ef63cd37f4b, type: 3}
      propertyPath: m_LocalPosition.z
      value: -0.0003813634
      objectReference: {fileID: 0}
    - target: {fileID: 4276989412993932, guid: a28775a11e80de44baa17ef63cd37f4b, type: 3}
      propertyPath: m_LocalRotation.w
      value: 0.99081254
      objectReference: {fileID: 0}
    - target: {fileID: 4276989412993932, guid: a28775a11e80de44baa17ef63cd37f4b, type: 3}
      propertyPath: m_LocalRotation.x
      value: 0.0024360353
      objectReference: {fileID: 0}
    - target: {fileID: 4276989412993932, guid: a28775a11e80de44baa17ef63cd37f4b, type: 3}
      propertyPath: m_LocalRotation.y
      value: -0.059960134
      objectReference: {fileID: 0}
    - target: {fileID: 4276989412993932, guid: a28775a11e80de44baa17ef63cd37f4b, type: 3}
      propertyPath: m_LocalRotation.z
      value: 0.12119999
      objectReference: {fileID: 0}
    - target: {fileID: 4319715434181866, guid: a28775a11e80de44baa17ef63cd37f4b, type: 3}
      propertyPath: m_LocalPosition.x
      value: -0.39930907
      objectReference: {fileID: 0}
    - target: {fileID: 4319715434181866, guid: a28775a11e80de44baa17ef63cd37f4b, type: 3}
      propertyPath: m_LocalPosition.y
      value: 0.000000059604645
      objectReference: {fileID: 0}
    - target: {fileID: 4319715434181866, guid: a28775a11e80de44baa17ef63cd37f4b, type: 3}
      propertyPath: m_LocalPosition.z
      value: 4.5820414e-10
      objectReference: {fileID: 0}
    - target: {fileID: 4319715434181866, guid: a28775a11e80de44baa17ef63cd37f4b, type: 3}
      propertyPath: m_LocalRotation.w
      value: 0.687663
      objectReference: {fileID: 0}
    - target: {fileID: 4319715434181866, guid: a28775a11e80de44baa17ef63cd37f4b, type: 3}
      propertyPath: m_LocalRotation.x
      value: 0.71952397
      objectReference: {fileID: 0}
    - target: {fileID: 4319715434181866, guid: a28775a11e80de44baa17ef63cd37f4b, type: 3}
      propertyPath: m_LocalRotation.y
      value: 0.08307149
      objectReference: {fileID: 0}
    - target: {fileID: 4319715434181866, guid: a28775a11e80de44baa17ef63cd37f4b, type: 3}
      propertyPath: m_LocalRotation.z
      value: -0.050041173
      objectReference: {fileID: 0}
    - target: {fileID: 4397022148585284, guid: a28775a11e80de44baa17ef63cd37f4b, type: 3}
      propertyPath: m_LocalPosition.x
      value: 0.05665508
      objectReference: {fileID: 0}
    - target: {fileID: 4397022148585284, guid: a28775a11e80de44baa17ef63cd37f4b, type: 3}
      propertyPath: m_LocalPosition.y
      value: 0.000000109896064
      objectReference: {fileID: 0}
    - target: {fileID: 4397022148585284, guid: a28775a11e80de44baa17ef63cd37f4b, type: 3}
      propertyPath: m_LocalPosition.z
      value: -0.00000021606684
      objectReference: {fileID: 0}
    - target: {fileID: 4397022148585284, guid: a28775a11e80de44baa17ef63cd37f4b, type: 3}
      propertyPath: m_LocalRotation.w
      value: -0.9579595
      objectReference: {fileID: 0}
    - target: {fileID: 4397022148585284, guid: a28775a11e80de44baa17ef63cd37f4b, type: 3}
      propertyPath: m_LocalRotation.x
      value: 0.06547716
      objectReference: {fileID: 0}
    - target: {fileID: 4397022148585284, guid: a28775a11e80de44baa17ef63cd37f4b, type: 3}
      propertyPath: m_LocalRotation.y
      value: 0.15720066
      objectReference: {fileID: 0}
    - target: {fileID: 4397022148585284, guid: a28775a11e80de44baa17ef63cd37f4b, type: 3}
      propertyPath: m_LocalRotation.z
      value: 0.2308991
      objectReference: {fileID: 0}
    - target: {fileID: 4415488864142606, guid: a28775a11e80de44baa17ef63cd37f4b, type: 3}
      propertyPath: m_LocalPosition.x
      value: 0.03514003
      objectReference: {fileID: 0}
    - target: {fileID: 4415488864142606, guid: a28775a11e80de44baa17ef63cd37f4b, type: 3}
      propertyPath: m_LocalPosition.y
      value: 0.011709973
      objectReference: {fileID: 0}
    - target: {fileID: 4415488864142606, guid: a28775a11e80de44baa17ef63cd37f4b, type: 3}
      propertyPath: m_LocalPosition.z
      value: -0.045055415
      objectReference: {fileID: 0}
    - target: {fileID: 4415488864142606, guid: a28775a11e80de44baa17ef63cd37f4b, type: 3}
      propertyPath: m_LocalRotation.w
      value: -0.93715274
      objectReference: {fileID: 0}
    - target: {fileID: 4415488864142606, guid: a28775a11e80de44baa17ef63cd37f4b, type: 3}
      propertyPath: m_LocalRotation.x
      value: -0.07376757
      objectReference: {fileID: 0}
    - target: {fileID: 4415488864142606, guid: a28775a11e80de44baa17ef63cd37f4b, type: 3}
      propertyPath: m_LocalRotation.y
      value: -0.19675824
      objectReference: {fileID: 0}
    - target: {fileID: 4415488864142606, guid: a28775a11e80de44baa17ef63cd37f4b, type: 3}
      propertyPath: m_LocalRotation.z
      value: -0.2785488
      objectReference: {fileID: 0}
    - target: {fileID: 4432237592527774, guid: a28775a11e80de44baa17ef63cd37f4b, type: 3}
      propertyPath: m_LocalPosition.x
      value: 0.040935885
      objectReference: {fileID: 0}
    - target: {fileID: 4432237592527774, guid: a28775a11e80de44baa17ef63cd37f4b, type: 3}
      propertyPath: m_LocalPosition.y
      value: 0.00000092270784
      objectReference: {fileID: 0}
    - target: {fileID: 4432237592527774, guid: a28775a11e80de44baa17ef63cd37f4b, type: 3}
      propertyPath: m_LocalPosition.z
      value: -0.000000055879354
      objectReference: {fileID: 0}
    - target: {fileID: 4432237592527774, guid: a28775a11e80de44baa17ef63cd37f4b, type: 3}
      propertyPath: m_LocalRotation.w
      value: -0.99529684
      objectReference: {fileID: 0}
    - target: {fileID: 4432237592527774, guid: a28775a11e80de44baa17ef63cd37f4b, type: 3}
      propertyPath: m_LocalRotation.x
      value: 0.03946557
      objectReference: {fileID: 0}
    - target: {fileID: 4432237592527774, guid: a28775a11e80de44baa17ef63cd37f4b, type: 3}
      propertyPath: m_LocalRotation.y
      value: 0.015483005
      objectReference: {fileID: 0}
    - target: {fileID: 4432237592527774, guid: a28775a11e80de44baa17ef63cd37f4b, type: 3}
      propertyPath: m_LocalRotation.z
      value: -0.08710381
      objectReference: {fileID: 0}
    - target: {fileID: 4478677845790678, guid: a28775a11e80de44baa17ef63cd37f4b, type: 3}
      propertyPath: m_LocalPosition.y
      value: 0.000000034437107
      objectReference: {fileID: 0}
    - target: {fileID: 4478677845790678, guid: a28775a11e80de44baa17ef63cd37f4b, type: 3}
      propertyPath: m_LocalPosition.z
      value: -8.731149e-10
      objectReference: {fileID: 0}
    - target: {fileID: 4478677845790678, guid: a28775a11e80de44baa17ef63cd37f4b, type: 3}
      propertyPath: m_LocalRotation.w
      value: 0.9952938
      objectReference: {fileID: 0}
    - target: {fileID: 4478677845790678, guid: a28775a11e80de44baa17ef63cd37f4b, type: 3}
      propertyPath: m_LocalRotation.x
      value: -0.039463174
      objectReference: {fileID: 0}
    - target: {fileID: 4478677845790678, guid: a28775a11e80de44baa17ef63cd37f4b, type: 3}
      propertyPath: m_LocalRotation.y
      value: -0.0154848825
      objectReference: {fileID: 0}
    - target: {fileID: 4478677845790678, guid: a28775a11e80de44baa17ef63cd37f4b, type: 3}
      propertyPath: m_LocalRotation.z
      value: 0.087139
      objectReference: {fileID: 0}
    - target: {fileID: 4478988475082808, guid: a28775a11e80de44baa17ef63cd37f4b, type: 3}
      propertyPath: m_LocalPosition.y
      value: 0.000006493414
      objectReference: {fileID: 0}
    - target: {fileID: 4478988475082808, guid: a28775a11e80de44baa17ef63cd37f4b, type: 3}
      propertyPath: m_LocalPosition.z
      value: 0.000000052154064
      objectReference: {fileID: 0}
    - target: {fileID: 4478988475082808, guid: a28775a11e80de44baa17ef63cd37f4b, type: 3}
      propertyPath: m_LocalRotation.w
      value: 0.7684087
      objectReference: {fileID: 0}
    - target: {fileID: 4478988475082808, guid: a28775a11e80de44baa17ef63cd37f4b, type: 3}
      propertyPath: m_LocalRotation.x
      value: 0.25678453
      objectReference: {fileID: 0}
    - target: {fileID: 4478988475082808, guid: a28775a11e80de44baa17ef63cd37f4b, type: 3}
      propertyPath: m_LocalRotation.y
      value: 0.14135794
      objectReference: {fileID: 0}
    - target: {fileID: 4478988475082808, guid: a28775a11e80de44baa17ef63cd37f4b, type: 3}
      propertyPath: m_LocalRotation.z
      value: 0.5688828
      objectReference: {fileID: 0}
    - target: {fileID: 4492890653299444, guid: a28775a11e80de44baa17ef63cd37f4b, type: 3}
      propertyPath: m_LocalPosition.x
      value: 0.3771233
      objectReference: {fileID: 0}
    - target: {fileID: 4492890653299444, guid: a28775a11e80de44baa17ef63cd37f4b, type: 3}
      propertyPath: m_LocalPosition.y
      value: 0.00000014901161
      objectReference: {fileID: 0}
    - target: {fileID: 4492890653299444, guid: a28775a11e80de44baa17ef63cd37f4b, type: 3}
      propertyPath: m_LocalPosition.z
      value: -0.0000008493662
      objectReference: {fileID: 0}
    - target: {fileID: 4492890653299444, guid: a28775a11e80de44baa17ef63cd37f4b, type: 3}
      propertyPath: m_LocalRotation.w
      value: -0.10297472
      objectReference: {fileID: 0}
    - target: {fileID: 4492890653299444, guid: a28775a11e80de44baa17ef63cd37f4b, type: 3}
      propertyPath: m_LocalRotation.x
      value: 0.80491954
      objectReference: {fileID: 0}
    - target: {fileID: 4492890653299444, guid: a28775a11e80de44baa17ef63cd37f4b, type: 3}
      propertyPath: m_LocalRotation.y
      value: 0.5824082
      objectReference: {fileID: 0}
    - target: {fileID: 4492890653299444, guid: a28775a11e80de44baa17ef63cd37f4b, type: 3}
      propertyPath: m_LocalRotation.z
      value: 0.04797421
      objectReference: {fileID: 0}
    - target: {fileID: 4525282081512932, guid: a28775a11e80de44baa17ef63cd37f4b, type: 3}
      propertyPath: m_LocalPosition.x
      value: -0.04248817
      objectReference: {fileID: 0}
    - target: {fileID: 4525282081512932, guid: a28775a11e80de44baa17ef63cd37f4b, type: 3}
      propertyPath: m_LocalPosition.y
      value: -0.000000030515366
      objectReference: {fileID: 0}
    - target: {fileID: 4525282081512932, guid: a28775a11e80de44baa17ef63cd37f4b, type: 3}
      propertyPath: m_LocalPosition.z
      value: 0.000000001884473
      objectReference: {fileID: 0}
    - target: {fileID: 4525282081512932, guid: a28775a11e80de44baa17ef63cd37f4b, type: 3}
      propertyPath: m_LocalRotation.w
      value: 0.9982537
      objectReference: {fileID: 0}
    - target: {fileID: 4525282081512932, guid: a28775a11e80de44baa17ef63cd37f4b, type: 3}
      propertyPath: m_LocalRotation.x
      value: 0.016215617
      objectReference: {fileID: 0}
    - target: {fileID: 4525282081512932, guid: a28775a11e80de44baa17ef63cd37f4b, type: 3}
      propertyPath: m_LocalRotation.y
      value: 0.023478234
      objectReference: {fileID: 0}
    - target: {fileID: 4525282081512932, guid: a28775a11e80de44baa17ef63cd37f4b, type: 3}
      propertyPath: m_LocalRotation.z
      value: 0.051725198
      objectReference: {fileID: 0}
    - target: {fileID: 4531731916707180, guid: a28775a11e80de44baa17ef63cd37f4b, type: 3}
      propertyPath: m_LocalPosition.x
      value: 0.09982501
      objectReference: {fileID: 0}
    - target: {fileID: 4531731916707180, guid: a28775a11e80de44baa17ef63cd37f4b, type: 3}
      propertyPath: m_LocalPosition.y
      value: 0.0011600594
      objectReference: {fileID: 0}
    - target: {fileID: 4531731916707180, guid: a28775a11e80de44baa17ef63cd37f4b, type: 3}
      propertyPath: m_LocalPosition.z
      value: 0.032833412
      objectReference: {fileID: 0}
    - target: {fileID: 4531731916707180, guid: a28775a11e80de44baa17ef63cd37f4b, type: 3}
      propertyPath: m_LocalRotation.w
      value: -0.9987524
      objectReference: {fileID: 0}
    - target: {fileID: 4531731916707180, guid: a28775a11e80de44baa17ef63cd37f4b, type: 3}
      propertyPath: m_LocalRotation.x
      value: -0.006170053
      objectReference: {fileID: 0}
    - target: {fileID: 4531731916707180, guid: a28775a11e80de44baa17ef63cd37f4b, type: 3}
      propertyPath: m_LocalRotation.y
      value: -0.012771999
      objectReference: {fileID: 0}
    - target: {fileID: 4531731916707180, guid: a28775a11e80de44baa17ef63cd37f4b, type: 3}
      propertyPath: m_LocalRotation.z
      value: 0.047879297
      objectReference: {fileID: 0}
    - target: {fileID: 4553676617679206, guid: a28775a11e80de44baa17ef63cd37f4b, type: 3}
      propertyPath: m_LocalPosition.x
      value: -0.099825285
      objectReference: {fileID: 0}
    - target: {fileID: 4553676617679206, guid: a28775a11e80de44baa17ef63cd37f4b, type: 3}
      propertyPath: m_LocalPosition.y
      value: -0.0011595585
      objectReference: {fileID: 0}
    - target: {fileID: 4553676617679206, guid: a28775a11e80de44baa17ef63cd37f4b, type: 3}
      propertyPath: m_LocalPosition.z
      value: -0.032833405
      objectReference: {fileID: 0}
    - target: {fileID: 4553676617679206, guid: a28775a11e80de44baa17ef63cd37f4b, type: 3}
      propertyPath: m_LocalRotation.w
      value: 0.99875236
      objectReference: {fileID: 0}
    - target: {fileID: 4553676617679206, guid: a28775a11e80de44baa17ef63cd37f4b, type: 3}
      propertyPath: m_LocalRotation.x
      value: 0.0061684963
      objectReference: {fileID: 0}
    - target: {fileID: 4553676617679206, guid: a28775a11e80de44baa17ef63cd37f4b, type: 3}
      propertyPath: m_LocalRotation.y
      value: 0.0127760805
      objectReference: {fileID: 0}
    - target: {fileID: 4553676617679206, guid: a28775a11e80de44baa17ef63cd37f4b, type: 3}
      propertyPath: m_LocalRotation.z
      value: -0.04788078
      objectReference: {fileID: 0}
    - target: {fileID: 4555057353132380, guid: a28775a11e80de44baa17ef63cd37f4b, type: 3}
      propertyPath: m_LocalPosition.x
      value: 0.06370147
      objectReference: {fileID: 0}
    - target: {fileID: 4555057353132380, guid: a28775a11e80de44baa17ef63cd37f4b, type: 3}
      propertyPath: m_LocalPosition.y
      value: -0.000007770956
      objectReference: {fileID: 0}
    - target: {fileID: 4555057353132380, guid: a28775a11e80de44baa17ef63cd37f4b, type: 3}
      propertyPath: m_LocalPosition.z
      value: 0.0000004246831
      objectReference: {fileID: 0}
    - target: {fileID: 4555057353132380, guid: a28775a11e80de44baa17ef63cd37f4b, type: 3}
      propertyPath: m_LocalRotation.w
      value: -0.99086535
      objectReference: {fileID: 0}
    - target: {fileID: 4555057353132380, guid: a28775a11e80de44baa17ef63cd37f4b, type: 3}
      propertyPath: m_LocalRotation.x
      value: 0.06721994
      objectReference: {fileID: 0}
    - target: {fileID: 4555057353132380, guid: a28775a11e80de44baa17ef63cd37f4b, type: 3}
      propertyPath: m_LocalRotation.y
      value: 0.11523928
      objectReference: {fileID: 0}
    - target: {fileID: 4555057353132380, guid: a28775a11e80de44baa17ef63cd37f4b, type: 3}
      propertyPath: m_LocalRotation.z
      value: -0.01968113
      objectReference: {fileID: 0}
    - target: {fileID: 4562207164753298, guid: a28775a11e80de44baa17ef63cd37f4b, type: 3}
      propertyPath: m_LocalPosition.x
      value: -0.037911892
      objectReference: {fileID: 0}
    - target: {fileID: 4562207164753298, guid: a28775a11e80de44baa17ef63cd37f4b, type: 3}
      propertyPath: m_LocalPosition.y
      value: -0.000000009713403
      objectReference: {fileID: 0}
    - target: {fileID: 4562207164753298, guid: a28775a11e80de44baa17ef63cd37f4b, type: 3}
      propertyPath: m_LocalPosition.z
      value: -0.000000002764864
      objectReference: {fileID: 0}
    - target: {fileID: 4562207164753298, guid: a28775a11e80de44baa17ef63cd37f4b, type: 3}
      propertyPath: m_LocalRotation.w
      value: 0.99782354
      objectReference: {fileID: 0}
    - target: {fileID: 4562207164753298, guid: a28775a11e80de44baa17ef63cd37f4b, type: 3}
      propertyPath: m_LocalRotation.x
      value: -0.0452761
      objectReference: {fileID: 0}
    - target: {fileID: 4562207164753298, guid: a28775a11e80de44baa17ef63cd37f4b, type: 3}
      propertyPath: m_LocalRotation.y
      value: -0.027576804
      objectReference: {fileID: 0}
    - target: {fileID: 4562207164753298, guid: a28775a11e80de44baa17ef63cd37f4b, type: 3}
      propertyPath: m_LocalRotation.z
      value: 0.039216463
      objectReference: {fileID: 0}
    - target: {fileID: 4563276135296086, guid: a28775a11e80de44baa17ef63cd37f4b, type: 3}
      propertyPath: m_LocalPosition.x
      value: 0.39930925
      objectReference: {fileID: 0}
    - target: {fileID: 4563276135296086, guid: a28775a11e80de44baa17ef63cd37f4b, type: 3}
      propertyPath: m_LocalPosition.y
      value: -0.00000035762787
      objectReference: {fileID: 0}
    - target: {fileID: 4563276135296086, guid: a28775a11e80de44baa17ef63cd37f4b, type: 3}
      propertyPath: m_LocalPosition.z
      value: -1.2739676e-10
      objectReference: {fileID: 0}
    - target: {fileID: 4563276135296086, guid: a28775a11e80de44baa17ef63cd37f4b, type: 3}
      propertyPath: m_LocalRotation.w
      value: 0.69201905
      objectReference: {fileID: 0}
    - target: {fileID: 4563276135296086, guid: a28775a11e80de44baa17ef63cd37f4b, type: 3}
      propertyPath: m_LocalRotation.x
      value: 0.7027172
      objectReference: {fileID: 0}
    - target: {fileID: 4563276135296086, guid: a28775a11e80de44baa17ef63cd37f4b, type: 3}
      propertyPath: m_LocalRotation.y
      value: 0.13877463
      objectReference: {fileID: 0}
    - target: {fileID: 4563276135296086, guid: a28775a11e80de44baa17ef63cd37f4b, type: 3}
      propertyPath: m_LocalRotation.z
      value: -0.08966549
      objectReference: {fileID: 0}
    - target: {fileID: 4588818751763554, guid: a28775a11e80de44baa17ef63cd37f4b, type: 3}
      propertyPath: m_LocalPosition.y
      value: -0.000000022351742
      objectReference: {fileID: 0}
    - target: {fileID: 4588818751763554, guid: a28775a11e80de44baa17ef63cd37f4b, type: 3}
      propertyPath: m_LocalPosition.z
      value: 0.0003813617
      objectReference: {fileID: 0}
    - target: {fileID: 4588818751763554, guid: a28775a11e80de44baa17ef63cd37f4b, type: 3}
      propertyPath: m_LocalRotation.w
      value: 0.98608065
      objectReference: {fileID: 0}
    - target: {fileID: 4588818751763554, guid: a28775a11e80de44baa17ef63cd37f4b, type: 3}
      propertyPath: m_LocalRotation.x
      value: -0.01863238
      objectReference: {fileID: 0}
    - target: {fileID: 4588818751763554, guid: a28775a11e80de44baa17ef63cd37f4b, type: 3}
      propertyPath: m_LocalRotation.y
      value: -0.106981784
      objectReference: {fileID: 0}
    - target: {fileID: 4588818751763554, guid: a28775a11e80de44baa17ef63cd37f4b, type: 3}
      propertyPath: m_LocalRotation.z
      value: 0.12590739
      objectReference: {fileID: 0}
    - target: {fileID: 4595241047227138, guid: a28775a11e80de44baa17ef63cd37f4b, type: 3}
      propertyPath: m_LocalPosition.x
      value: 0.042488072
      objectReference: {fileID: 0}
    - target: {fileID: 4595241047227138, guid: a28775a11e80de44baa17ef63cd37f4b, type: 3}
      propertyPath: m_LocalPosition.y
      value: 0.00000029150397
      objectReference: {fileID: 0}
    - target: {fileID: 4595241047227138, guid: a28775a11e80de44baa17ef63cd37f4b, type: 3}
      propertyPath: m_LocalPosition.z
      value: -0.000000018626451
      objectReference: {fileID: 0}
    - target: {fileID: 4595241047227138, guid: a28775a11e80de44baa17ef63cd37f4b, type: 3}
      propertyPath: m_LocalRotation.w
      value: -0.99825364
      objectReference: {fileID: 0}
    - target: {fileID: 4595241047227138, guid: a28775a11e80de44baa17ef63cd37f4b, type: 3}
      propertyPath: m_LocalRotation.x
      value: -0.016216112
      objectReference: {fileID: 0}
    - target: {fileID: 4595241047227138, guid: a28775a11e80de44baa17ef63cd37f4b, type: 3}
      propertyPath: m_LocalRotation.y
      value: -0.023478298
      objectReference: {fileID: 0}
    - target: {fileID: 4595241047227138, guid: a28775a11e80de44baa17ef63cd37f4b, type: 3}
      propertyPath: m_LocalRotation.z
      value: -0.05172571
      objectReference: {fileID: 0}
    - target: {fileID: 4614012348375576, guid: a28775a11e80de44baa17ef63cd37f4b, type: 3}
      propertyPath: m_LocalPosition.x
      value: 0.1128403
      objectReference: {fileID: 0}
    - target: {fileID: 4614012348375576, guid: a28775a11e80de44baa17ef63cd37f4b, type: 3}
      propertyPath: m_LocalPosition.y
      value: -0.000000018626451
      objectReference: {fileID: 0}
    - target: {fileID: 4614012348375576, guid: a28775a11e80de44baa17ef63cd37f4b, type: 3}
      propertyPath: m_LocalPosition.z
      value: 0.000000029802322
      objectReference: {fileID: 0}
    - target: {fileID: 4614012348375576, guid: a28775a11e80de44baa17ef63cd37f4b, type: 3}
      propertyPath: m_LocalRotation.w
      value: 0.96680623
      objectReference: {fileID: 0}
    - target: {fileID: 4614012348375576, guid: a28775a11e80de44baa17ef63cd37f4b, type: 3}
      propertyPath: m_LocalRotation.x
      value: 0.0000000047125215
      objectReference: {fileID: 0}
    - target: {fileID: 4614012348375576, guid: a28775a11e80de44baa17ef63cd37f4b, type: 3}
      propertyPath: m_LocalRotation.y
      value: 0.0000000024682383
      objectReference: {fileID: 0}
    - target: {fileID: 4614012348375576, guid: a28775a11e80de44baa17ef63cd37f4b, type: 3}
      propertyPath: m_LocalRotation.z
      value: -0.25551087
      objectReference: {fileID: 0}
    - target: {fileID: 4678496523349918, guid: a28775a11e80de44baa17ef63cd37f4b, type: 3}
      propertyPath: m_LocalPosition.y
      value: -0.026920708
      objectReference: {fileID: 0}
    - target: {fileID: 4678496523349918, guid: a28775a11e80de44baa17ef63cd37f4b, type: 3}
      propertyPath: m_LocalRotation.w
      value: -0.08754197
      objectReference: {fileID: 0}
    - target: {fileID: 4678496523349918, guid: a28775a11e80de44baa17ef63cd37f4b, type: 3}
      propertyPath: m_LocalRotation.x
      value: 0.0061774575
      objectReference: {fileID: 0}
    - target: {fileID: 4678496523349918, guid: a28775a11e80de44baa17ef63cd37f4b, type: 3}
      propertyPath: m_LocalRotation.y
      value: 0.6516252
      objectReference: {fileID: 0}
    - target: {fileID: 4678496523349918, guid: a28775a11e80de44baa17ef63cd37f4b, type: 3}
      propertyPath: m_LocalRotation.z
      value: -0.7534473
      objectReference: {fileID: 0}
    - target: {fileID: 4770056920412394, guid: a28775a11e80de44baa17ef63cd37f4b, type: 3}
      propertyPath: m_LocalPosition.x
      value: -0.0013311029
      objectReference: {fileID: 0}
    - target: {fileID: 4770056920412394, guid: a28775a11e80de44baa17ef63cd37f4b, type: 3}
      propertyPath: m_LocalPosition.y
      value: 0.8699739
      objectReference: {fileID: 0}
    - target: {fileID: 4770056920412394, guid: a28775a11e80de44baa17ef63cd37f4b, type: 3}
      propertyPath: m_LocalPosition.z
      value: 0.032445658
      objectReference: {fileID: 0}
    - target: {fileID: 4770056920412394, guid: a28775a11e80de44baa17ef63cd37f4b, type: 3}
      propertyPath: m_LocalRotation.w
      value: 0.56829864
      objectReference: {fileID: 0}
    - target: {fileID: 4770056920412394, guid: a28775a11e80de44baa17ef63cd37f4b, type: 3}
      propertyPath: m_LocalRotation.x
      value: 0.44566488
      objectReference: {fileID: 0}
    - target: {fileID: 4770056920412394, guid: a28775a11e80de44baa17ef63cd37f4b, type: 3}
      propertyPath: m_LocalRotation.y
      value: -0.51819026
      objectReference: {fileID: 0}
    - target: {fileID: 4770056920412394, guid: a28775a11e80de44baa17ef63cd37f4b, type: 3}
      propertyPath: m_LocalRotation.z
      value: -0.4581467
      objectReference: {fileID: 0}
    - target: {fileID: 4785421678622158, guid: a28775a11e80de44baa17ef63cd37f4b, type: 3}
      propertyPath: m_LocalPosition.x
      value: 0.10396601
      objectReference: {fileID: 0}
    - target: {fileID: 4785421678622158, guid: a28775a11e80de44baa17ef63cd37f4b, type: 3}
      propertyPath: m_LocalPosition.y
      value: -0.003989989
      objectReference: {fileID: 0}
    - target: {fileID: 4785421678622158, guid: a28775a11e80de44baa17ef63cd37f4b, type: 3}
      propertyPath: m_LocalPosition.z
      value: -0.026726509
      objectReference: {fileID: 0}
    - target: {fileID: 4785421678622158, guid: a28775a11e80de44baa17ef63cd37f4b, type: 3}
      propertyPath: m_LocalRotation.w
      value: -0.99276924
      objectReference: {fileID: 0}
    - target: {fileID: 4785421678622158, guid: a28775a11e80de44baa17ef63cd37f4b, type: 3}
      propertyPath: m_LocalRotation.x
      value: 0.058273327
      objectReference: {fileID: 0}
    - target: {fileID: 4785421678622158, guid: a28775a11e80de44baa17ef63cd37f4b, type: 3}
      propertyPath: m_LocalRotation.y
      value: -0.09558774
      objectReference: {fileID: 0}
    - target: {fileID: 4785421678622158, guid: a28775a11e80de44baa17ef63cd37f4b, type: 3}
      propertyPath: m_LocalRotation.z
      value: 0.04331928
      objectReference: {fileID: 0}
    - target: {fileID: 4799908528194898, guid: a28775a11e80de44baa17ef63cd37f4b, type: 3}
      propertyPath: m_LocalPosition.x
      value: 0.0411578
      objectReference: {fileID: 0}
    - target: {fileID: 4799908528194898, guid: a28775a11e80de44baa17ef63cd37f4b, type: 3}
      propertyPath: m_LocalPosition.y
      value: -0.026920758
      objectReference: {fileID: 0}
    - target: {fileID: 4799908528194898, guid: a28775a11e80de44baa17ef63cd37f4b, type: 3}
      propertyPath: m_LocalRotation.w
      value: 0.7628233
      objectReference: {fileID: 0}
    - target: {fileID: 4799908528194898, guid: a28775a11e80de44baa17ef63cd37f4b, type: 3}
      propertyPath: m_LocalRotation.x
      value: -0.639624
      objectReference: {fileID: 0}
    - target: {fileID: 4799908528194898, guid: a28775a11e80de44baa17ef63cd37f4b, type: 3}
      propertyPath: m_LocalRotation.y
      value: -0.026144898
      objectReference: {fileID: 0}
    - target: {fileID: 4799908528194898, guid: a28775a11e80de44baa17ef63cd37f4b, type: 3}
      propertyPath: m_LocalRotation.z
      value: -0.09109502
      objectReference: {fileID: 0}
    - target: {fileID: 4802217598754304, guid: a28775a11e80de44baa17ef63cd37f4b, type: 3}
      propertyPath: m_LocalPosition.x
      value: -0.05801531
      objectReference: {fileID: 0}
    - target: {fileID: 4802217598754304, guid: a28775a11e80de44baa17ef63cd37f4b, type: 3}
      propertyPath: m_LocalPosition.y
      value: -0.041914195
      objectReference: {fileID: 0}
    - target: {fileID: 4802217598754304, guid: a28775a11e80de44baa17ef63cd37f4b, type: 3}
      propertyPath: m_LocalPosition.z
      value: 0.07447152
      objectReference: {fileID: 0}
    - target: {fileID: 4802217598754304, guid: a28775a11e80de44baa17ef63cd37f4b, type: 3}
      propertyPath: m_LocalRotation.w
      value: -0.37900892
      objectReference: {fileID: 0}
    - target: {fileID: 4802217598754304, guid: a28775a11e80de44baa17ef63cd37f4b, type: 3}
      propertyPath: m_LocalRotation.x
      value: 0.6162329
      objectReference: {fileID: 0}
    - target: {fileID: 4802217598754304, guid: a28775a11e80de44baa17ef63cd37f4b, type: 3}
      propertyPath: m_LocalRotation.y
      value: 0.56093276
      objectReference: {fileID: 0}
    - target: {fileID: 4802217598754304, guid: a28775a11e80de44baa17ef63cd37f4b, type: 3}
      propertyPath: m_LocalRotation.z
      value: 0.4024472
      objectReference: {fileID: 0}
    - target: {fileID: 4803261135772718, guid: a28775a11e80de44baa17ef63cd37f4b, type: 3}
      propertyPath: m_LocalPosition.x
      value: -0.03514046
      objectReference: {fileID: 0}
    - target: {fileID: 4803261135772718, guid: a28775a11e80de44baa17ef63cd37f4b, type: 3}
      propertyPath: m_LocalPosition.y
      value: -0.011706877
      objectReference: {fileID: 0}
    - target: {fileID: 4803261135772718, guid: a28775a11e80de44baa17ef63cd37f4b, type: 3}
      propertyPath: m_LocalPosition.z
      value: 0.045055397
      objectReference: {fileID: 0}
    - target: {fileID: 4803261135772718, guid: a28775a11e80de44baa17ef63cd37f4b, type: 3}
      propertyPath: m_LocalRotation.w
      value: 0.9371614
      objectReference: {fileID: 0}
    - target: {fileID: 4803261135772718, guid: a28775a11e80de44baa17ef63cd37f4b, type: 3}
      propertyPath: m_LocalRotation.x
      value: 0.073765755
      objectReference: {fileID: 0}
    - target: {fileID: 4803261135772718, guid: a28775a11e80de44baa17ef63cd37f4b, type: 3}
      propertyPath: m_LocalRotation.y
      value: 0.1967747
      objectReference: {fileID: 0}
    - target: {fileID: 4803261135772718, guid: a28775a11e80de44baa17ef63cd37f4b, type: 3}
      propertyPath: m_LocalRotation.z
      value: 0.27850842
      objectReference: {fileID: 0}
    - target: {fileID: 4804632800273448, guid: a28775a11e80de44baa17ef63cd37f4b, type: 3}
      propertyPath: m_LocalPosition.x
      value: 0.037912145
      objectReference: {fileID: 0}
    - target: {fileID: 4804632800273448, guid: a28775a11e80de44baa17ef63cd37f4b, type: 3}
      propertyPath: m_LocalPosition.y
      value: 0.0000032065436
      objectReference: {fileID: 0}
    - target: {fileID: 4804632800273448, guid: a28775a11e80de44baa17ef63cd37f4b, type: 3}
      propertyPath: m_LocalPosition.z
      value: -0.00000004656613
      objectReference: {fileID: 0}
    - target: {fileID: 4804632800273448, guid: a28775a11e80de44baa17ef63cd37f4b, type: 3}
      propertyPath: m_LocalRotation.w
      value: -0.99781835
      objectReference: {fileID: 0}
    - target: {fileID: 4804632800273448, guid: a28775a11e80de44baa17ef63cd37f4b, type: 3}
      propertyPath: m_LocalRotation.x
      value: 0.045278788
      objectReference: {fileID: 0}
    - target: {fileID: 4804632800273448, guid: a28775a11e80de44baa17ef63cd37f4b, type: 3}
      propertyPath: m_LocalRotation.y
      value: 0.027606323
      objectReference: {fileID: 0}
    - target: {fileID: 4804632800273448, guid: a28775a11e80de44baa17ef63cd37f4b, type: 3}
      propertyPath: m_LocalRotation.z
      value: -0.03932338
      objectReference: {fileID: 0}
    - target: {fileID: 4814421260107904, guid: a28775a11e80de44baa17ef63cd37f4b, type: 3}
      propertyPath: m_LocalPosition.x
      value: -0.33947405
      objectReference: {fileID: 0}
    - target: {fileID: 4814421260107904, guid: a28775a11e80de44baa17ef63cd37f4b, type: 3}
      propertyPath: m_LocalPosition.y
      value: -0.0014491149
      objectReference: {fileID: 0}
    - target: {fileID: 4814421260107904, guid: a28775a11e80de44baa17ef63cd37f4b, type: 3}
      propertyPath: m_LocalPosition.z
      value: -0.0014362636
      objectReference: {fileID: 0}
    - target: {fileID: 4814421260107904, guid: a28775a11e80de44baa17ef63cd37f4b, type: 3}
      propertyPath: m_LocalRotation.w
      value: 0.9916087
      objectReference: {fileID: 0}
    - target: {fileID: 4814421260107904, guid: a28775a11e80de44baa17ef63cd37f4b, type: 3}
      propertyPath: m_LocalRotation.x
      value: -0.08158788
      objectReference: {fileID: 0}
    - target: {fileID: 4814421260107904, guid: a28775a11e80de44baa17ef63cd37f4b, type: 3}
      propertyPath: m_LocalRotation.y
      value: 0.09638751
      objectReference: {fileID: 0}
    - target: {fileID: 4814421260107904, guid: a28775a11e80de44baa17ef63cd37f4b, type: 3}
      propertyPath: m_LocalRotation.z
      value: -0.027662203
      objectReference: {fileID: 0}
    - target: {fileID: 4857730402627022, guid: a28775a11e80de44baa17ef63cd37f4b, type: 3}
      propertyPath: m_LocalPosition.x
      value: 0.035133254
      objectReference: {fileID: 0}
    - target: {fileID: 4857730402627022, guid: a28775a11e80de44baa17ef63cd37f4b, type: 3}
      propertyPath: m_LocalPosition.y
      value: -0.00000025890768
      objectReference: {fileID: 0}
    - target: {fileID: 4857730402627022, guid: a28775a11e80de44baa17ef63cd37f4b, type: 3}
      propertyPath: m_LocalPosition.z
      value: 0.000000015133992
      objectReference: {fileID: 0}
    - target: {fileID: 4857730402627022, guid: a28775a11e80de44baa17ef63cd37f4b, type: 3}
      propertyPath: m_LocalRotation.w
      value: -0.99875605
      objectReference: {fileID: 0}
    - target: {fileID: 4857730402627022, guid: a28775a11e80de44baa17ef63cd37f4b, type: 3}
      propertyPath: m_LocalRotation.x
      value: 0.004771942
      objectReference: {fileID: 0}
    - target: {fileID: 4857730402627022, guid: a28775a11e80de44baa17ef63cd37f4b, type: 3}
      propertyPath: m_LocalRotation.y
      value: 0.019720415
      objectReference: {fileID: 0}
    - target: {fileID: 4857730402627022, guid: a28775a11e80de44baa17ef63cd37f4b, type: 3}
      propertyPath: m_LocalRotation.z
      value: -0.04555046
      objectReference: {fileID: 0}
    - target: {fileID: 4862654502672416, guid: a28775a11e80de44baa17ef63cd37f4b, type: 3}
      propertyPath: m_LocalPosition.x
      value: -0.035133284
      objectReference: {fileID: 0}
    - target: {fileID: 4862654502672416, guid: a28775a11e80de44baa17ef63cd37f4b, type: 3}
      propertyPath: m_LocalPosition.y
      value: 0.00000003234163
      objectReference: {fileID: 0}
    - target: {fileID: 4862654502672416, guid: a28775a11e80de44baa17ef63cd37f4b, type: 3}
      propertyPath: m_LocalPosition.z
      value: 7.858034e-10
      objectReference: {fileID: 0}
    - target: {fileID: 4862654502672416, guid: a28775a11e80de44baa17ef63cd37f4b, type: 3}
      propertyPath: m_LocalRotation.w
      value: 0.99875504
      objectReference: {fileID: 0}
    - target: {fileID: 4862654502672416, guid: a28775a11e80de44baa17ef63cd37f4b, type: 3}
      propertyPath: m_LocalRotation.x
      value: -0.004772031
      objectReference: {fileID: 0}
    - target: {fileID: 4862654502672416, guid: a28775a11e80de44baa17ef63cd37f4b, type: 3}
      propertyPath: m_LocalRotation.y
      value: -0.019729247
      objectReference: {fileID: 0}
    - target: {fileID: 4862654502672416, guid: a28775a11e80de44baa17ef63cd37f4b, type: 3}
      propertyPath: m_LocalRotation.z
      value: 0.045567747
      objectReference: {fileID: 0}
    - target: {fileID: 4930105437389440, guid: a28775a11e80de44baa17ef63cd37f4b, type: 3}
      propertyPath: m_LocalPosition.x
      value: -0.056655705
      objectReference: {fileID: 0}
    - target: {fileID: 4930105437389440, guid: a28775a11e80de44baa17ef63cd37f4b, type: 3}
      propertyPath: m_LocalPosition.y
      value: -0.00000005052425
      objectReference: {fileID: 0}
    - target: {fileID: 4930105437389440, guid: a28775a11e80de44baa17ef63cd37f4b, type: 3}
      propertyPath: m_LocalPosition.z
      value: 0.000000005122274
      objectReference: {fileID: 0}
    - target: {fileID: 4930105437389440, guid: a28775a11e80de44baa17ef63cd37f4b, type: 3}
      propertyPath: m_LocalRotation.w
      value: 0.9579588
      objectReference: {fileID: 0}
    - target: {fileID: 4930105437389440, guid: a28775a11e80de44baa17ef63cd37f4b, type: 3}
      propertyPath: m_LocalRotation.x
      value: -0.06548504
      objectReference: {fileID: 0}
    - target: {fileID: 4930105437389440, guid: a28775a11e80de44baa17ef63cd37f4b, type: 3}
      propertyPath: m_LocalRotation.y
      value: -0.15720105
      objectReference: {fileID: 0}
    - target: {fileID: 4930105437389440, guid: a28775a11e80de44baa17ef63cd37f4b, type: 3}
      propertyPath: m_LocalRotation.z
      value: -0.23089924
      objectReference: {fileID: 0}
    - target: {fileID: 4946608302318808, guid: a28775a11e80de44baa17ef63cd37f4b, type: 3}
      propertyPath: m_LocalPosition.y
      value: 0.0014476348
      objectReference: {fileID: 0}
    - target: {fileID: 4946608302318808, guid: a28775a11e80de44baa17ef63cd37f4b, type: 3}
      propertyPath: m_LocalPosition.z
      value: 0.0014362596
      objectReference: {fileID: 0}
    - target: {fileID: 4946608302318808, guid: a28775a11e80de44baa17ef63cd37f4b, type: 3}
      propertyPath: m_LocalRotation.w
      value: 0.9755362
      objectReference: {fileID: 0}
    - target: {fileID: 4946608302318808, guid: a28775a11e80de44baa17ef63cd37f4b, type: 3}
      propertyPath: m_LocalRotation.x
      value: -0.046226934
      objectReference: {fileID: 0}
    - target: {fileID: 4946608302318808, guid: a28775a11e80de44baa17ef63cd37f4b, type: 3}
      propertyPath: m_LocalRotation.y
      value: 0.21388642
      objectReference: {fileID: 0}
    - target: {fileID: 4946608302318808, guid: a28775a11e80de44baa17ef63cd37f4b, type: 3}
      propertyPath: m_LocalRotation.z
      value: -0.021090284
      objectReference: {fileID: 0}
    - target: {fileID: 4964136367567218, guid: a28775a11e80de44baa17ef63cd37f4b, type: 3}
      propertyPath: m_LocalPosition.x
      value: -0.10393268
      objectReference: {fileID: 0}
    - target: {fileID: 4964136367567218, guid: a28775a11e80de44baa17ef63cd37f4b, type: 3}
      propertyPath: m_LocalPosition.y
      value: 0
      objectReference: {fileID: 0}
    - target: {fileID: 4964136367567218, guid: a28775a11e80de44baa17ef63cd37f4b, type: 3}
      propertyPath: m_LocalPosition.z
      value: 0
      objectReference: {fileID: 0}
    - target: {fileID: 4964136367567218, guid: a28775a11e80de44baa17ef63cd37f4b, type: 3}
      propertyPath: m_LocalRotation.w
      value: -0.004139831
      objectReference: {fileID: 0}
    - target: {fileID: 4964136367567218, guid: a28775a11e80de44baa17ef63cd37f4b, type: 3}
      propertyPath: m_LocalRotation.x
      value: 0.9978693
      objectReference: {fileID: 0}
    - target: {fileID: 4964136367567218, guid: a28775a11e80de44baa17ef63cd37f4b, type: 3}
      propertyPath: m_LocalRotation.y
      value: -0.06477573
      objectReference: {fileID: 0}
    - target: {fileID: 4964136367567218, guid: a28775a11e80de44baa17ef63cd37f4b, type: 3}
      propertyPath: m_LocalRotation.z
      value: 0.0066328146
      objectReference: {fileID: 0}
    - target: {fileID: 4981732258417504, guid: a28775a11e80de44baa17ef63cd37f4b, type: 3}
      propertyPath: m_RootOrder
      value: 0
      objectReference: {fileID: 0}
    - target: {fileID: 4981732258417504, guid: a28775a11e80de44baa17ef63cd37f4b, type: 3}
      propertyPath: m_LocalEulerAnglesHint.x
      value: 0
      objectReference: {fileID: 0}
    - target: {fileID: 4981732258417504, guid: a28775a11e80de44baa17ef63cd37f4b, type: 3}
      propertyPath: m_LocalEulerAnglesHint.y
      value: 0
      objectReference: {fileID: 0}
    - target: {fileID: 4981732258417504, guid: a28775a11e80de44baa17ef63cd37f4b, type: 3}
      propertyPath: m_LocalEulerAnglesHint.z
      value: 0
      objectReference: {fileID: 0}
    - target: {fileID: 95096471936481306, guid: a28775a11e80de44baa17ef63cd37f4b, type: 3}
      propertyPath: m_Controller
      value: 
      objectReference: {fileID: 9100000, guid: 153a11c01f8cd6a4bbf5b927e4f94622, type: 2}
    - target: {fileID: 137608184872520708, guid: a28775a11e80de44baa17ef63cd37f4b, type: 3}
      propertyPath: m_Materials.Array.data[0]
      value: 
      objectReference: {fileID: 2100000, guid: deeb3b67f97ecce46b14722f9cde4e99, type: 2}
    m_RemovedComponents:
    - {fileID: 95096471936481306, guid: a28775a11e80de44baa17ef63cd37f4b, type: 3}
  m_SourcePrefab: {fileID: 100100000, guid: a28775a11e80de44baa17ef63cd37f4b, type: 3}
--- !u!4 &38763592906786495 stripped
Transform:
  m_CorrespondingSourceObject: {fileID: 4981732258417504, guid: a28775a11e80de44baa17ef63cd37f4b, type: 3}
  m_PrefabInstance: {fileID: 42790328143203807}
  m_PrefabAsset: {fileID: 0}
--- !u!4 &42403916631549417 stripped
Transform:
  m_CorrespondingSourceObject: {fileID: 4120628519299126, guid: a28775a11e80de44baa17ef63cd37f4b, type: 3}
  m_PrefabInstance: {fileID: 42790328143203807}
  m_PrefabAsset: {fileID: 0}
--- !u!1001 &2775866529297132986
PrefabInstance:
  m_ObjectHideFlags: 0
  serializedVersion: 2
  m_Modification:
    m_TransformParent: {fileID: 42403916631549417}
    m_Modifications:
    - target: {fileID: 1159151159287180, guid: cdb3536c13c147d48b7422e1fd4da46b, type: 3}
      propertyPath: m_Name
      value: SM_Chr_Attach_Beard_10
      objectReference: {fileID: 0}
    - target: {fileID: 1159151159287180, guid: cdb3536c13c147d48b7422e1fd4da46b, type: 3}
      propertyPath: m_Layer
      value: 6
      objectReference: {fileID: 0}
    - target: {fileID: 4935698102660850, guid: cdb3536c13c147d48b7422e1fd4da46b, type: 3}
      propertyPath: m_RootOrder
      value: 7
      objectReference: {fileID: 0}
    - target: {fileID: 4935698102660850, guid: cdb3536c13c147d48b7422e1fd4da46b, type: 3}
      propertyPath: m_LocalPosition.x
      value: -0
      objectReference: {fileID: 0}
    - target: {fileID: 4935698102660850, guid: cdb3536c13c147d48b7422e1fd4da46b, type: 3}
      propertyPath: m_LocalPosition.y
      value: 0
      objectReference: {fileID: 0}
    - target: {fileID: 4935698102660850, guid: cdb3536c13c147d48b7422e1fd4da46b, type: 3}
      propertyPath: m_LocalPosition.z
      value: 0
      objectReference: {fileID: 0}
    - target: {fileID: 4935698102660850, guid: cdb3536c13c147d48b7422e1fd4da46b, type: 3}
      propertyPath: m_LocalRotation.w
      value: 1
      objectReference: {fileID: 0}
    - target: {fileID: 4935698102660850, guid: cdb3536c13c147d48b7422e1fd4da46b, type: 3}
      propertyPath: m_LocalRotation.x
      value: 0
      objectReference: {fileID: 0}
    - target: {fileID: 4935698102660850, guid: cdb3536c13c147d48b7422e1fd4da46b, type: 3}
      propertyPath: m_LocalRotation.y
      value: -0
      objectReference: {fileID: 0}
    - target: {fileID: 4935698102660850, guid: cdb3536c13c147d48b7422e1fd4da46b, type: 3}
      propertyPath: m_LocalRotation.z
      value: -0
      objectReference: {fileID: 0}
    - target: {fileID: 4935698102660850, guid: cdb3536c13c147d48b7422e1fd4da46b, type: 3}
      propertyPath: m_LocalEulerAnglesHint.x
      value: 0
      objectReference: {fileID: 0}
    - target: {fileID: 4935698102660850, guid: cdb3536c13c147d48b7422e1fd4da46b, type: 3}
      propertyPath: m_LocalEulerAnglesHint.y
      value: 0
      objectReference: {fileID: 0}
    - target: {fileID: 4935698102660850, guid: cdb3536c13c147d48b7422e1fd4da46b, type: 3}
      propertyPath: m_LocalEulerAnglesHint.z
      value: 0
      objectReference: {fileID: 0}
    m_RemovedComponents: []
  m_SourcePrefab: {fileID: 100100000, guid: cdb3536c13c147d48b7422e1fd4da46b, type: 3}
--- !u!1001 &4700404475989447516
PrefabInstance:
  m_ObjectHideFlags: 0
  serializedVersion: 2
  m_Modification:
    m_TransformParent: {fileID: 42403916631549417}
    m_Modifications:
    - target: {fileID: 1379089672065609783, guid: ebe9744823fac8f4195efa8abf744f96, type: 3}
      propertyPath: m_Name
      value: SM_Chr_Hair_Sweptback_02
      objectReference: {fileID: 0}
    - target: {fileID: 1379089672065609783, guid: ebe9744823fac8f4195efa8abf744f96, type: 3}
      propertyPath: m_Layer
      value: 6
      objectReference: {fileID: 0}
    - target: {fileID: 1379089672065969175, guid: ebe9744823fac8f4195efa8abf744f96, type: 3}
      propertyPath: m_RootOrder
      value: 8
      objectReference: {fileID: 0}
    - target: {fileID: 1379089672065969175, guid: ebe9744823fac8f4195efa8abf744f96, type: 3}
      propertyPath: m_LocalScale.x
      value: 1.281
      objectReference: {fileID: 0}
    - target: {fileID: 1379089672065969175, guid: ebe9744823fac8f4195efa8abf744f96, type: 3}
      propertyPath: m_LocalScale.y
      value: 1.281
      objectReference: {fileID: 0}
    - target: {fileID: 1379089672065969175, guid: ebe9744823fac8f4195efa8abf744f96, type: 3}
      propertyPath: m_LocalScale.z
      value: 1.281
      objectReference: {fileID: 0}
    - target: {fileID: 1379089672065969175, guid: ebe9744823fac8f4195efa8abf744f96, type: 3}
      propertyPath: m_LocalPosition.x
      value: -0
      objectReference: {fileID: 0}
    - target: {fileID: 1379089672065969175, guid: ebe9744823fac8f4195efa8abf744f96, type: 3}
      propertyPath: m_LocalPosition.y
      value: 0.011
      objectReference: {fileID: 0}
    - target: {fileID: 1379089672065969175, guid: ebe9744823fac8f4195efa8abf744f96, type: 3}
      propertyPath: m_LocalPosition.z
      value: 0
      objectReference: {fileID: 0}
    - target: {fileID: 1379089672065969175, guid: ebe9744823fac8f4195efa8abf744f96, type: 3}
      propertyPath: m_LocalRotation.w
      value: 1
      objectReference: {fileID: 0}
    - target: {fileID: 1379089672065969175, guid: ebe9744823fac8f4195efa8abf744f96, type: 3}
      propertyPath: m_LocalRotation.x
      value: 0
      objectReference: {fileID: 0}
    - target: {fileID: 1379089672065969175, guid: ebe9744823fac8f4195efa8abf744f96, type: 3}
      propertyPath: m_LocalRotation.y
      value: -0
      objectReference: {fileID: 0}
    - target: {fileID: 1379089672065969175, guid: ebe9744823fac8f4195efa8abf744f96, type: 3}
      propertyPath: m_LocalRotation.z
      value: -0
      objectReference: {fileID: 0}
    - target: {fileID: 1379089672065969175, guid: ebe9744823fac8f4195efa8abf744f96, type: 3}
      propertyPath: m_LocalEulerAnglesHint.x
      value: 0
      objectReference: {fileID: 0}
    - target: {fileID: 1379089672065969175, guid: ebe9744823fac8f4195efa8abf744f96, type: 3}
      propertyPath: m_LocalEulerAnglesHint.y
      value: 0
      objectReference: {fileID: 0}
    - target: {fileID: 1379089672065969175, guid: ebe9744823fac8f4195efa8abf744f96, type: 3}
      propertyPath: m_LocalEulerAnglesHint.z
      value: 0
      objectReference: {fileID: 0}
    m_RemovedComponents: []
  m_SourcePrefab: {fileID: 100100000, guid: ebe9744823fac8f4195efa8abf744f96, type: 3}
