%YAML 1.1
%TAG !u! tag:unity3d.com,2011:
--- !u!114 &11400000
MonoBehaviour:
  m_ObjectHideFlags: 0
  m_CorrespondingSourceObject: {fileID: 0}
  m_PrefabInstance: {fileID: 0}
  m_PrefabAsset: {fileID: 0}
  m_GameObject: {fileID: 0}
  m_Enabled: 1
  m_EditorHideFlags: 0
  m_Script: {fileID: 11500000, guid: 4790ff51d2a03d648a01c7fd39d8557f, type: 3}
  m_Name: Glace
  m_EditorClassIdentifier: 
  model: {fileID: -6136534847587507396, guid: e3e86ad9f2ab4409b8b1b0d470139887, type: 3}
  puissance: 9
  range: 100
  animationIndex: 5
  timer: 3
  location: 3
  locationOnCible: 1
  type: 0
