%YAML 1.1
%TAG !u! tag:unity3d.com,2011:
--- !u!114 &11400000
MonoBehaviour:
  m_ObjectHideFlags: 0
  m_CorrespondingSourceObject: {fileID: 0}
  m_PrefabInstance: {fileID: 0}
  m_PrefabAsset: {fileID: 0}
  m_GameObject: {fileID: 0}
  m_Enabled: 1
  m_EditorHideFlags: 0
  m_Script: {fileID: 11500000, guid: 24c910f4f141bdb479bd87255f57c5a5, type: 3}
  m_Name: Dague 1
  m_EditorClassIdentifier: 
  model3D: {fileID: 100000, guid: 20bb5381b1fc6c941af19d9db9d03990, type: 3}
  puissance: 0
  logo: {fileID: 21300000, guid: 0b23dbd66374a1f49953bdb9053ebe11, type: 3}
  caracteristique:
    frc: 0
    def: 0
    prc: 0
    mag: 0
    esp: 0
    rap: 0
    cha: 0
