%YAML 1.1
%TAG !u! tag:unity3d.com,2011:
--- !u!114 &11400000
MonoBehaviour:
  m_ObjectHideFlags: 0
  m_CorrespondingSourceObject: {fileID: 0}
  m_PrefabInstance: {fileID: 0}
  m_PrefabAsset: {fileID: 0}
  m_GameObject: {fileID: 0}
  m_Enabled: 1
  m_EditorHideFlags: 0
  m_Script: {fileID: 11500000, guid: ccbb8a043e34b1840bad0d894cff6a9b, type: 3}
  m_Name: Marcus new
  m_EditorClassIdentifier: 
  portrait: {fileID: 21300000, guid: d2ff7b096ddc25743a648c74c21d3d3f, type: 3}
  hpMax: 10
  vitesse: 3
  basicSkill: {fileID: 11400000, guid: 811a9967af00ff142a1fbf7f2a93fac8, type: 2}
  comptences:
  - {fileID: 0}
  - {fileID: 0}
  - {fileID: 0}
  - {fileID: 0}
  - {fileID: 11400000, guid: 34cec264081e6a74f991dab63a537d7c, type: 2}
  - {fileID: 11400000, guid: d75718cc54d540e48b716b858cb99c22, type: 2}
  - {fileID: 11400000, guid: 97a50858052b36d4bae0a420cdeca70a, type: 2}
  - {fileID: 11400000, guid: 97a50858052b36d4bae0a420cdeca70a, type: 2}
  chanceAddCrystal: 100
  position: {x: 0, y: 0, z: 0}
