%YAML 1.1
%TAG !u! tag:unity3d.com,2011:
--- !u!114 &11400000
MonoBehaviour:
  m_ObjectHideFlags: 0
  m_CorrespondingSourceObject: {fileID: 0}
  m_PrefabInstance: {fileID: 0}
  m_PrefabAsset: {fileID: 0}
  m_GameObject: {fileID: 0}
  m_Enabled: 1
  m_EditorHideFlags: 0
  m_Script: {fileID: 11500000, guid: 24c910f4f141bdb479bd87255f57c5a5, type: 3}
  m_Name: Arc Samia 2
  m_EditorClassIdentifier: 
  model3D: {fileID: 538976622463122245, guid: 5f83f552b0292ec4fafcb611663129ad, type: 3}
  puissance: 0
  logo: {fileID: 21300000, guid: 9a654275a34dc6745a7fc7567a40180f, type: 3}
  caracteristique:
    frc: 0
    def: 0
    prc: 0
    mag: 0
    esp: 0
    rap: 0
    cha: 0
