%YAML 1.1
%TAG !u! tag:unity3d.com,2011:
--- !u!114 &11400000
MonoBehaviour:
  m_ObjectHideFlags: 0
  m_CorrespondingSourceObject: {fileID: 0}
  m_PrefabInstance: {fileID: 0}
  m_PrefabAsset: {fileID: 0}
  m_GameObject: {fileID: 0}
  m_Enabled: 1
  m_EditorHideFlags: 0
  m_Script: {fileID: 11500000, guid: 013d07cdf7c833c49b69018948758326, type: 3}
  m_Name: Enchantement Couleur
  m_EditorClassIdentifier: 
  description: Simple attack
  cout: 
  spawn: EnemyCentre
  element: 0
  cible: 0
  apparition: 0
  preAction: 0
  animationIndex: 0
  puissance: 10000
  time: 1
  timeForAppli: 50
  timeCanalisation: 1
  model: {fileID: 1026360332464090, guid: 66c7b695eb66e99438cf91d211df48b0, type: 3}
  cercle: {fileID: 1382430444795516, guid: 8566b13e2e01b0545a2c4fa5404849c1, type: 3}
  canalisation: {fileID: 1231247210357622, guid: 41cbce41e6100bd4795fcf7202869c8e, type: 3}
  animVariable: Enchant
  pointCible: Collision
  typeComptence: {fileID: 11400000, guid: e4b59a9093171dc408491179567ee6b8, type: 2}
  range: 1
  audio: {fileID: 0}
  aAfficher: 0
  canHit: 0
  attache: 0
  isCristalCompetence: 0
  strategie: {fileID: 11400000, guid: da68ecc46e0e1b744814391375409494, type: 2}
