%YAML 1.1
%TAG !u! tag:unity3d.com,2011:
--- !u!114 &11400000
MonoBehaviour:
  m_ObjectHideFlags: 0
  m_CorrespondingSourceObject: {fileID: 0}
  m_PrefabInstance: {fileID: 0}
  m_PrefabAsset: {fileID: 0}
  m_GameObject: {fileID: 0}
  m_Enabled: 1
  m_EditorHideFlags: 0
  m_Script: {fileID: 11500000, guid: c0228052401fa1d43a20bdf92cc1f335, type: 3}
  m_Name: CombatStage2
  m_EditorClassIdentifier: 
  enemys: {fileID: 7332051712760448377, guid: c377eb5e7c86f9742b9d3a849462c427, type: 3}
