%YAML 1.1
%TAG !u! tag:unity3d.com,2011:
--- !u!114 &1695496689844598111
MonoBehaviour:
  m_ObjectHideFlags: 0
  m_CorrespondingSourceObject: {fileID: 0}
  m_PrefabInstance: {fileID: 0}
  m_PrefabAsset: {fileID: 0}
  m_GameObject: {fileID: 8372087787389157884}
  m_Enabled: 1
  m_EditorHideFlags: 0
  m_Script: {fileID: 11500000, guid: f9a96120d34f46941854539a4b807dbe, type: 3}
  m_Name: 
  m_EditorClassIdentifier: 
  abilityNeeded: 2
  onTimeUse: 1
  animatorParameterName: 
--- !u!1001 &8370949684680905244
PrefabInstance:
  m_ObjectHideFlags: 0
  serializedVersion: 2
  m_Modification:
    m_TransformParent: {fileID: 0}
    m_Modifications:
    - target: {fileID: 1186507660809184, guid: 026953737093cf346b540fdbc2f8fc8f, type: 3}
      propertyPath: m_Name
      value: SM_Prop_Book_Stand_01_Interactable
      objectReference: {fileID: 0}
    - target: {fileID: 1186507660809184, guid: 026953737093cf346b540fdbc2f8fc8f, type: 3}
      propertyPath: m_Layer
      value: 7
      objectReference: {fileID: 0}
    - target: {fileID: 4878312952821094, guid: 026953737093cf346b540fdbc2f8fc8f, type: 3}
      propertyPath: m_RootOrder
      value: 0
      objectReference: {fileID: 0}
    - target: {fileID: 4878312952821094, guid: 026953737093cf346b540fdbc2f8fc8f, type: 3}
      propertyPath: m_LocalEulerAnglesHint.x
      value: 0
      objectReference: {fileID: 0}
    - target: {fileID: 4878312952821094, guid: 026953737093cf346b540fdbc2f8fc8f, type: 3}
      propertyPath: m_LocalEulerAnglesHint.y
      value: 0
      objectReference: {fileID: 0}
    - target: {fileID: 4878312952821094, guid: 026953737093cf346b540fdbc2f8fc8f, type: 3}
      propertyPath: m_LocalEulerAnglesHint.z
      value: 0
      objectReference: {fileID: 0}
    m_RemovedComponents: []
  m_SourcePrefab: {fileID: 100100000, guid: 026953737093cf346b540fdbc2f8fc8f, type: 3}
--- !u!1 &8372087787389157884 stripped
GameObject:
  m_CorrespondingSourceObject: {fileID: 1186507660809184, guid: 026953737093cf346b540fdbc2f8fc8f,
    type: 3}
  m_PrefabInstance: {fileID: 8370949684680905244}
  m_PrefabAsset: {fileID: 0}
