%YAML 1.1
%TAG !u! tag:unity3d.com,2011:
--- !u!114 &11400000
MonoBehaviour:
  m_ObjectHideFlags: 0
  m_CorrespondingSourceObject: {fileID: 0}
  m_PrefabInstance: {fileID: 0}
  m_PrefabAsset: {fileID: 0}
  m_GameObject: {fileID: 0}
  m_Enabled: 1
  m_EditorHideFlags: 0
  m_Script: {fileID: 11500000, guid: 90f1784acfb5ad545b8fc31eeaa6186f, type: 3}
  m_Name: Jurina
  m_EditorClassIdentifier: 
  firstName: Jurina
  lastName: 
  portrait: {fileID: 0}
  attributes:
    attributesValues: 
  classes: []
  weapon: {fileID: 0}
