%YAML 1.1
%TAG !u! tag:unity3d.com,2011:
--- !u!1001 &3593183720170185993
PrefabInstance:
  m_ObjectHideFlags: 0
  serializedVersion: 2
  m_Modification:
    m_TransformParent: {fileID: 0}
    m_Modifications:
    - target: {fileID: 631551870482616873, guid: f40889c3f475c9346b0322a0a653bfa6, type: 3}
      propertyPath: data
      value: 
      objectReference: {fileID: 11400000, guid: 2a0e06632d6778349be4b6bb78f09d6d, type: 2}
    - target: {fileID: 631551870482616873, guid: f40889c3f475c9346b0322a0a653bfa6, type: 3}
      propertyPath: ability
      value: 1
      objectReference: {fileID: 0}
    - target: {fileID: 6330202602622232692, guid: f40889c3f475c9346b0322a0a653bfa6, type: 3}
      propertyPath: m_RootOrder
      value: 2
      objectReference: {fileID: 0}
    - target: {fileID: 6811716872936499707, guid: f40889c3f475c9346b0322a0a653bfa6, type: 3}
      propertyPath: m_Avatar
      value: 
      objectReference: {fileID: 9000000, guid: e2958561779b1a748a4246b9d0c0b309, type: 3}
    - target: {fileID: 6811716872936499707, guid: f40889c3f475c9346b0322a0a653bfa6, type: 3}
      propertyPath: m_Controller
      value: 
      objectReference: {fileID: 9100000, guid: 153a11c01f8cd6a4bbf5b927e4f94622, type: 2}
    - target: {fileID: 6901906070166411905, guid: f40889c3f475c9346b0322a0a653bfa6, type: 3}
      propertyPath: m_RootOrder
      value: 0
      objectReference: {fileID: 0}
    - target: {fileID: 6901906070166411905, guid: f40889c3f475c9346b0322a0a653bfa6, type: 3}
      propertyPath: m_LocalEulerAnglesHint.x
      value: 0
      objectReference: {fileID: 0}
    - target: {fileID: 6901906070166411905, guid: f40889c3f475c9346b0322a0a653bfa6, type: 3}
      propertyPath: m_LocalEulerAnglesHint.y
      value: 0
      objectReference: {fileID: 0}
    - target: {fileID: 6901906070166411905, guid: f40889c3f475c9346b0322a0a653bfa6, type: 3}
      propertyPath: m_LocalEulerAnglesHint.z
      value: 0
      objectReference: {fileID: 0}
    - target: {fileID: 6908384765230746747, guid: f40889c3f475c9346b0322a0a653bfa6, type: 3}
      propertyPath: m_Name
      value: PlayableCharacter_Jiyeon
      objectReference: {fileID: 0}
    m_RemovedComponents: []
  m_SourcePrefab: {fileID: 100100000, guid: f40889c3f475c9346b0322a0a653bfa6, type: 3}
--- !u!4 &7932513012866645896 stripped
Transform:
  m_CorrespondingSourceObject: {fileID: 6901906070166411905, guid: f40889c3f475c9346b0322a0a653bfa6, type: 3}
  m_PrefabInstance: {fileID: 3593183720170185993}
  m_PrefabAsset: {fileID: 0}
--- !u!1001 &5882763070174074889
PrefabInstance:
  m_ObjectHideFlags: 0
  serializedVersion: 2
  m_Modification:
    m_TransformParent: {fileID: 7932513012866645896}
    m_Modifications:
    - target: {fileID: 158843290271935084, guid: cde794f39426fa740aa8cb74d3ab0fce, type: 3}
      propertyPath: m_RootOrder
      value: 1
      objectReference: {fileID: 0}
    - target: {fileID: 158843290271935084, guid: cde794f39426fa740aa8cb74d3ab0fce, type: 3}
      propertyPath: m_LocalPosition.x
      value: 0
      objectReference: {fileID: 0}
    - target: {fileID: 158843290271935084, guid: cde794f39426fa740aa8cb74d3ab0fce, type: 3}
      propertyPath: m_LocalPosition.y
      value: 0
      objectReference: {fileID: 0}
    - target: {fileID: 158843290271935084, guid: cde794f39426fa740aa8cb74d3ab0fce, type: 3}
      propertyPath: m_LocalPosition.z
      value: 0
      objectReference: {fileID: 0}
    - target: {fileID: 158843290271935084, guid: cde794f39426fa740aa8cb74d3ab0fce, type: 3}
      propertyPath: m_LocalRotation.w
      value: 1
      objectReference: {fileID: 0}
    - target: {fileID: 158843290271935084, guid: cde794f39426fa740aa8cb74d3ab0fce, type: 3}
      propertyPath: m_LocalRotation.x
      value: 0
      objectReference: {fileID: 0}
    - target: {fileID: 158843290271935084, guid: cde794f39426fa740aa8cb74d3ab0fce, type: 3}
      propertyPath: m_LocalRotation.y
      value: 0
      objectReference: {fileID: 0}
    - target: {fileID: 158843290271935084, guid: cde794f39426fa740aa8cb74d3ab0fce, type: 3}
      propertyPath: m_LocalRotation.z
      value: 0
      objectReference: {fileID: 0}
    - target: {fileID: 158843290271935084, guid: cde794f39426fa740aa8cb74d3ab0fce, type: 3}
      propertyPath: m_LocalEulerAnglesHint.x
      value: 0
      objectReference: {fileID: 0}
    - target: {fileID: 158843290271935084, guid: cde794f39426fa740aa8cb74d3ab0fce, type: 3}
      propertyPath: m_LocalEulerAnglesHint.y
      value: -0.93
      objectReference: {fileID: 0}
    - target: {fileID: 158843290271935084, guid: cde794f39426fa740aa8cb74d3ab0fce, type: 3}
      propertyPath: m_LocalEulerAnglesHint.z
      value: 0
      objectReference: {fileID: 0}
    - target: {fileID: 158843290271935085, guid: cde794f39426fa740aa8cb74d3ab0fce, type: 3}
      propertyPath: m_Name
      value: CharacterVisual_Jiyeon
      objectReference: {fileID: 0}
    m_RemovedComponents: []
  m_SourcePrefab: {fileID: 100100000, guid: cde794f39426fa740aa8cb74d3ab0fce, type: 3}
