%YAML 1.1
%TAG !u! tag:unity3d.com,2011:
--- !u!114 &11400000
MonoBehaviour:
  m_ObjectHideFlags: 0
  m_CorrespondingSourceObject: {fileID: 0}
  m_PrefabInstance: {fileID: 0}
  m_PrefabAsset: {fileID: 0}
  m_GameObject: {fileID: 0}
  m_Enabled: 1
  m_EditorHideFlags: 0
  m_Script: {fileID: 11500000, guid: 4790ff51d2a03d648a01c7fd39d8557f, type: 3}
  m_Name: Basic
  m_EditorClassIdentifier: 
  model: {fileID: -1565748349269748274, guid: 56fefed75af290a40bc24e32f8b91549, type: 3}
  puissance: 7
  range: 3
  animationIndex: 0
  timer: 3
  location: 0
  locationOnCible: 0
  type: 0
