%YAML 1.1
%TAG !u! tag:unity3d.com,2011:
--- !u!21 &2100000
Material:
  serializedVersion: 6
  m_ObjectHideFlags: 0
  m_CorrespondingSourceObject: {fileID: 0}
  m_PrefabInstance: {fileID: 0}
  m_PrefabAsset: {fileID: 0}
  m_Name: WaterSplashes2Add
  m_Shader: {fileID: 4800000, guid: e6ed112f94dfaa5499de6dbeb552865e, type: 3}
  m_ShaderKeywords: BlendAlpha Clip_OFF FrameBlend_OFF FresnelFade_OFF SoftParticles_ON
    USE_SOFT_PARTICLES VertLight4_ON _BLENDMODE_BLEND
  m_LightmapFlags: 5
  m_EnableInstancingVariants: 0
  m_DoubleSidedGI: 0
  m_CustomRenderQueue: -1
  stringTagMap: {}
  disabledShaderPasses: []
  m_SavedProperties:
    serializedVersion: 3
    m_TexEnvs:
    - _BumpMap:
        m_Texture: {fileID: 2800000, guid: 4fb80bc804baa8b4a84fca1b633c455a, type: 3}
        m_Scale: {x: 1, y: 1}
        m_Offset: {x: 0, y: 0}
    - _BumpTex:
        m_Texture: {fileID: 2800000, guid: d127f4969d85fae408d34b7acc9daf51, type: 3}
        m_Scale: {x: 1, y: 1}
        m_Offset: {x: 0, y: 0}
    - _ClipTex:
        m_Texture: {fileID: 0}
        m_Scale: {x: 1, y: 1}
        m_Offset: {x: 0, y: 0}
    - _Cube:
        m_Texture: {fileID: 8900000, guid: e20fe7ddd5bd687438b2ea6aac51b0b4, type: 2}
        m_Scale: {x: 1, y: 1}
        m_Offset: {x: 0, y: 0}
    - _CutoutTex:
        m_Texture: {fileID: 0}
        m_Scale: {x: 1, y: 1}
        m_Offset: {x: 0, y: 0}
    - _GlossMap:
        m_Texture: {fileID: 2800000, guid: 5cc28bceff05e1944836e09f360fb6c3, type: 3}
        m_Scale: {x: 1, y: 1}
        m_Offset: {x: 0, y: 0}
    - _HeightMap:
        m_Texture: {fileID: 2800000, guid: 5ce0fb0626efd844b9b45ec1091cf888, type: 3}
        m_Scale: {x: 1, y: 1}
        m_Offset: {x: 0, y: 0}
    - _HeightTex:
        m_Texture: {fileID: 0}
        m_Scale: {x: 1, y: 1}
        m_Offset: {x: 0, y: 0}
    - _MainTex:
        m_Texture: {fileID: 2800000, guid: cbfb3c6a631619e499e09a987f4664f9, type: 3}
        m_Scale: {x: 1, y: 1}
        m_Offset: {x: 0, y: 0}
    - _NoiseTex:
        m_Texture: {fileID: 0}
        m_Scale: {x: 1, y: 1}
        m_Offset: {x: 0, y: 0}
    - _NormalMap:
        m_Texture: {fileID: 0}
        m_Scale: {x: 1, y: 1}
        m_Offset: {x: 0, y: 0}
    - _NormalTex:
        m_Texture: {fileID: 0}
        m_Scale: {x: 1, y: 1}
        m_Offset: {x: 0, y: 0}
    - _ReflectionMap:
        m_Texture: {fileID: 2800000, guid: 5cc28bceff05e1944836e09f360fb6c3, type: 3}
        m_Scale: {x: 1, y: 1}
        m_Offset: {x: 0, y: 0}
    m_Floats:
    - CullMode: 2
    - DstMode: 10
    - SrcMode: 5
    - _AlphaClip: 10
    - _Amount: 0.5
    - _BlendMode: 1
    - _BumpAmt: 10000
    - _ColorIntensity: 1
    - _CubeMapOpacity: 0.14285715
    - _CullMode: 2
    - _Cutoff: 1
    - _Cutout: 0.2
    - _CutoutThreshold: 0.015
    - _Distortion: 100
    - _DstMode: 10
    - _FPOW: 1.4
    - _FresnelDistort: 1500
    - _FresnelFadeFactor: 3
    - _FresnelInvert: 1
    - _FresnelPow: 5
    - _FresnelR0: 0.04
    - _FresnelStr: 1
    - _Height: 0
    - _InvFade: 10
    - _IsDecalProjector: 0
    - _LightStr: 0.41071427
    - _OffsetHeightMap: 1
    - _OffsetXHeightMap: 0.064
    - _OffsetYHeightMap: 0
    - _Opacity: 0.6785714
    - _R0: -0.1
    - _ReflectionStrength: 20
    - _RefractiveStrength: -0.05
    - _RefractiveStrength2: 3.79
    - _RimPower: 8
    - _Shininess: 10.000001
    - _SrcMode: 5
    - _UseAlphaCliping: 0
    - _UseBlending: 0
    - _UseCutout: 0
    - _UseCutoutTex: 0
    - _UseCutoutThreshold: 0
    - _UseFrameBlending: 0
    - _UseFresnel: 0
    - _UseFresnelFading: 0
    - _UseHeight: 0
    - _UseMainTex: 0
    - _UseNoiseDistortion: 0
    - _UseParticlesAlphaCutout: 0
    - _UseRefractive: 0
    - _UseSoft: 1
    - _UseSoftCutout: 0
    - _UseSoftInverted: 0
    - _UseVertexStreamRandom: 0
    - _ZWriteMode: 0
    m_Colors:
    - _Color: {r: 1.0217128, g: 1.0641571, b: 1.0941176, a: 1}
    - _CutoutColor: {r: 1, g: 1, b: 1, a: 1}
    - _DistortionSpeedScale: {r: 1, g: -1, b: 0.15, a: 0.15}
    - _FresnelColor: {r: 0.5529412, g: 0.6262068, b: 0.8, a: 1}
    - _HeightUVScrollDistort: {r: 8, g: 12, b: 0, a: 0}
    - _MainColor: {r: 1, g: 1, b: 1, a: 1}
    - _ReflectColor: {r: 0.1454909, g: 0.14565384, b: 0.16911763, a: 1}
    - _RimColor: {r: 0.6729022, g: 0.7286853, b: 0.9338235, a: 1}
    - _SSSColor: {r: 0.98439384, g: 1.0928022, b: 1.4092375, a: 1}
    - _SpecColor: {r: 1, g: 1, b: 1, a: 1}
    - _Test: {r: 7, g: 8, b: 0, a: 1500}
    - _TintColor: {r: 0.625, g: 0.76724136, b: 1, a: 0.4}
    - _UVScrollFadeDistort: {r: 3, g: 6, b: 0, a: 1500}
  m_BuildTextureStacks: []
