%YAML 1.1
%TAG !u! tag:unity3d.com,2011:
--- !u!1001 &4763865949963733172
PrefabInstance:
  m_ObjectHideFlags: 0
  serializedVersion: 2
  m_Modification:
    m_TransformParent: {fileID: 0}
    m_Modifications:
    - target: {fileID: 198228, guid: ecfc727ab52f6f44da6c79e536989f0f, type: 3}
      propertyPath: m_Name
      value: SM_Prop_Torch_Ornate_02_Preset
      objectReference: {fileID: 0}
    - target: {fileID: 461032, guid: ecfc727ab52f6f44da6c79e536989f0f, type: 3}
      propertyPath: m_RootOrder
      value: 0
      objectReference: {fileID: 0}
    - target: {fileID: 461032, guid: ecfc727ab52f6f44da6c79e536989f0f, type: 3}
      propertyPath: m_LocalEulerAnglesHint.x
      value: 0
      objectReference: {fileID: 0}
    - target: {fileID: 461032, guid: ecfc727ab52f6f44da6c79e536989f0f, type: 3}
      propertyPath: m_LocalEulerAnglesHint.y
      value: 0
      objectReference: {fileID: 0}
    - target: {fileID: 461032, guid: ecfc727ab52f6f44da6c79e536989f0f, type: 3}
      propertyPath: m_LocalEulerAnglesHint.z
      value: 0
      objectReference: {fileID: 0}
    m_RemovedComponents: []
  m_SourcePrefab: {fileID: 100100000, guid: ecfc727ab52f6f44da6c79e536989f0f, type: 3}
--- !u!4 &4763865949963927644 stripped
Transform:
  m_CorrespondingSourceObject: {fileID: 461032, guid: ecfc727ab52f6f44da6c79e536989f0f,
    type: 3}
  m_PrefabInstance: {fileID: 4763865949963733172}
  m_PrefabAsset: {fileID: 0}
--- !u!1001 &4763865950070455235
PrefabInstance:
  m_ObjectHideFlags: 0
  serializedVersion: 2
  m_Modification:
    m_TransformParent: {fileID: 4763865949963927644}
    m_Modifications:
    - target: {fileID: 3202790327025558429, guid: b7a360774d936f3498c51138b251b8eb,
        type: 3}
      propertyPath: m_Version
      value: 11
      objectReference: {fileID: 0}
    - target: {fileID: 3202790327025558429, guid: b7a360774d936f3498c51138b251b8eb,
        type: 3}
      propertyPath: m_Intensity
      value: 10
      objectReference: {fileID: 0}
    - target: {fileID: 3202790327025558429, guid: b7a360774d936f3498c51138b251b8eb,
        type: 3}
      propertyPath: m_ShapeRadius
      value: 2
      objectReference: {fileID: 0}
    - target: {fileID: 6092645752422268716, guid: b7a360774d936f3498c51138b251b8eb,
        type: 3}
      propertyPath: m_RootOrder
      value: 1
      objectReference: {fileID: 0}
    - target: {fileID: 6092645752422268716, guid: b7a360774d936f3498c51138b251b8eb,
        type: 3}
      propertyPath: m_LocalPosition.x
      value: 0
      objectReference: {fileID: 0}
    - target: {fileID: 6092645752422268716, guid: b7a360774d936f3498c51138b251b8eb,
        type: 3}
      propertyPath: m_LocalPosition.y
      value: 0.6
      objectReference: {fileID: 0}
    - target: {fileID: 6092645752422268716, guid: b7a360774d936f3498c51138b251b8eb,
        type: 3}
      propertyPath: m_LocalPosition.z
      value: 0.45
      objectReference: {fileID: 0}
    - target: {fileID: 6092645752422268716, guid: b7a360774d936f3498c51138b251b8eb,
        type: 3}
      propertyPath: m_LocalEulerAnglesHint.x
      value: 0
      objectReference: {fileID: 0}
    - target: {fileID: 6092645752422268716, guid: b7a360774d936f3498c51138b251b8eb,
        type: 3}
      propertyPath: m_LocalEulerAnglesHint.y
      value: 0
      objectReference: {fileID: 0}
    - target: {fileID: 6092645752422268716, guid: b7a360774d936f3498c51138b251b8eb,
        type: 3}
      propertyPath: m_LocalEulerAnglesHint.z
      value: 0
      objectReference: {fileID: 0}
    - target: {fileID: 6092645752422268718, guid: b7a360774d936f3498c51138b251b8eb,
        type: 3}
      propertyPath: m_Range
      value: 5
      objectReference: {fileID: 0}
    - target: {fileID: 6092645752422268718, guid: b7a360774d936f3498c51138b251b8eb,
        type: 3}
      propertyPath: m_Intensity
      value: 128
      objectReference: {fileID: 0}
    - target: {fileID: 6092645752422268718, guid: b7a360774d936f3498c51138b251b8eb,
        type: 3}
      propertyPath: m_ShadowRadius
      value: 2
      objectReference: {fileID: 0}
    - target: {fileID: 6092645752422268718, guid: b7a360774d936f3498c51138b251b8eb,
        type: 3}
      propertyPath: m_BoundingSphereOverride.x
      value: 0
      objectReference: {fileID: 0}
    - target: {fileID: 6092645752422268718, guid: b7a360774d936f3498c51138b251b8eb,
        type: 3}
      propertyPath: m_BoundingSphereOverride.y
      value: 6.73e-43
      objectReference: {fileID: 0}
    - target: {fileID: 6092645752422268718, guid: b7a360774d936f3498c51138b251b8eb,
        type: 3}
      propertyPath: m_BoundingSphereOverride.z
      value: 0
      objectReference: {fileID: 0}
    m_RemovedComponents: []
  m_SourcePrefab: {fileID: 100100000, guid: b7a360774d936f3498c51138b251b8eb, type: 3}
--- !u!108 &1626305101124388077 stripped
Light:
  m_CorrespondingSourceObject: {fileID: 6092645752422268718, guid: b7a360774d936f3498c51138b251b8eb,
    type: 3}
  m_PrefabInstance: {fileID: 4763865950070455235}
  m_PrefabAsset: {fileID: 0}
--- !u!1001 &7877158529403277739
PrefabInstance:
  m_ObjectHideFlags: 0
  serializedVersion: 2
  m_Modification:
    m_TransformParent: {fileID: 4763865949963927644}
    m_Modifications:
    - target: {fileID: 1942473755166135778, guid: 25a0584006541e84bbb758f554f05bc6,
        type: 3}
      propertyPath: m_RootOrder
      value: 0
      objectReference: {fileID: 0}
    - target: {fileID: 1942473755166135778, guid: 25a0584006541e84bbb758f554f05bc6,
        type: 3}
      propertyPath: m_LocalPosition.x
      value: 0.039826337
      objectReference: {fileID: 0}
    - target: {fileID: 1942473755166135778, guid: 25a0584006541e84bbb758f554f05bc6,
        type: 3}
      propertyPath: m_LocalPosition.y
      value: 0.39226532
      objectReference: {fileID: 0}
    - target: {fileID: 1942473755166135778, guid: 25a0584006541e84bbb758f554f05bc6,
        type: 3}
      propertyPath: m_LocalPosition.z
      value: 0.43303677
      objectReference: {fileID: 0}
    - target: {fileID: 1942473755166135778, guid: 25a0584006541e84bbb758f554f05bc6,
        type: 3}
      propertyPath: m_LocalEulerAnglesHint.x
      value: 0
      objectReference: {fileID: 0}
    - target: {fileID: 1942473755166135778, guid: 25a0584006541e84bbb758f554f05bc6,
        type: 3}
      propertyPath: m_LocalEulerAnglesHint.y
      value: 0
      objectReference: {fileID: 0}
    - target: {fileID: 1942473755166135778, guid: 25a0584006541e84bbb758f554f05bc6,
        type: 3}
      propertyPath: m_LocalEulerAnglesHint.z
      value: 0
      objectReference: {fileID: 0}
    - target: {fileID: 1942473755179921228, guid: 25a0584006541e84bbb758f554f05bc6,
        type: 3}
      propertyPath: m_Materials.Array.size
      value: 1
      objectReference: {fileID: 0}
    - target: {fileID: 1942473755181428946, guid: 25a0584006541e84bbb758f554f05bc6,
        type: 3}
      propertyPath: LightsModule.light
      value: 
      objectReference: {fileID: 1626305101124388077}
    - target: {fileID: 1942473755181428946, guid: 25a0584006541e84bbb758f554f05bc6,
        type: 3}
      propertyPath: LightsModule.ratio
      value: 0.1
      objectReference: {fileID: 0}
    - target: {fileID: 1942473755181428946, guid: 25a0584006541e84bbb758f554f05bc6,
        type: 3}
      propertyPath: LightsModule.rangeCurve.scalar
      value: 0.1
      objectReference: {fileID: 0}
    - target: {fileID: 1942473755181428946, guid: 25a0584006541e84bbb758f554f05bc6,
        type: 3}
      propertyPath: LightsModule.randomDistribution
      value: 0
      objectReference: {fileID: 0}
    - target: {fileID: 1942473755181428946, guid: 25a0584006541e84bbb758f554f05bc6,
        type: 3}
      propertyPath: LightsModule.intensityCurve.scalar
      value: 0.1
      objectReference: {fileID: 0}
    m_RemovedComponents: []
  m_SourcePrefab: {fileID: 100100000, guid: 25a0584006541e84bbb758f554f05bc6, type: 3}
