%YAML 1.1
%TAG !u! tag:unity3d.com,2011:
--- !u!21 &2100000
Material:
  serializedVersion: 6
  m_ObjectHideFlags: 0
  m_CorrespondingSourceObject: {fileID: 0}
  m_PrefabInstance: {fileID: 0}
  m_PrefabAsset: {fileID: 0}
  m_Name: M_ky_thunder02
  m_Shader: {fileID: 4800000, guid: 0e751172f263744069ed6fb855da3cdf, type: 3}
  m_ShaderKeywords: _EMISSION _HAVEALPHA_ON
  m_LightmapFlags: 1
  m_EnableInstancingVariants: 0
  m_DoubleSidedGI: 0
  m_CustomRenderQueue: -1
  stringTagMap: {}
  disabledShaderPasses: []
  m_SavedProperties:
    serializedVersion: 3
    m_TexEnvs:
    - _BumpMap:
        m_Texture: {fileID: 0}
        m_Scale: {x: 1, y: 1}
        m_Offset: {x: 0, y: 0}
    - _DetailAlbedoMap:
        m_Texture: {fileID: 0}
        m_Scale: {x: 1, y: 1}
        m_Offset: {x: 0, y: 0}
    - _DetailMask:
        m_Texture: {fileID: 0}
        m_Scale: {x: 1, y: 1}
        m_Offset: {x: 0, y: 0}
    - _DetailNormalMap:
        m_Texture: {fileID: 0}
        m_Scale: {x: 1, y: 1}
        m_Offset: {x: 0, y: 0}
    - _EmissionMap:
        m_Texture: {fileID: 0}
        m_Scale: {x: 1, y: 1}
        m_Offset: {x: 0, y: 0}
    - _MainTex:
        m_Texture: {fileID: 2800000, guid: 8062eed8998884e93afb5b18cc856c73, type: 3}
        m_Scale: {x: 1, y: 1}
        m_Offset: {x: 0, y: 0}
    - _MetallicGlossMap:
        m_Texture: {fileID: 0}
        m_Scale: {x: 1, y: 1}
        m_Offset: {x: 0, y: 0}
    - _OcclusionMap:
        m_Texture: {fileID: 0}
        m_Scale: {x: 1, y: 1}
        m_Offset: {x: 0, y: 0}
    - _ParallaxMap:
        m_Texture: {fileID: 0}
        m_Scale: {x: 1, y: 1}
        m_Offset: {x: 0, y: 0}
    - _noseTex:
        m_Texture: {fileID: 2800000, guid: 5490211bd120a46aa9009b4de62dd44b, type: 3}
        m_Scale: {x: 2, y: 1}
        m_Offset: {x: 0, y: 0}
    - _texMask:
        m_Texture: {fileID: 2800000, guid: 00d1dc61304fe4183bb5dae9ee4dd842, type: 3}
        m_Scale: {x: 1, y: 1}
        m_Offset: {x: 0, y: 0}
    m_Floats:
    - _BumpScale: 1
    - _Cutoff: 0.5
    - _DetailNormalMapScale: 1
    - _DstBlend: 0
    - _GlossMapScale: 1
    - _Glossiness: 0.5
    - _GlossyReflections: 1
    - _Metallic: 0
    - _Mode: 0
    - _OcclusionStrength: 1
    - _Parallax: 0.02
    - _SmoothnessTextureChannel: 0
    - _SpecularHighlights: 1
    - _SrcBlend: 1
    - _UVSec: 0
    - _UVcompY: 1
    - _ZWrite: 1
    - _alphaDensity: 10
    - _alphaPower: 3
    - _baseTexDensity: 5
    - _baseTexSpdX: 0
    - _baseTexSpdY: 0
    - _baseTexU: 1
    - _baseTexV: 1
    - _compYInv: 0
    - _correctEmissive: 0
    - _depthBlend: 1
    - _emissive: 25
    - _haveAlpha: 1
    - _noiseDensity: 2
    - _noisePower: 5
    - _noiseTexSpdX: 1
    - _noiseTexSpdY: -2
    - _noiseTexU: 1
    - _noiseTexV: 1
    - _rotNoiseTex: 0
    - _simpleToon: 0
    - _texMaskDensity: 1.5
    - _texMaskPower: 2
    - _texPower: 8
    - _useDepthBlend: 0
    - _useTexColor: 0
    - _vertAlphaDensity: 2
    - _vertColorDensity: 1
    m_Colors:
    - _Color: {r: 1, g: 1, b: 1, a: 1}
    - _EmissionColor: {r: 0, g: 0, b: 0, a: 1}
