Wed Oct 21 17:53:52 2015, Generated by: 010328058, Server: None, Windows, INSTALLED_SOFTWARE_VERSION: 2015.07 Build 6, Engine: 2015.07rc1, GUI: 2015.07rc1
Copyright (c) 2000 - 2015 Signal Integrity Software, Inc.
FLEXlm license
 
Interface File C:\Myproject\265\interfaces\interface1\interface1.edk
Log File     waveform_analysis.log
 
Schematic Set: set1
Transfer Net                 States
sheet2                       default
 
 
Waveform analysis for Transfer Net sheet2
 
0 fatal waveform errors
0 waveform quality warnings
0 waveform overshoot warnings
 
 
Waveform Analysis Summary
 
	
0 errors analyzing waveforms
0 warnings analyzing waveforms
	
Job Concluded: Wed Oct 21 17:53:53 2015
Elapsed Time: 1 seconds
