{
  "file_generated_by": "FlutterFire CLI",
  "purpose": "FirebaseAppID & ProjectID for this Firebase app in this directory",
  "GOOGLE_APP_ID": "1:864434296528:ios:5388488a8bc805f0d8f0d5",
  "FIREBASE_PROJECT_ID": "fir-62a3b",
  "GCM_SENDER_ID": "864434296528"
}