%!PS-Adobe-3.0 EPSF-3.0
%%Creator: (MATLAB, The Mathworks, Inc. Version 9.6.0.1072779 \(R2019a\). Operating System: Windows 10)
%%Title: C:/Users/ngovinda/Documents/koopman-periodic-approximation/convergence.eps
%%CreationDate: 2020-04-22T20:22:59
%%Pages: (atend)
%%BoundingBox: 0 0 638 300
%%LanguageLevel: 3
%%EndComments
%%BeginProlog
%%BeginResource: procset (Apache XML Graphics Std ProcSet) 1.2 0
%%Version: 1.2 0
%%Copyright: (Copyright 2001-2003,2010 The Apache Software Foundation. License terms: http://www.apache.org/licenses/LICENSE-2.0)
/bd{bind def}bind def
/ld{load def}bd
/GR/grestore ld
/GS/gsave ld
/RM/rmoveto ld
/C/curveto ld
/t/show ld
/L/lineto ld
/ML/setmiterlimit ld
/CT/concat ld
/f/fill ld
/N/newpath ld
/S/stroke ld
/CC/setcmykcolor ld
/A/ashow ld
/cp/closepath ld
/RC/setrgbcolor ld
/LJ/setlinejoin ld
/GC/setgray ld
/LW/setlinewidth ld
/M/moveto ld
/re {4 2 roll M
1 index 0 rlineto
0 exch rlineto
neg 0 rlineto
cp } bd
/_ctm matrix def
/_tm matrix def
/BT { _ctm currentmatrix pop matrix _tm copy pop 0 0 moveto } bd
/ET { _ctm setmatrix } bd
/iTm { _ctm setmatrix _tm concat } bd
/Tm { _tm astore pop iTm 0 0 moveto } bd
/ux 0.0 def
/uy 0.0 def
/F {
  /Tp exch def
  /Tf exch def
  Tf findfont Tp scalefont setfont
  /cf Tf def  /cs Tp def
} bd
/ULS {currentpoint /uy exch def /ux exch def} bd
/ULE {
  /Tcx currentpoint pop def
  gsave
  newpath
  cf findfont cs scalefont dup
  /FontMatrix get 0 get /Ts exch def /FontInfo get dup
  /UnderlinePosition get Ts mul /To exch def
  /UnderlineThickness get Ts mul /Tt exch def
  ux uy To add moveto  Tcx uy To add lineto
  Tt setlinewidth stroke
  grestore
} bd
/OLE {
  /Tcx currentpoint pop def
  gsave
  newpath
  cf findfont cs scalefont dup
  /FontMatrix get 0 get /Ts exch def /FontInfo get dup
  /UnderlinePosition get Ts mul /To exch def
  /UnderlineThickness get Ts mul /Tt exch def
  ux uy To add cs add moveto Tcx uy To add cs add lineto
  Tt setlinewidth stroke
  grestore
} bd
/SOE {
  /Tcx currentpoint pop def
  gsave
  newpath
  cf findfont cs scalefont dup
  /FontMatrix get 0 get /Ts exch def /FontInfo get dup
  /UnderlinePosition get Ts mul /To exch def
  /UnderlineThickness get Ts mul /Tt exch def
  ux uy To add cs 10 mul 26 idiv add moveto Tcx uy To add cs 10 mul 26 idiv add lineto
  Tt setlinewidth stroke
  grestore
} bd
/QT {
/Y22 exch store
/X22 exch store
/Y21 exch store
/X21 exch store
currentpoint
/Y21 load 2 mul add 3 div exch
/X21 load 2 mul add 3 div exch
/X21 load 2 mul /X22 load add 3 div
/Y21 load 2 mul /Y22 load add 3 div
/X22 load /Y22 load curveto
} bd
/SSPD {
dup length /d exch dict def
{
/v exch def
/k exch def
currentpagedevice k known {
/cpdv currentpagedevice k get def
v cpdv ne {
/upd false def
/nullv v type /nulltype eq def
/nullcpdv cpdv type /nulltype eq def
nullv nullcpdv or
{
/upd true def
} {
/sametype v type cpdv type eq def
sametype {
v type /arraytype eq {
/vlen v length def
/cpdvlen cpdv length def
vlen cpdvlen eq {
0 1 vlen 1 sub {
/i exch def
/obj v i get def
/cpdobj cpdv i get def
obj cpdobj ne {
/upd true def
exit
} if
} for
} {
/upd true def
} ifelse
} {
v type /dicttype eq {
v {
/dv exch def
/dk exch def
/cpddv cpdv dk get def
dv cpddv ne {
/upd true def
exit
} if
} forall
} {
/upd true def
} ifelse
} ifelse
} if
} ifelse
upd true eq {
d k v put
} if
} if
} if
} forall
d length 0 gt {
d setpagedevice
} if
} bd
/RE { % /NewFontName [NewEncodingArray] /FontName RE -
  findfont dup length dict begin
  {
    1 index /FID ne
    {def} {pop pop} ifelse
  } forall
  /Encoding exch def
  /FontName 1 index def
  currentdict definefont pop
  end
} bind def
%%EndResource
%%BeginResource: procset (Apache XML Graphics EPS ProcSet) 1.0 0
%%Version: 1.0 0
%%Copyright: (Copyright 2002-2003 The Apache Software Foundation. License terms: http://www.apache.org/licenses/LICENSE-2.0)
/BeginEPSF { %def
/b4_Inc_state save def         % Save state for cleanup
/dict_count countdictstack def % Count objects on dict stack
/op_count count 1 sub def      % Count objects on operand stack
userdict begin                 % Push userdict on dict stack
/showpage { } def              % Redefine showpage, { } = null proc
0 setgray 0 setlinecap         % Prepare graphics state
1 setlinewidth 0 setlinejoin
10 setmiterlimit [ ] 0 setdash newpath
/languagelevel where           % If level not equal to 1 then
{pop languagelevel             % set strokeadjust and
1 ne                           % overprint to their defaults.
{false setstrokeadjust false setoverprint
} if
} if
} bd
/EndEPSF { %def
count op_count sub {pop} repeat            % Clean up stacks
countdictstack dict_count sub {end} repeat
b4_Inc_state restore
} bd
%%EndResource
%FOPBeginFontDict
%%IncludeResource: font Courier-Oblique
%%IncludeResource: font Courier-BoldOblique
%%IncludeResource: font Courier-Bold
%%IncludeResource: font ZapfDingbats
%%IncludeResource: font Symbol
%%IncludeResource: font Helvetica
%%IncludeResource: font Helvetica-Oblique
%%IncludeResource: font Helvetica-Bold
%%IncludeResource: font Helvetica-BoldOblique
%%IncludeResource: font Times-Roman
%%IncludeResource: font Times-Italic
%%IncludeResource: font Times-Bold
%%IncludeResource: font Times-BoldItalic
%%IncludeResource: font Courier
%FOPEndFontDict
%%BeginResource: encoding WinAnsiEncoding
/WinAnsiEncoding [
/.notdef /.notdef /.notdef /.notdef /.notdef
/.notdef /.notdef /.notdef /.notdef /.notdef
/.notdef /.notdef /.notdef /.notdef /.notdef
/.notdef /.notdef /.notdef /.notdef /.notdef
/.notdef /.notdef /.notdef /.notdef /.notdef
/.notdef /.notdef /.notdef /.notdef /.notdef
/.notdef /.notdef /space /exclam /quotedbl
/numbersign /dollar /percent /ampersand /quotesingle
/parenleft /parenright /asterisk /plus /comma
/hyphen /period /slash /zero /one
/two /three /four /five /six
/seven /eight /nine /colon /semicolon
/less /equal /greater /question /at
/A /B /C /D /E
/F /G /H /I /J
/K /L /M /N /O
/P /Q /R /S /T
/U /V /W /X /Y
/Z /bracketleft /backslash /bracketright /asciicircum
/underscore /quoteleft /a /b /c
/d /e /f /g /h
/i /j /k /l /m
/n /o /p /q /r
/s /t /u /v /w
/x /y /z /braceleft /bar
/braceright /asciitilde /bullet /Euro /bullet
/quotesinglbase /florin /quotedblbase /ellipsis /dagger
/daggerdbl /circumflex /perthousand /Scaron /guilsinglleft
/OE /bullet /Zcaron /bullet /bullet
/quoteleft /quoteright /quotedblleft /quotedblright /bullet
/endash /emdash /asciitilde /trademark /scaron
/guilsinglright /oe /bullet /zcaron /Ydieresis
/space /exclamdown /cent /sterling /currency
/yen /brokenbar /section /dieresis /copyright
/ordfeminine /guillemotleft /logicalnot /sfthyphen /registered
/macron /degree /plusminus /twosuperior /threesuperior
/acute /mu /paragraph /middot /cedilla
/onesuperior /ordmasculine /guillemotright /onequarter /onehalf
/threequarters /questiondown /Agrave /Aacute /Acircumflex
/Atilde /Adieresis /Aring /AE /Ccedilla
/Egrave /Eacute /Ecircumflex /Edieresis /Igrave
/Iacute /Icircumflex /Idieresis /Eth /Ntilde
/Ograve /Oacute /Ocircumflex /Otilde /Odieresis
/multiply /Oslash /Ugrave /Uacute /Ucircumflex
/Udieresis /Yacute /Thorn /germandbls /agrave
/aacute /acircumflex /atilde /adieresis /aring
/ae /ccedilla /egrave /eacute /ecircumflex
/edieresis /igrave /iacute /icircumflex /idieresis
/eth /ntilde /ograve /oacute /ocircumflex
/otilde /odieresis /divide /oslash /ugrave
/uacute /ucircumflex /udieresis /yacute /thorn
/ydieresis
] def
%%EndResource
%FOPBeginFontReencode
/Courier-Oblique findfont
dup length dict begin
  {1 index /FID ne {def} {pop pop} ifelse} forall
  /Encoding WinAnsiEncoding def
  currentdict
end
/Courier-Oblique exch definefont pop
/Courier-BoldOblique findfont
dup length dict begin
  {1 index /FID ne {def} {pop pop} ifelse} forall
  /Encoding WinAnsiEncoding def
  currentdict
end
/Courier-BoldOblique exch definefont pop
/Courier-Bold findfont
dup length dict begin
  {1 index /FID ne {def} {pop pop} ifelse} forall
  /Encoding WinAnsiEncoding def
  currentdict
end
/Courier-Bold exch definefont pop
/Helvetica findfont
dup length dict begin
  {1 index /FID ne {def} {pop pop} ifelse} forall
  /Encoding WinAnsiEncoding def
  currentdict
end
/Helvetica exch definefont pop
/Helvetica-Oblique findfont
dup length dict begin
  {1 index /FID ne {def} {pop pop} ifelse} forall
  /Encoding WinAnsiEncoding def
  currentdict
end
/Helvetica-Oblique exch definefont pop
/Helvetica-Bold findfont
dup length dict begin
  {1 index /FID ne {def} {pop pop} ifelse} forall
  /Encoding WinAnsiEncoding def
  currentdict
end
/Helvetica-Bold exch definefont pop
/Helvetica-BoldOblique findfont
dup length dict begin
  {1 index /FID ne {def} {pop pop} ifelse} forall
  /Encoding WinAnsiEncoding def
  currentdict
end
/Helvetica-BoldOblique exch definefont pop
/Times-Roman findfont
dup length dict begin
  {1 index /FID ne {def} {pop pop} ifelse} forall
  /Encoding WinAnsiEncoding def
  currentdict
end
/Times-Roman exch definefont pop
/Times-Italic findfont
dup length dict begin
  {1 index /FID ne {def} {pop pop} ifelse} forall
  /Encoding WinAnsiEncoding def
  currentdict
end
/Times-Italic exch definefont pop
/Times-Bold findfont
dup length dict begin
  {1 index /FID ne {def} {pop pop} ifelse} forall
  /Encoding WinAnsiEncoding def
  currentdict
end
/Times-Bold exch definefont pop
/Times-BoldItalic findfont
dup length dict begin
  {1 index /FID ne {def} {pop pop} ifelse} forall
  /Encoding WinAnsiEncoding def
  currentdict
end
/Times-BoldItalic exch definefont pop
/Courier findfont
dup length dict begin
  {1 index /FID ne {def} {pop pop} ifelse} forall
  /Encoding WinAnsiEncoding def
  currentdict
end
/Courier exch definefont pop
%FOPEndFontReencode
%%EndProlog
%%Page: 1 1
%%PageBoundingBox: 0 0 638 300
%%BeginPageSetup
[1 0 0 -1 0 300] CT
%%EndPageSetup
GS
[0.5 0 0 0.5 0 0] CT
1 GC
N
0 0 1275 600 re
f
GR
GS
[0.5 0 0 0.5 0 0] CT
1 GC
N
0 0 1275 600 re
f
GR
GS
[0.5 0 0 0.5 0 0] CT
1 GC
N
166 519 M
1154 519 L
1154 45 L
166 45 L
cp
f
GR
GS
[0.5 0 0 0.5 0 0] CT
0.149 GC
2 setlinecap
1 LJ
N
166 519 M
1154 519 L
S
GR
GS
[0.5 0 0 0.5 0 0] CT
0.149 GC
2 setlinecap
1 LJ
N
166 45 M
1154 45 L
S
GR
GS
[0.5 0 0 0.5 0 0] CT
0.149 GC
2 setlinecap
1 LJ
N
166 519 M
166 509.12 L
S
GR
GS
[0.5 0 0 0.5 0 0] CT
0.149 GC
2 setlinecap
1 LJ
N
264.8 519 M
264.8 509.12 L
S
GR
GS
[0.5 0 0 0.5 0 0] CT
0.149 GC
2 setlinecap
1 LJ
N
363.6 519 M
363.6 509.12 L
S
GR
GS
[0.5 0 0 0.5 0 0] CT
0.149 GC
2 setlinecap
1 LJ
N
462.4 519 M
462.4 509.12 L
S
GR
GS
[0.5 0 0 0.5 0 0] CT
0.149 GC
2 setlinecap
1 LJ
N
561.2 519 M
561.2 509.12 L
S
GR
GS
[0.5 0 0 0.5 0 0] CT
0.149 GC
2 setlinecap
1 LJ
N
660 519 M
660 509.12 L
S
GR
GS
[0.5 0 0 0.5 0 0] CT
0.149 GC
2 setlinecap
1 LJ
N
758.8 519 M
758.8 509.12 L
S
GR
GS
[0.5 0 0 0.5 0 0] CT
0.149 GC
2 setlinecap
1 LJ
N
857.6 519 M
857.6 509.12 L
S
GR
GS
[0.5 0 0 0.5 0 0] CT
0.149 GC
2 setlinecap
1 LJ
N
956.4 519 M
956.4 509.12 L
S
GR
GS
[0.5 0 0 0.5 0 0] CT
0.149 GC
2 setlinecap
1 LJ
N
1055.2 519 M
1055.2 509.12 L
S
GR
GS
[0.5 0 0 0.5 0 0] CT
0.149 GC
2 setlinecap
1 LJ
N
1154 519 M
1154 509.12 L
S
GR
GS
[0.5 0 0 0.5 0 0] CT
0.149 GC
2 setlinecap
1 LJ
N
166 45 M
166 54.88 L
S
GR
GS
[0.5 0 0 0.5 0 0] CT
0.149 GC
2 setlinecap
1 LJ
N
264.8 45 M
264.8 54.88 L
S
GR
GS
[0.5 0 0 0.5 0 0] CT
0.149 GC
2 setlinecap
1 LJ
N
363.6 45 M
363.6 54.88 L
S
GR
GS
[0.5 0 0 0.5 0 0] CT
0.149 GC
2 setlinecap
1 LJ
N
462.4 45 M
462.4 54.88 L
S
GR
GS
[0.5 0 0 0.5 0 0] CT
0.149 GC
2 setlinecap
1 LJ
N
561.2 45 M
561.2 54.88 L
S
GR
GS
[0.5 0 0 0.5 0 0] CT
0.149 GC
2 setlinecap
1 LJ
N
660 45 M
660 54.88 L
S
GR
GS
[0.5 0 0 0.5 0 0] CT
0.149 GC
2 setlinecap
1 LJ
N
758.8 45 M
758.8 54.88 L
S
GR
GS
[0.5 0 0 0.5 0 0] CT
0.149 GC
2 setlinecap
1 LJ
N
857.6 45 M
857.6 54.88 L
S
GR
GS
[0.5 0 0 0.5 0 0] CT
0.149 GC
2 setlinecap
1 LJ
N
956.4 45 M
956.4 54.88 L
S
GR
GS
[0.5 0 0 0.5 0 0] CT
0.149 GC
2 setlinecap
1 LJ
N
1055.2 45 M
1055.2 54.88 L
S
GR
GS
[0.5 0 0 0.5 0 0] CT
0.149 GC
2 setlinecap
1 LJ
N
1154 45 M
1154 54.88 L
S
GR
GS
[0.5 0 0 0.5 83 263.5] CT
0.149 GC
/Helvetica 20 F
GS
[1 0 0 1 0 0] CT
-6 21 moveto 
1 -1 scale
(0) t 
GR
GR
GS
[0.5 0 0 0.5 132.39999 263.5] CT
0.149 GC
/Helvetica 20 F
GS
[1 0 0 1 0 0] CT
-6 21 moveto 
1 -1 scale
(1) t 
GR
GR
GS
[0.5 0 0 0.5 181.8 263.5] CT
0.149 GC
/Helvetica 20 F
GS
[1 0 0 1 0 0] CT
-6 21 moveto 
1 -1 scale
(2) t 
GR
GR
GS
[0.5 0 0 0.5 231.20001 263.5] CT
0.149 GC
/Helvetica 20 F
GS
[1 0 0 1 0 0] CT
-6 21 moveto 
1 -1 scale
(3) t 
GR
GR
GS
[0.5 0 0 0.5 280.60001 263.5] CT
0.149 GC
/Helvetica 20 F
GS
[1 0 0 1 0 0] CT
-6 21 moveto 
1 -1 scale
(4) t 
GR
GR
GS
[0.5 0 0 0.5 330 263.5] CT
0.149 GC
/Helvetica 20 F
GS
[1 0 0 1 0 0] CT
-6 21 moveto 
1 -1 scale
(5) t 
GR
GR
GS
[0.5 0 0 0.5 379.40002 263.5] CT
0.149 GC
/Helvetica 20 F
GS
[1 0 0 1 0 0] CT
-6 21 moveto 
1 -1 scale
(6) t 
GR
GR
GS
[0.5 0 0 0.5 428.79999 263.5] CT
0.149 GC
/Helvetica 20 F
GS
[1 0 0 1 0 0] CT
-6 21 moveto 
1 -1 scale
(7) t 
GR
GR
GS
[0.5 0 0 0.5 478.20001 263.5] CT
0.149 GC
/Helvetica 20 F
GS
[1 0 0 1 0 0] CT
-6 21 moveto 
1 -1 scale
(8) t 
GR
GR
GS
[0.5 0 0 0.5 527.59998 263.5] CT
0.149 GC
/Helvetica 20 F
GS
[1 0 0 1 0 0] CT
-6 21 moveto 
1 -1 scale
(9) t 
GR
GR
GS
[0.5 0 0 0.5 577 263.5] CT
0.149 GC
/Helvetica 20 F
GS
[1 0 0 1 0 0] CT
-11.5 21 moveto 
1 -1 scale
(10) t 
GR
GR
GS
[0.5 0 0 0.5 324 296] CT
0.149 GC
N
4.359 0.406 M
2.328 0.406 1.422 -1.086 QT
0.516 -2.578 0.516 -4.75 QT
0.516 -6.172 0.766 -7.531 QT
1.016 -8.891 1.539 -10.289 QT
2.063 -11.688 2.727 -12.914 QT
3.391 -14.141 4.219 -15.297 QT
4.375 -15.516 4.641 -15.516 QT
4.875 -15.516 5.016 -15.375 QT
5.156 -15.234 5.156 -15.047 QT
5.156 -14.859 5.047 -14.703 QT
1.766 -10.172 1.766 -6.359 QT
1.766 -4.719 2.523 -3.531 QT
3.281 -2.344 4.859 -2.344 QT
6.203 -2.344 7.359 -3.133 QT
8.516 -3.922 9.359 -5.156 QT
9.359 -5.781 9.578 -7.117 QT
9.797 -8.453 10.258 -9.5 QT
10.719 -10.547 11.375 -10.547 QT
12.203 -10.547 12.203 -9.578 QT
12.203 -9.016 11.961 -8.164 QT
11.719 -7.313 11.43 -6.578 QT
11.141 -5.844 10.719 -4.906 QT
11.141 -2.344 13.297 -2.344 QT
14.531 -2.344 15.789 -3.063 QT
17.047 -3.781 18.016 -4.953 QT
18.984 -6.125 19.539 -7.477 QT
20.094 -8.828 20.094 -10.031 QT
20.094 -11.125 19.75 -11.734 QT
19.406 -12.344 18.844 -13.008 QT
18.281 -13.672 18.281 -14.078 QT
18.281 -14.781 18.883 -15.359 QT
19.484 -15.938 20.156 -15.938 QT
21.047 -15.938 21.414 -15.141 QT
21.781 -14.344 21.781 -13.328 QT
21.781 -11.672 21.125 -9.156 QT
20.469 -6.641 19.625 -4.969 QT
18.453 -2.703 16.703 -1.148 QT
14.953 0.406 12.781 0.406 QT
11.391 0.406 10.539 -0.43 QT
9.688 -1.266 9.438 -2.703 QT
8.438 -1.281 7.156 -0.438 QT
5.875 0.406 4.359 0.406 QT
cp
f
GR
GS
[0.5 0 0 0.5 0 0] CT
0.149 GC
2 setlinecap
1 LJ
N
166 519 M
166 45 L
S
GR
GS
[0.5 0 0 0.5 0 0] CT
0.149 GC
2 setlinecap
1 LJ
N
1154 519 M
1154 45 L
S
GR
GS
[0.5 0 0 0.5 0 0] CT
0.149 GC
2 setlinecap
1 LJ
N
166 461.195 M
175.88 461.195 L
S
GR
GS
[0.5 0 0 0.5 0 0] CT
0.149 GC
2 setlinecap
1 LJ
N
166 371.043 M
175.88 371.043 L
S
GR
GS
[0.5 0 0 0.5 0 0] CT
0.149 GC
2 setlinecap
1 LJ
N
166 280.892 M
175.88 280.892 L
S
GR
GS
[0.5 0 0 0.5 0 0] CT
0.149 GC
2 setlinecap
1 LJ
N
166 190.74 M
175.88 190.74 L
S
GR
GS
[0.5 0 0 0.5 0 0] CT
0.149 GC
2 setlinecap
1 LJ
N
166 100.588 M
175.88 100.588 L
S
GR
GS
[0.5 0 0 0.5 0 0] CT
0.149 GC
2 setlinecap
1 LJ
N
1154 461.195 M
1144.12 461.195 L
S
GR
GS
[0.5 0 0 0.5 0 0] CT
0.149 GC
2 setlinecap
1 LJ
N
1154 371.043 M
1144.12 371.043 L
S
GR
GS
[0.5 0 0 0.5 0 0] CT
0.149 GC
2 setlinecap
1 LJ
N
1154 280.892 M
1144.12 280.892 L
S
GR
GS
[0.5 0 0 0.5 0 0] CT
0.149 GC
2 setlinecap
1 LJ
N
1154 190.74 M
1144.12 190.74 L
S
GR
GS
[0.5 0 0 0.5 0 0] CT
0.149 GC
2 setlinecap
1 LJ
N
1154 100.588 M
1144.12 100.588 L
S
GR
GS
[0.5 0 0 0.5 0 0] CT
0.149 GC
2 setlinecap
1 LJ
N
166 516.271 M
170.94 516.271 L
S
GR
GS
[0.5 0 0 0.5 0 0] CT
0.149 GC
2 setlinecap
1 LJ
N
166 513.253 M
170.94 513.253 L
S
GR
GS
[0.5 0 0 0.5 0 0] CT
0.149 GC
2 setlinecap
1 LJ
N
166 510.639 M
170.94 510.639 L
S
GR
GS
[0.5 0 0 0.5 0 0] CT
0.149 GC
2 setlinecap
1 LJ
N
166 508.333 M
170.94 508.333 L
S
GR
GS
[0.5 0 0 0.5 0 0] CT
0.149 GC
2 setlinecap
1 LJ
N
166 506.271 M
170.94 506.271 L
S
GR
GS
[0.5 0 0 0.5 0 0] CT
0.149 GC
2 setlinecap
1 LJ
N
166 492.702 M
170.94 492.702 L
S
GR
GS
[0.5 0 0 0.5 0 0] CT
0.149 GC
2 setlinecap
1 LJ
N
166 484.764 M
170.94 484.764 L
S
GR
GS
[0.5 0 0 0.5 0 0] CT
0.149 GC
2 setlinecap
1 LJ
N
166 479.132 M
170.94 479.132 L
S
GR
GS
[0.5 0 0 0.5 0 0] CT
0.149 GC
2 setlinecap
1 LJ
N
166 474.764 M
170.94 474.764 L
S
GR
GS
[0.5 0 0 0.5 0 0] CT
0.149 GC
2 setlinecap
1 LJ
N
166 471.195 M
170.94 471.195 L
S
GR
GS
[0.5 0 0 0.5 0 0] CT
0.149 GC
2 setlinecap
1 LJ
N
166 468.177 M
170.94 468.177 L
S
GR
GS
[0.5 0 0 0.5 0 0] CT
0.149 GC
2 setlinecap
1 LJ
N
166 465.563 M
170.94 465.563 L
S
GR
GS
[0.5 0 0 0.5 0 0] CT
0.149 GC
2 setlinecap
1 LJ
N
166 463.258 M
170.94 463.258 L
S
GR
GS
[0.5 0 0 0.5 0 0] CT
0.149 GC
2 setlinecap
1 LJ
N
166 461.195 M
170.94 461.195 L
S
GR
GS
[0.5 0 0 0.5 0 0] CT
0.149 GC
2 setlinecap
1 LJ
N
166 447.626 M
170.94 447.626 L
S
GR
GS
[0.5 0 0 0.5 0 0] CT
0.149 GC
2 setlinecap
1 LJ
N
166 439.688 M
170.94 439.688 L
S
GR
GS
[0.5 0 0 0.5 0 0] CT
0.149 GC
2 setlinecap
1 LJ
N
166 434.057 M
170.94 434.057 L
S
GR
GS
[0.5 0 0 0.5 0 0] CT
0.149 GC
2 setlinecap
1 LJ
N
166 429.688 M
170.94 429.688 L
S
GR
GS
[0.5 0 0 0.5 0 0] CT
0.149 GC
2 setlinecap
1 LJ
N
166 426.119 M
170.94 426.119 L
S
GR
GS
[0.5 0 0 0.5 0 0] CT
0.149 GC
2 setlinecap
1 LJ
N
166 423.101 M
170.94 423.101 L
S
GR
GS
[0.5 0 0 0.5 0 0] CT
0.149 GC
2 setlinecap
1 LJ
N
166 420.487 M
170.94 420.487 L
S
GR
GS
[0.5 0 0 0.5 0 0] CT
0.149 GC
2 setlinecap
1 LJ
N
166 418.182 M
170.94 418.182 L
S
GR
GS
[0.5 0 0 0.5 0 0] CT
0.149 GC
2 setlinecap
1 LJ
N
166 416.119 M
170.94 416.119 L
S
GR
GS
[0.5 0 0 0.5 0 0] CT
0.149 GC
2 setlinecap
1 LJ
N
166 402.55 M
170.94 402.55 L
S
GR
GS
[0.5 0 0 0.5 0 0] CT
0.149 GC
2 setlinecap
1 LJ
N
166 394.612 M
170.94 394.612 L
S
GR
GS
[0.5 0 0 0.5 0 0] CT
0.149 GC
2 setlinecap
1 LJ
N
166 388.981 M
170.94 388.981 L
S
GR
GS
[0.5 0 0 0.5 0 0] CT
0.149 GC
2 setlinecap
1 LJ
N
166 384.612 M
170.94 384.612 L
S
GR
GS
[0.5 0 0 0.5 0 0] CT
0.149 GC
2 setlinecap
1 LJ
N
166 381.043 M
170.94 381.043 L
S
GR
GS
[0.5 0 0 0.5 0 0] CT
0.149 GC
2 setlinecap
1 LJ
N
166 378.026 M
170.94 378.026 L
S
GR
GS
[0.5 0 0 0.5 0 0] CT
0.149 GC
2 setlinecap
1 LJ
N
166 375.412 M
170.94 375.412 L
S
GR
GS
[0.5 0 0 0.5 0 0] CT
0.149 GC
2 setlinecap
1 LJ
N
166 373.106 M
170.94 373.106 L
S
GR
GS
[0.5 0 0 0.5 0 0] CT
0.149 GC
2 setlinecap
1 LJ
N
166 371.043 M
170.94 371.043 L
S
GR
GS
[0.5 0 0 0.5 0 0] CT
0.149 GC
2 setlinecap
1 LJ
N
166 357.474 M
170.94 357.474 L
S
GR
GS
[0.5 0 0 0.5 0 0] CT
0.149 GC
2 setlinecap
1 LJ
N
166 349.537 M
170.94 349.537 L
S
GR
GS
[0.5 0 0 0.5 0 0] CT
0.149 GC
2 setlinecap
1 LJ
N
166 343.905 M
170.94 343.905 L
S
GR
GS
[0.5 0 0 0.5 0 0] CT
0.149 GC
2 setlinecap
1 LJ
N
166 339.537 M
170.94 339.537 L
S
GR
GS
[0.5 0 0 0.5 0 0] CT
0.149 GC
2 setlinecap
1 LJ
N
166 335.967 M
170.94 335.967 L
S
GR
GS
[0.5 0 0 0.5 0 0] CT
0.149 GC
2 setlinecap
1 LJ
N
166 332.95 M
170.94 332.95 L
S
GR
GS
[0.5 0 0 0.5 0 0] CT
0.149 GC
2 setlinecap
1 LJ
N
166 330.336 M
170.94 330.336 L
S
GR
GS
[0.5 0 0 0.5 0 0] CT
0.149 GC
2 setlinecap
1 LJ
N
166 328.03 M
170.94 328.03 L
S
GR
GS
[0.5 0 0 0.5 0 0] CT
0.149 GC
2 setlinecap
1 LJ
N
166 325.967 M
170.94 325.967 L
S
GR
GS
[0.5 0 0 0.5 0 0] CT
0.149 GC
2 setlinecap
1 LJ
N
166 312.398 M
170.94 312.398 L
S
GR
GS
[0.5 0 0 0.5 0 0] CT
0.149 GC
2 setlinecap
1 LJ
N
166 304.461 M
170.94 304.461 L
S
GR
GS
[0.5 0 0 0.5 0 0] CT
0.149 GC
2 setlinecap
1 LJ
N
166 298.829 M
170.94 298.829 L
S
GR
GS
[0.5 0 0 0.5 0 0] CT
0.149 GC
2 setlinecap
1 LJ
N
166 294.461 M
170.94 294.461 L
S
GR
GS
[0.5 0 0 0.5 0 0] CT
0.149 GC
2 setlinecap
1 LJ
N
166 290.892 M
170.94 290.892 L
S
GR
GS
[0.5 0 0 0.5 0 0] CT
0.149 GC
2 setlinecap
1 LJ
N
166 287.874 M
170.94 287.874 L
S
GR
GS
[0.5 0 0 0.5 0 0] CT
0.149 GC
2 setlinecap
1 LJ
N
166 285.26 M
170.94 285.26 L
S
GR
GS
[0.5 0 0 0.5 0 0] CT
0.149 GC
2 setlinecap
1 LJ
N
166 282.954 M
170.94 282.954 L
S
GR
GS
[0.5 0 0 0.5 0 0] CT
0.149 GC
2 setlinecap
1 LJ
N
166 280.892 M
170.94 280.892 L
S
GR
GS
[0.5 0 0 0.5 0 0] CT
0.149 GC
2 setlinecap
1 LJ
N
166 267.322 M
170.94 267.322 L
S
GR
GS
[0.5 0 0 0.5 0 0] CT
0.149 GC
2 setlinecap
1 LJ
N
166 259.385 M
170.94 259.385 L
S
GR
GS
[0.5 0 0 0.5 0 0] CT
0.149 GC
2 setlinecap
1 LJ
N
166 253.753 M
170.94 253.753 L
S
GR
GS
[0.5 0 0 0.5 0 0] CT
0.149 GC
2 setlinecap
1 LJ
N
166 249.385 M
170.94 249.385 L
S
GR
GS
[0.5 0 0 0.5 0 0] CT
0.149 GC
2 setlinecap
1 LJ
N
166 245.816 M
170.94 245.816 L
S
GR
GS
[0.5 0 0 0.5 0 0] CT
0.149 GC
2 setlinecap
1 LJ
N
166 242.798 M
170.94 242.798 L
S
GR
GS
[0.5 0 0 0.5 0 0] CT
0.149 GC
2 setlinecap
1 LJ
N
166 240.184 M
170.94 240.184 L
S
GR
GS
[0.5 0 0 0.5 0 0] CT
0.149 GC
2 setlinecap
1 LJ
N
166 237.878 M
170.94 237.878 L
S
GR
GS
[0.5 0 0 0.5 0 0] CT
0.149 GC
2 setlinecap
1 LJ
N
166 235.816 M
170.94 235.816 L
S
GR
GS
[0.5 0 0 0.5 0 0] CT
0.149 GC
2 setlinecap
1 LJ
N
166 222.247 M
170.94 222.247 L
S
GR
GS
[0.5 0 0 0.5 0 0] CT
0.149 GC
2 setlinecap
1 LJ
N
166 214.309 M
170.94 214.309 L
S
GR
GS
[0.5 0 0 0.5 0 0] CT
0.149 GC
2 setlinecap
1 LJ
N
166 208.677 M
170.94 208.677 L
S
GR
GS
[0.5 0 0 0.5 0 0] CT
0.149 GC
2 setlinecap
1 LJ
N
166 204.309 M
170.94 204.309 L
S
GR
GS
[0.5 0 0 0.5 0 0] CT
0.149 GC
2 setlinecap
1 LJ
N
166 200.74 M
170.94 200.74 L
S
GR
GS
[0.5 0 0 0.5 0 0] CT
0.149 GC
2 setlinecap
1 LJ
N
166 197.722 M
170.94 197.722 L
S
GR
GS
[0.5 0 0 0.5 0 0] CT
0.149 GC
2 setlinecap
1 LJ
N
166 195.108 M
170.94 195.108 L
S
GR
GS
[0.5 0 0 0.5 0 0] CT
0.149 GC
2 setlinecap
1 LJ
N
166 192.803 M
170.94 192.803 L
S
GR
GS
[0.5 0 0 0.5 0 0] CT
0.149 GC
2 setlinecap
1 LJ
N
166 190.74 M
170.94 190.74 L
S
GR
GS
[0.5 0 0 0.5 0 0] CT
0.149 GC
2 setlinecap
1 LJ
N
166 177.171 M
170.94 177.171 L
S
GR
GS
[0.5 0 0 0.5 0 0] CT
0.149 GC
2 setlinecap
1 LJ
N
166 169.233 M
170.94 169.233 L
S
GR
GS
[0.5 0 0 0.5 0 0] CT
0.149 GC
2 setlinecap
1 LJ
N
166 163.602 M
170.94 163.602 L
S
GR
GS
[0.5 0 0 0.5 0 0] CT
0.149 GC
2 setlinecap
1 LJ
N
166 159.233 M
170.94 159.233 L
S
GR
GS
[0.5 0 0 0.5 0 0] CT
0.149 GC
2 setlinecap
1 LJ
N
166 155.664 M
170.94 155.664 L
S
GR
GS
[0.5 0 0 0.5 0 0] CT
0.149 GC
2 setlinecap
1 LJ
N
166 152.647 M
170.94 152.647 L
S
GR
GS
[0.5 0 0 0.5 0 0] CT
0.149 GC
2 setlinecap
1 LJ
N
166 150.032 M
170.94 150.032 L
S
GR
GS
[0.5 0 0 0.5 0 0] CT
0.149 GC
2 setlinecap
1 LJ
N
166 147.727 M
170.94 147.727 L
S
GR
GS
[0.5 0 0 0.5 0 0] CT
0.149 GC
2 setlinecap
1 LJ
N
166 145.664 M
170.94 145.664 L
S
GR
GS
[0.5 0 0 0.5 0 0] CT
0.149 GC
2 setlinecap
1 LJ
N
166 132.095 M
170.94 132.095 L
S
GR
GS
[0.5 0 0 0.5 0 0] CT
0.149 GC
2 setlinecap
1 LJ
N
166 124.158 M
170.94 124.158 L
S
GR
GS
[0.5 0 0 0.5 0 0] CT
0.149 GC
2 setlinecap
1 LJ
N
166 118.526 M
170.94 118.526 L
S
GR
GS
[0.5 0 0 0.5 0 0] CT
0.149 GC
2 setlinecap
1 LJ
N
166 114.158 M
170.94 114.158 L
S
GR
GS
[0.5 0 0 0.5 0 0] CT
0.149 GC
2 setlinecap
1 LJ
N
166 110.588 M
170.94 110.588 L
S
GR
GS
[0.5 0 0 0.5 0 0] CT
0.149 GC
2 setlinecap
1 LJ
N
166 107.571 M
170.94 107.571 L
S
GR
GS
[0.5 0 0 0.5 0 0] CT
0.149 GC
2 setlinecap
1 LJ
N
166 104.957 M
170.94 104.957 L
S
GR
GS
[0.5 0 0 0.5 0 0] CT
0.149 GC
2 setlinecap
1 LJ
N
166 102.651 M
170.94 102.651 L
S
GR
GS
[0.5 0 0 0.5 0 0] CT
0.149 GC
2 setlinecap
1 LJ
N
166 100.588 M
170.94 100.588 L
S
GR
GS
[0.5 0 0 0.5 0 0] CT
0.149 GC
2 setlinecap
1 LJ
N
166 87.019 M
170.94 87.019 L
S
GR
GS
[0.5 0 0 0.5 0 0] CT
0.149 GC
2 setlinecap
1 LJ
N
166 79.082 M
170.94 79.082 L
S
GR
GS
[0.5 0 0 0.5 0 0] CT
0.149 GC
2 setlinecap
1 LJ
N
166 73.45 M
170.94 73.45 L
S
GR
GS
[0.5 0 0 0.5 0 0] CT
0.149 GC
2 setlinecap
1 LJ
N
166 69.082 M
170.94 69.082 L
S
GR
GS
[0.5 0 0 0.5 0 0] CT
0.149 GC
2 setlinecap
1 LJ
N
166 65.513 M
170.94 65.513 L
S
GR
GS
[0.5 0 0 0.5 0 0] CT
0.149 GC
2 setlinecap
1 LJ
N
166 62.495 M
170.94 62.495 L
S
GR
GS
[0.5 0 0 0.5 0 0] CT
0.149 GC
2 setlinecap
1 LJ
N
166 59.881 M
170.94 59.881 L
S
GR
GS
[0.5 0 0 0.5 0 0] CT
0.149 GC
2 setlinecap
1 LJ
N
166 57.575 M
170.94 57.575 L
S
GR
GS
[0.5 0 0 0.5 0 0] CT
0.149 GC
2 setlinecap
1 LJ
N
166 55.513 M
170.94 55.513 L
S
GR
GS
[0.5 0 0 0.5 0 0] CT
0.149 GC
2 setlinecap
1 LJ
N
1154 516.271 M
1149.06 516.271 L
S
GR
GS
[0.5 0 0 0.5 0 0] CT
0.149 GC
2 setlinecap
1 LJ
N
1154 513.253 M
1149.06 513.253 L
S
GR
GS
[0.5 0 0 0.5 0 0] CT
0.149 GC
2 setlinecap
1 LJ
N
1154 510.639 M
1149.06 510.639 L
S
GR
GS
[0.5 0 0 0.5 0 0] CT
0.149 GC
2 setlinecap
1 LJ
N
1154 508.333 M
1149.06 508.333 L
S
GR
GS
[0.5 0 0 0.5 0 0] CT
0.149 GC
2 setlinecap
1 LJ
N
1154 506.271 M
1149.06 506.271 L
S
GR
GS
[0.5 0 0 0.5 0 0] CT
0.149 GC
2 setlinecap
1 LJ
N
1154 492.702 M
1149.06 492.702 L
S
GR
GS
[0.5 0 0 0.5 0 0] CT
0.149 GC
2 setlinecap
1 LJ
N
1154 484.764 M
1149.06 484.764 L
S
GR
GS
[0.5 0 0 0.5 0 0] CT
0.149 GC
2 setlinecap
1 LJ
N
1154 479.132 M
1149.06 479.132 L
S
GR
GS
[0.5 0 0 0.5 0 0] CT
0.149 GC
2 setlinecap
1 LJ
N
1154 474.764 M
1149.06 474.764 L
S
GR
GS
[0.5 0 0 0.5 0 0] CT
0.149 GC
2 setlinecap
1 LJ
N
1154 471.195 M
1149.06 471.195 L
S
GR
GS
[0.5 0 0 0.5 0 0] CT
0.149 GC
2 setlinecap
1 LJ
N
1154 468.177 M
1149.06 468.177 L
S
GR
GS
[0.5 0 0 0.5 0 0] CT
0.149 GC
2 setlinecap
1 LJ
N
1154 465.563 M
1149.06 465.563 L
S
GR
GS
[0.5 0 0 0.5 0 0] CT
0.149 GC
2 setlinecap
1 LJ
N
1154 463.258 M
1149.06 463.258 L
S
GR
GS
[0.5 0 0 0.5 0 0] CT
0.149 GC
2 setlinecap
1 LJ
N
1154 461.195 M
1149.06 461.195 L
S
GR
GS
[0.5 0 0 0.5 0 0] CT
0.149 GC
2 setlinecap
1 LJ
N
1154 447.626 M
1149.06 447.626 L
S
GR
GS
[0.5 0 0 0.5 0 0] CT
0.149 GC
2 setlinecap
1 LJ
N
1154 439.688 M
1149.06 439.688 L
S
GR
GS
[0.5 0 0 0.5 0 0] CT
0.149 GC
2 setlinecap
1 LJ
N
1154 434.057 M
1149.06 434.057 L
S
GR
GS
[0.5 0 0 0.5 0 0] CT
0.149 GC
2 setlinecap
1 LJ
N
1154 429.688 M
1149.06 429.688 L
S
GR
GS
[0.5 0 0 0.5 0 0] CT
0.149 GC
2 setlinecap
1 LJ
N
1154 426.119 M
1149.06 426.119 L
S
GR
GS
[0.5 0 0 0.5 0 0] CT
0.149 GC
2 setlinecap
1 LJ
N
1154 423.101 M
1149.06 423.101 L
S
GR
GS
[0.5 0 0 0.5 0 0] CT
0.149 GC
2 setlinecap
1 LJ
N
1154 420.487 M
1149.06 420.487 L
S
GR
GS
[0.5 0 0 0.5 0 0] CT
0.149 GC
2 setlinecap
1 LJ
N
1154 418.182 M
1149.06 418.182 L
S
GR
GS
[0.5 0 0 0.5 0 0] CT
0.149 GC
2 setlinecap
1 LJ
N
1154 416.119 M
1149.06 416.119 L
S
GR
GS
[0.5 0 0 0.5 0 0] CT
0.149 GC
2 setlinecap
1 LJ
N
1154 402.55 M
1149.06 402.55 L
S
GR
GS
[0.5 0 0 0.5 0 0] CT
0.149 GC
2 setlinecap
1 LJ
N
1154 394.612 M
1149.06 394.612 L
S
GR
GS
[0.5 0 0 0.5 0 0] CT
0.149 GC
2 setlinecap
1 LJ
N
1154 388.981 M
1149.06 388.981 L
S
GR
GS
[0.5 0 0 0.5 0 0] CT
0.149 GC
2 setlinecap
1 LJ
N
1154 384.612 M
1149.06 384.612 L
S
GR
GS
[0.5 0 0 0.5 0 0] CT
0.149 GC
2 setlinecap
1 LJ
N
1154 381.043 M
1149.06 381.043 L
S
GR
GS
[0.5 0 0 0.5 0 0] CT
0.149 GC
2 setlinecap
1 LJ
N
1154 378.026 M
1149.06 378.026 L
S
GR
GS
[0.5 0 0 0.5 0 0] CT
0.149 GC
2 setlinecap
1 LJ
N
1154 375.412 M
1149.06 375.412 L
S
GR
GS
[0.5 0 0 0.5 0 0] CT
0.149 GC
2 setlinecap
1 LJ
N
1154 373.106 M
1149.06 373.106 L
S
GR
GS
[0.5 0 0 0.5 0 0] CT
0.149 GC
2 setlinecap
1 LJ
N
1154 371.043 M
1149.06 371.043 L
S
GR
GS
[0.5 0 0 0.5 0 0] CT
0.149 GC
2 setlinecap
1 LJ
N
1154 357.474 M
1149.06 357.474 L
S
GR
GS
[0.5 0 0 0.5 0 0] CT
0.149 GC
2 setlinecap
1 LJ
N
1154 349.537 M
1149.06 349.537 L
S
GR
GS
[0.5 0 0 0.5 0 0] CT
0.149 GC
2 setlinecap
1 LJ
N
1154 343.905 M
1149.06 343.905 L
S
GR
GS
[0.5 0 0 0.5 0 0] CT
0.149 GC
2 setlinecap
1 LJ
N
1154 339.537 M
1149.06 339.537 L
S
GR
GS
[0.5 0 0 0.5 0 0] CT
0.149 GC
2 setlinecap
1 LJ
N
1154 335.967 M
1149.06 335.967 L
S
GR
GS
[0.5 0 0 0.5 0 0] CT
0.149 GC
2 setlinecap
1 LJ
N
1154 332.95 M
1149.06 332.95 L
S
GR
GS
[0.5 0 0 0.5 0 0] CT
0.149 GC
2 setlinecap
1 LJ
N
1154 330.336 M
1149.06 330.336 L
S
GR
GS
[0.5 0 0 0.5 0 0] CT
0.149 GC
2 setlinecap
1 LJ
N
1154 328.03 M
1149.06 328.03 L
S
GR
GS
[0.5 0 0 0.5 0 0] CT
0.149 GC
2 setlinecap
1 LJ
N
1154 325.967 M
1149.06 325.967 L
S
GR
GS
[0.5 0 0 0.5 0 0] CT
0.149 GC
2 setlinecap
1 LJ
N
1154 312.398 M
1149.06 312.398 L
S
GR
GS
[0.5 0 0 0.5 0 0] CT
0.149 GC
2 setlinecap
1 LJ
N
1154 304.461 M
1149.06 304.461 L
S
GR
GS
[0.5 0 0 0.5 0 0] CT
0.149 GC
2 setlinecap
1 LJ
N
1154 298.829 M
1149.06 298.829 L
S
GR
GS
[0.5 0 0 0.5 0 0] CT
0.149 GC
2 setlinecap
1 LJ
N
1154 294.461 M
1149.06 294.461 L
S
GR
GS
[0.5 0 0 0.5 0 0] CT
0.149 GC
2 setlinecap
1 LJ
N
1154 290.892 M
1149.06 290.892 L
S
GR
GS
[0.5 0 0 0.5 0 0] CT
0.149 GC
2 setlinecap
1 LJ
N
1154 287.874 M
1149.06 287.874 L
S
GR
GS
[0.5 0 0 0.5 0 0] CT
0.149 GC
2 setlinecap
1 LJ
N
1154 285.26 M
1149.06 285.26 L
S
GR
GS
[0.5 0 0 0.5 0 0] CT
0.149 GC
2 setlinecap
1 LJ
N
1154 282.954 M
1149.06 282.954 L
S
GR
GS
[0.5 0 0 0.5 0 0] CT
0.149 GC
2 setlinecap
1 LJ
N
1154 280.892 M
1149.06 280.892 L
S
GR
GS
[0.5 0 0 0.5 0 0] CT
0.149 GC
2 setlinecap
1 LJ
N
1154 267.322 M
1149.06 267.322 L
S
GR
GS
[0.5 0 0 0.5 0 0] CT
0.149 GC
2 setlinecap
1 LJ
N
1154 259.385 M
1149.06 259.385 L
S
GR
GS
[0.5 0 0 0.5 0 0] CT
0.149 GC
2 setlinecap
1 LJ
N
1154 253.753 M
1149.06 253.753 L
S
GR
GS
[0.5 0 0 0.5 0 0] CT
0.149 GC
2 setlinecap
1 LJ
N
1154 249.385 M
1149.06 249.385 L
S
GR
GS
[0.5 0 0 0.5 0 0] CT
0.149 GC
2 setlinecap
1 LJ
N
1154 245.816 M
1149.06 245.816 L
S
GR
GS
[0.5 0 0 0.5 0 0] CT
0.149 GC
2 setlinecap
1 LJ
N
1154 242.798 M
1149.06 242.798 L
S
GR
GS
[0.5 0 0 0.5 0 0] CT
0.149 GC
2 setlinecap
1 LJ
N
1154 240.184 M
1149.06 240.184 L
S
GR
GS
[0.5 0 0 0.5 0 0] CT
0.149 GC
2 setlinecap
1 LJ
N
1154 237.878 M
1149.06 237.878 L
S
GR
GS
[0.5 0 0 0.5 0 0] CT
0.149 GC
2 setlinecap
1 LJ
N
1154 235.816 M
1149.06 235.816 L
S
GR
GS
[0.5 0 0 0.5 0 0] CT
0.149 GC
2 setlinecap
1 LJ
N
1154 222.247 M
1149.06 222.247 L
S
GR
GS
[0.5 0 0 0.5 0 0] CT
0.149 GC
2 setlinecap
1 LJ
N
1154 214.309 M
1149.06 214.309 L
S
GR
GS
[0.5 0 0 0.5 0 0] CT
0.149 GC
2 setlinecap
1 LJ
N
1154 208.677 M
1149.06 208.677 L
S
GR
GS
[0.5 0 0 0.5 0 0] CT
0.149 GC
2 setlinecap
1 LJ
N
1154 204.309 M
1149.06 204.309 L
S
GR
GS
[0.5 0 0 0.5 0 0] CT
0.149 GC
2 setlinecap
1 LJ
N
1154 200.74 M
1149.06 200.74 L
S
GR
GS
[0.5 0 0 0.5 0 0] CT
0.149 GC
2 setlinecap
1 LJ
N
1154 197.722 M
1149.06 197.722 L
S
GR
GS
[0.5 0 0 0.5 0 0] CT
0.149 GC
2 setlinecap
1 LJ
N
1154 195.108 M
1149.06 195.108 L
S
GR
GS
[0.5 0 0 0.5 0 0] CT
0.149 GC
2 setlinecap
1 LJ
N
1154 192.803 M
1149.06 192.803 L
S
GR
GS
[0.5 0 0 0.5 0 0] CT
0.149 GC
2 setlinecap
1 LJ
N
1154 190.74 M
1149.06 190.74 L
S
GR
GS
[0.5 0 0 0.5 0 0] CT
0.149 GC
2 setlinecap
1 LJ
N
1154 177.171 M
1149.06 177.171 L
S
GR
GS
[0.5 0 0 0.5 0 0] CT
0.149 GC
2 setlinecap
1 LJ
N
1154 169.233 M
1149.06 169.233 L
S
GR
GS
[0.5 0 0 0.5 0 0] CT
0.149 GC
2 setlinecap
1 LJ
N
1154 163.602 M
1149.06 163.602 L
S
GR
GS
[0.5 0 0 0.5 0 0] CT
0.149 GC
2 setlinecap
1 LJ
N
1154 159.233 M
1149.06 159.233 L
S
GR
GS
[0.5 0 0 0.5 0 0] CT
0.149 GC
2 setlinecap
1 LJ
N
1154 155.664 M
1149.06 155.664 L
S
GR
GS
[0.5 0 0 0.5 0 0] CT
0.149 GC
2 setlinecap
1 LJ
N
1154 152.647 M
1149.06 152.647 L
S
GR
GS
[0.5 0 0 0.5 0 0] CT
0.149 GC
2 setlinecap
1 LJ
N
1154 150.032 M
1149.06 150.032 L
S
GR
GS
[0.5 0 0 0.5 0 0] CT
0.149 GC
2 setlinecap
1 LJ
N
1154 147.727 M
1149.06 147.727 L
S
GR
GS
[0.5 0 0 0.5 0 0] CT
0.149 GC
2 setlinecap
1 LJ
N
1154 145.664 M
1149.06 145.664 L
S
GR
GS
[0.5 0 0 0.5 0 0] CT
0.149 GC
2 setlinecap
1 LJ
N
1154 132.095 M
1149.06 132.095 L
S
GR
GS
[0.5 0 0 0.5 0 0] CT
0.149 GC
2 setlinecap
1 LJ
N
1154 124.158 M
1149.06 124.158 L
S
GR
GS
[0.5 0 0 0.5 0 0] CT
0.149 GC
2 setlinecap
1 LJ
N
1154 118.526 M
1149.06 118.526 L
S
GR
GS
[0.5 0 0 0.5 0 0] CT
0.149 GC
2 setlinecap
1 LJ
N
1154 114.158 M
1149.06 114.158 L
S
GR
GS
[0.5 0 0 0.5 0 0] CT
0.149 GC
2 setlinecap
1 LJ
N
1154 110.588 M
1149.06 110.588 L
S
GR
GS
[0.5 0 0 0.5 0 0] CT
0.149 GC
2 setlinecap
1 LJ
N
1154 107.571 M
1149.06 107.571 L
S
GR
GS
[0.5 0 0 0.5 0 0] CT
0.149 GC
2 setlinecap
1 LJ
N
1154 104.957 M
1149.06 104.957 L
S
GR
GS
[0.5 0 0 0.5 0 0] CT
0.149 GC
2 setlinecap
1 LJ
N
1154 102.651 M
1149.06 102.651 L
S
GR
GS
[0.5 0 0 0.5 0 0] CT
0.149 GC
2 setlinecap
1 LJ
N
1154 100.588 M
1149.06 100.588 L
S
GR
GS
[0.5 0 0 0.5 0 0] CT
0.149 GC
2 setlinecap
1 LJ
N
1154 87.019 M
1149.06 87.019 L
S
GR
GS
[0.5 0 0 0.5 0 0] CT
0.149 GC
2 setlinecap
1 LJ
N
1154 79.082 M
1149.06 79.082 L
S
GR
GS
[0.5 0 0 0.5 0 0] CT
0.149 GC
2 setlinecap
1 LJ
N
1154 73.45 M
1149.06 73.45 L
S
GR
GS
[0.5 0 0 0.5 0 0] CT
0.149 GC
2 setlinecap
1 LJ
N
1154 69.082 M
1149.06 69.082 L
S
GR
GS
[0.5 0 0 0.5 0 0] CT
0.149 GC
2 setlinecap
1 LJ
N
1154 65.513 M
1149.06 65.513 L
S
GR
GS
[0.5 0 0 0.5 0 0] CT
0.149 GC
2 setlinecap
1 LJ
N
1154 62.495 M
1149.06 62.495 L
S
GR
GS
[0.5 0 0 0.5 0 0] CT
0.149 GC
2 setlinecap
1 LJ
N
1154 59.881 M
1149.06 59.881 L
S
GR
GS
[0.5 0 0 0.5 0 0] CT
0.149 GC
2 setlinecap
1 LJ
N
1154 57.575 M
1149.06 57.575 L
S
GR
GS
[0.5 0 0 0.5 0 0] CT
0.149 GC
2 setlinecap
1 LJ
N
1154 55.513 M
1149.06 55.513 L
S
GR
GS
[0.5 0 0 0.5 63 236] CT
0.149 GC
/Helvetica 20 F
GS
[1 0 0 1 0 0] CT
0 0 moveto 
1 -1 scale
(10) t 
GR
GR
GS
[0.5 0 0 0.5 74.5 231] CT
0.149 GC
/Helvetica 16 F
GS
[1 0 0 1 0 0] CT
0 0 moveto 
1 -1 scale
(0) t 
GR
GR
GS
[0.5 0 0 0.5 63 191] CT
0.149 GC
/Helvetica 20 F
GS
[1 0 0 1 0 0] CT
0 0 moveto 
1 -1 scale
(10) t 
GR
GR
GS
[0.5 0 0 0.5 74.5 186] CT
0.149 GC
/Helvetica 16 F
GS
[1 0 0 1 0 0] CT
0 0 moveto 
1 -1 scale
(2) t 
GR
GR
GS
[0.5 0 0 0.5 63 146] CT
0.149 GC
/Helvetica 20 F
GS
[1 0 0 1 0 0] CT
0 0 moveto 
1 -1 scale
(10) t 
GR
GR
GS
[0.5 0 0 0.5 74.5 141] CT
0.149 GC
/Helvetica 16 F
GS
[1 0 0 1 0 0] CT
0 0 moveto 
1 -1 scale
(4) t 
GR
GR
GS
[0.5 0 0 0.5 63 101] CT
0.149 GC
/Helvetica 20 F
GS
[1 0 0 1 0 0] CT
0 0 moveto 
1 -1 scale
(10) t 
GR
GR
GS
[0.5 0 0 0.5 74.5 96] CT
0.149 GC
/Helvetica 16 F
GS
[1 0 0 1 0 0] CT
0 0 moveto 
1 -1 scale
(6) t 
GR
GR
GS
[0.5 0 0 0.5 63 56] CT
0.149 GC
/Helvetica 20 F
GS
[1 0 0 1 0 0] CT
0 0 moveto 
1 -1 scale
(10) t 
GR
GR
GS
[0.5 0 0 0.5 74.5 51] CT
0.149 GC
/Helvetica 16 F
GS
[1 0 0 1 0 0] CT
0 0 moveto 
1 -1 scale
(8) t 
GR
GR
GS
[0 -0.5 0.5 0 48 170] CT
0.149 GC
N
1 6.766 M
1 6.563 1.031 6.484 QT
4.609 -7.891 L
5.109 -9.828 6.352 -11.68 QT
7.594 -13.531 9.352 -14.719 QT
11.109 -15.906 13.063 -15.906 QT
14.625 -15.906 15.797 -15.094 QT
16.969 -14.281 17.555 -12.953 QT
18.141 -11.625 18.141 -10.031 QT
18.141 -8.297 17.43 -6.438 QT
16.719 -4.578 15.461 -3.031 QT
14.203 -1.484 12.57 -0.539 QT
10.938 0.406 9.141 0.406 QT
8.094 0.406 7.156 -0.219 QT
6.219 -0.844 5.703 -1.859 QT
3.563 6.625 L
3.469 7.141 3.047 7.453 QT
2.625 7.766 2.094 7.766 QT
1.656 7.766 1.328 7.492 QT
1 7.219 1 6.766 QT
cp
9.219 -0.547 M
11.125 -0.547 12.539 -2.508 QT
13.953 -4.469 14.703 -7.109 QT
15.453 -9.75 15.453 -11.578 QT
15.453 -12.953 14.852 -13.969 QT
14.25 -14.984 12.984 -14.984 QT
11.422 -14.984 10.227 -13.797 QT
9.031 -12.609 8.313 -11.008 QT
7.594 -9.406 7.141 -7.672 QT
6.156 -3.641 L
6.375 -2.344 7.18 -1.445 QT
7.984 -0.547 9.219 -0.547 QT
cp
f
GR
GS
[0 -0.5 0.5 0 57 160.5] CT
0.149 GC
N
5.828 0.328 M
4.453 0.328 3.391 -0.328 QT
2.328 -0.984 1.742 -2.086 QT
1.156 -3.188 1.156 -4.594 QT
1.156 -6.563 2.258 -8.484 QT
3.359 -10.406 5.18 -11.609 QT
7 -12.813 8.984 -12.813 QT
10.469 -12.813 11.586 -12.039 QT
12.703 -11.266 13.281 -9.984 QT
13.859 -8.703 13.859 -7.25 QT
13.891 -5.313 L
14.875 -6.688 15.563 -8.164 QT
16.25 -9.641 16.625 -11.234 QT
16.688 -11.406 16.844 -11.406 QT
17.188 -11.406 L
17.453 -11.406 17.453 -11.125 QT
17.453 -11.109 17.438 -11.047 QT
17.094 -9.719 16.586 -8.492 QT
16.078 -7.266 15.391 -6.117 QT
14.703 -4.969 13.891 -4.031 QT
13.891 -0.438 14.734 -0.438 QT
15.266 -0.438 15.609 -0.758 QT
15.953 -1.078 16.219 -1.547 QT
16.484 -2.016 16.547 -2.031 QT
16.906 -2.031 L
17.141 -2.031 17.141 -1.734 QT
17.141 -1.016 16.313 -0.344 QT
15.484 0.328 14.672 0.328 QT
13.625 0.328 12.93 -0.352 QT
12.234 -1.031 11.984 -2.125 QT
10.625 -0.969 9.039 -0.32 QT
7.453 0.328 5.828 0.328 QT
cp
5.891 -0.438 M
8.984 -0.438 11.844 -2.984 QT
11.828 -3.156 11.797 -3.406 QT
11.766 -3.656 11.766 -3.688 QT
11.766 -6.813 L
11.766 -12.063 8.938 -12.063 QT
7.234 -12.063 5.961 -10.609 QT
4.688 -9.156 4.047 -7.141 QT
3.406 -5.125 3.406 -3.453 QT
3.406 -2.188 4.047 -1.313 QT
4.688 -0.438 5.891 -0.438 QT
cp
f
GR
GS
[0 -0.5 0.5 0 48 151] CT
0.149 GC
/Helvetica 36 F
GS
[1 0 0 1 0 0] CT
0 0 moveto 
1 -1 scale
(\() t 
GR
GR
GS
[0 -0.5 0.5 0 48 145] CT
0.149 GC
N
/f1382725292{4.359 0.406 M
2.328 0.406 1.422 -1.086 QT
0.516 -2.578 0.516 -4.75 QT
0.516 -6.172 0.766 -7.531 QT
1.016 -8.891 1.539 -10.289 QT
2.063 -11.688 2.727 -12.914 QT
3.391 -14.141 4.219 -15.297 QT
4.375 -15.516 4.641 -15.516 QT
4.875 -15.516 5.016 -15.375 QT
5.156 -15.234 5.156 -15.047 QT
5.156 -14.859 5.047 -14.703 QT
1.766 -10.172 1.766 -6.359 QT
1.766 -4.719 2.523 -3.531 QT
3.281 -2.344 4.859 -2.344 QT
6.203 -2.344 7.359 -3.133 QT
8.516 -3.922 9.359 -5.156 QT
9.359 -5.781 9.578 -7.117 QT
9.797 -8.453 10.258 -9.5 QT
10.719 -10.547 11.375 -10.547 QT
12.203 -10.547 12.203 -9.578 QT
12.203 -9.016 11.961 -8.164 QT
11.719 -7.313 11.43 -6.578 QT
11.141 -5.844 10.719 -4.906 QT
11.141 -2.344 13.297 -2.344 QT
14.531 -2.344 15.789 -3.063 QT
17.047 -3.781 18.016 -4.953 QT
18.984 -6.125 19.539 -7.477 QT
20.094 -8.828 20.094 -10.031 QT
20.094 -11.125 19.75 -11.734 QT
19.406 -12.344 18.844 -13.008 QT
18.281 -13.672 18.281 -14.078 QT
18.281 -14.781 18.883 -15.359 QT
19.484 -15.938 20.156 -15.938 QT
21.047 -15.938 21.414 -15.141 QT
21.781 -14.344 21.781 -13.328 QT
21.781 -11.672 21.125 -9.156 QT
20.469 -6.641 19.625 -4.969 QT
18.453 -2.703 16.703 -1.148 QT
14.953 0.406 12.781 0.406 QT
11.391 0.406 10.539 -0.43 QT
9.688 -1.266 9.438 -2.703 QT
8.438 -1.281 7.156 -0.438 QT
5.875 0.406 4.359 0.406 QT
cp}def
f1382725292
f
GR
GS
[0 -0.5 0.5 0 48 133.5] CT
0.149 GC
/Helvetica 36 F
GS
[1 0 0 1 0 0] CT
0 0 moveto 
1 -1 scale
(;g\)) t 
GR
GR
GS
[0.5 0 0 0.5 0 0] CT
0.502 GC
[8 2 4 2] 0 setdash
2 LJ
2 LW
N
166 346.08 M
166.823 361.741 L
S
GR
GS
[0.5 0 0 0.5 0 0] CT
0.502 GC
[8 2 4 2] 0 setdash
2 LJ
2 LW
N
198.11 443.945 M
198.933 439.733 L
199.757 462.131 L
200.58 430.332 L
201.403 436.757 L
S
GR
GS
[0.5 0 0 0.5 0 0] CT
0.502 GC
[8 2 4 2] 0 setdash
2 LJ
2 LW
N
249.157 319.635 M
249.98 309.124 L
250.803 332.761 L
S
GR
GS
[0.5 0 0 0.5 0 0] CT
0.502 GC
[8 2 4 2] 0 setdash
2 LJ
2 LW
N
254.097 318.321 M
254.92 313.383 L
255.743 367.66 L
S
GR
GS
[0.5 0 0 0.5 0 0] CT
0.502 GC
[8 2 4 2] 0 setdash
2 LJ
2 LW
N
259.037 317.077 M
259.86 275.395 L
260.683 281.649 L
S
GR
GS
[0.5 0 0 0.5 0 0] CT
0.502 GC
[8 2 4 2] 0 setdash
2 LJ
2 LW
N
262.33 287.57 M
263.153 269.602 L
263.977 266.485 L
264.8 281.512 L
265.623 274.102 L
266.447 271.641 L
267.27 319.618 L
268.093 267.616 L
268.917 260.399 L
269.74 258.203 L
270.563 251.117 L
271.387 263.208 L
272.21 268.798 L
273.033 253.309 L
273.857 269.143 L
S
GR
GS
[0.5 0 0 0.5 0 0] CT
0.502 GC
[8 2 4 2] 0 setdash
2 LJ
2 LW
N
280.443 334.337 M
281.267 331.498 L
282.09 431.947 L
S
GR
GS
[0.5 0 0 0.5 0 0] CT
0.502 GC
[8 2 4 2] 0 setdash
2 LJ
2 LW
N
289.5 343.394 M
290.323 336.076 L
291.147 371.09 L
S
GR
GS
[0.5 0 0 0.5 0 0] CT
0.502 GC
[8 2 4 2] 0 setdash
2 LJ
2 LW
N
300.203 353.254 M
301.027 341.958 L
301.85 363.858 L
301.941 519.057 L
S
GR
GS
[0.5 0 0 0.5 0 0] CT
0.502 GC
[8 2 4 2] 0 setdash
2 LJ
2 LW
N
313.377 351.606 M
314.2 351.175 L
314.389 519.057 L
S
GR
GS
[0.5 0 0 0.5 0 0] CT
0.502 GC
[8 2 4 2] 0 setdash
2 LJ
2 LW
N
328.197 517.922 M
329.02 358.521 L
329.843 360.378 L
S
GR
GS
[0.5 0 0 0.5 0 0] CT
0.502 GC
[8 2 4 2] 0 setdash
2 LJ
2 LW
N
335.593 519.057 M
335.607 497.969 L
336.43 471.59 L
337.253 481.077 L
S
GR
GS
[0.5 0 0 0.5 0 0] CT
0.502 GC
[8 2 4 2] 0 setdash
2 LJ
2 LW
N
339.723 476.238 M
340.547 469.032 L
341.37 504.648 L
S
GR
GS
[0.5 0 0 0.5 0 0] CT
0.502 GC
[8 2 4 2] 0 setdash
2 LJ
2 LW
N
394.063 401.214 M
394.887 394.303 L
395.71 431.605 L
395.763 519.057 L
S
GR
GS
[0.5 0 0 0.5 0 0] CT
0.502 GC
[8 2 4 2] 0 setdash
2 LJ
2 LW
N
403.943 514.882 M
404.767 499.602 L
405.59 515.653 L
S
GR
GS
[0.5 0 0 0.5 0 0] CT
0.502 GC
[8 2 4 2] 0 setdash
2 LJ
2 LW
N
409.707 446.937 M
410.53 446.72 L
410.57 519.057 L
S
GR
GS
[0.5 0 0 0.5 0 0] CT
0.502 GC
[8 2 4 2] 0 setdash
2 LJ
2 LW
N
417.117 431.504 M
417.94 427.658 L
418.763 499.409 L
S
GR
GS
[0.5 0 0 0.5 0 0] CT
0.502 GC
[8 2 4 2] 0 setdash
2 LJ
2 LW
N
431.113 462.361 M
431.937 436.274 L
432.76 445.859 L
S
GR
GS
[0.5 0 0 0.5 0 0] CT
0.502 GC
[8 2 4 2] 0 setdash
2 LJ
2 LW
N
447.58 427.553 M
448.403 422.42 L
449.227 474.394 L
S
GR
GS
[0.5 0 0 0.5 0 0] CT
0.502 GC
[8 2 4 2] 0 setdash
2 LJ
2 LW
N
456.292 519.057 M
456.637 439.167 L
457.46 440.736 L
S
GR
GS
[0.5 0 0 0.5 0 0] CT
0.502 GC
[8 2 4 2] 0 setdash
2 LJ
2 LW
N
459.107 489.851 M
459.93 462.196 L
460.753 471.275 L
S
GR
GS
[0.5 0 0 0.5 0 0] CT
0.502 GC
[8 2 4 2] 0 setdash
2 LJ
2 LW
N
465.693 449.974 M
466.517 441.587 L
467.34 471.731 L
S
GR
GS
[0.5 0 0 0.5 0 0] CT
0.502 GC
[8 2 4 2] 0 setdash
2 LJ
2 LW
N
472.28 465.907 M
473.103 456.902 L
473.927 484.807 L
S
GR
GS
[0.5 0 0 0.5 0 0] CT
0.502 GC
[8 2 4 2] 0 setdash
2 LJ
2 LW
N
475.573 474.943 M
476.397 459.774 L
477.22 475.944 L
S
GR
GS
[0.5 0 0 0.5 0 0] CT
0.502 GC
[8 2 4 2] 0 setdash
2 LJ
2 LW
N
478.867 495.522 M
479.69 456.398 L
480.513 463.018 L
S
GR
GS
[0.5 0 0 0.5 0 0] CT
0.502 GC
[8 2 4 2] 0 setdash
2 LJ
2 LW
N
486.277 440.052 M
487.1 424.9 L
487.923 441.089 L
S
GR
GS
[0.5 0 0 0.5 0 0] CT
0.502 GC
[8 2 4 2] 0 setdash
2 LJ
2 LW
N
524.973 458.675 M
525.797 458.322 L
525.852 519.057 L
S
GR
GS
[0.5 0 0 0.5 0 0] CT
0.502 GC
[8 2 4 2] 0 setdash
2 LJ
2 LW
N
537.994 519.057 M
538.147 497.422 L
538.97 499.897 L
S
GR
GS
[0.5 0 0 0.5 0 0] CT
0.502 GC
[8 2 4 2] 0 setdash
2 LJ
2 LW
N
540.617 464.679 M
541.44 459.954 L
542.263 516.963 L
542.265 519.057 L
S
GR
GS
[0.5 0 0 0.5 0 0] CT
0.502 GC
[8 2 4 2] 0 setdash
2 LJ
2 LW
N
548.85 471.367 M
549.673 458.553 L
550.497 477.756 L
S
GR
GS
[0.5 0 0 0.5 0 0] CT
0.502 GC
[8 2 4 2] 0 setdash
2 LJ
2 LW
N
570.257 476.825 M
571.08 471.471 L
571.87 519.057 L
S
GR
GS
[0.5 0 0 0.5 0 0] CT
0.502 GC
[8 2 4 2] 0 setdash
2 LJ
2 LW
N
584.943 519.057 M
585.077 476.497 L
585.9 477.658 L
S
GR
GS
[0.5 0 0 0.5 0 0] CT
0.502 GC
[8 2 4 2] 0 setdash
2 LJ
2 LW
N
590.017 500.47 M
590.84 490.224 L
591.663 514.513 L
S
GR
GS
[0.5 0 0 0.5 0 0] CT
0.502 GC
[8 2 4 2] 0 setdash
2 LJ
2 LW
N
608.953 451.353 M
609.777 450.054 L
610.02 519.057 L
S
GR
GS
[0.5 0 0 0.5 0 0] CT
0.502 GC
[8 2 4 2] 0 setdash
2 LJ
2 LW
N
618.833 505.979 M
619.657 502.311 L
619.839 519.057 L
S
GR
GS
[0.5 0 0 0.5 0 0] CT
0.502 GC
[8 2 4 2] 0 setdash
2 LJ
2 LW
N
635.3 478.514 M
636.123 444.275 L
636.947 451.744 L
S
GR
GS
[0.5 0 0 0.5 0 0] CT
0.502 GC
[8 2 4 2] 0 setdash
2 LJ
2 LW
N
650.12 475.002 M
650.943 456.311 L
651.767 469.465 L
S
GR
GS
[0.5 0 0 0.5 0 0] CT
0.502 GC
[8 2 4 2] 0 setdash
2 LJ
2 LW
N
655.041 519.057 M
655.06 491.44 L
655.883 447.705 L
656.707 453.695 L
S
GR
GS
[0.5 0 0 0.5 0 0] CT
0.502 GC
[8 2 4 2] 0 setdash
2 LJ
2 LW
N
665.763 457.604 M
666.587 438.804 L
667.41 451.885 L
667.45 519.057 L
S
GR
GS
[0.5 0 0 0.5 0 0] CT
0.502 GC
[8 2 4 2] 0 setdash
2 LJ
2 LW
N
676.849 519.057 M
677.29 436.269 L
678.113 438.182 L
S
GR
GS
[0.5 0 0 0.5 0 0] CT
0.502 GC
[8 2 4 2] 0 setdash
2 LJ
2 LW
N
682.341 519.057 M
683.053 462.325 L
683.877 466.492 L
S
GR
GS
[0.5 0 0 0.5 0 0] CT
0.502 GC
[8 2 4 2] 0 setdash
2 LJ
2 LW
N
688.174 519.057 M
688.817 437.215 L
689.64 439.946 L
S
GR
GS
[0.5 0 0 0.5 0 0] CT
0.502 GC
[8 2 4 2] 0 setdash
2 LJ
2 LW
N
700.343 415.872 M
701.167 401.05 L
701.99 417.601 L
S
GR
GS
[0.5 0 0 0.5 0 0] CT
0.502 GC
[8 2 4 2] 0 setdash
2 LJ
2 LW
N
720.927 497.51 M
721.75 494.919 L
721.929 519.057 L
S
GR
GS
[0.5 0 0 0.5 0 0] CT
0.502 GC
[8 2 4 2] 0 setdash
2 LJ
2 LW
N
739.863 481.033 M
740.687 455.318 L
741.51 465.031 L
S
GR
GS
[0.5 0 0 0.5 0 0] CT
0.502 GC
[8 2 4 2] 0 setdash
2 LJ
2 LW
N
752.213 501.242 M
753.037 462.219 L
753.86 468.855 L
753.889 519.057 L
S
GR
GS
[0.5 0 0 0.5 0 0] CT
0.502 GC
[8 2 4 2] 0 setdash
2 LJ
2 LW
N
785.97 453.365 M
786.793 438.672 L
787.617 455.37 L
S
GR
GS
[0.5 0 0 0.5 0 0] CT
0.502 GC
[8 2 4 2] 0 setdash
2 LJ
2 LW
N
813.14 513.949 M
813.963 488.985 L
814.787 498.971 L
S
GR
GS
[0.5 0 0 0.5 0 0] CT
0.502 GC
[8 2 4 2] 0 setdash
2 LJ
2 LW
N
823.843 467.823 M
824.667 463.739 L
825.345 519.057 L
S
GR
GS
[0.5 0 0 0.5 0 0] CT
0.502 GC
[8 2 4 2] 0 setdash
2 LJ
2 LW
N
827.96 502.127 M
828.783 494.309 L
829.409 519.057 L
S
GR
GS
[0.5 0 0 0.5 0 0] CT
0.502 GC
[8 2 4 2] 0 setdash
2 LJ
2 LW
N
840.31 461.611 M
841.133 460.597 L
841.292 519.057 L
S
GR
GS
[0.5 0 0 0.5 0 0] CT
0.502 GC
[8 2 4 2] 0 setdash
2 LJ
2 LW
N
844.427 505.608 M
845.25 501.771 L
845.448 519.057 L
S
GR
GS
[0.5 0 0 0.5 0 0] CT
0.502 GC
[8 2 4 2] 0 setdash
2 LJ
2 LW
N
851.35 519.057 M
851.837 470.854 L
852.66 474.281 L
S
GR
GS
[0.5 0 0 0.5 0 0] CT
0.502 GC
[8 2 4 2] 0 setdash
2 LJ
2 LW
N
865.833 506.924 M
866.657 457.948 L
867.48 463.361 L
S
GR
GS
[0.5 0 0 0.5 0 0] CT
0.502 GC
[8 2 4 2] 0 setdash
2 LJ
2 LW
N
881.477 469.87 M
882.3 455.32 L
883.123 472.185 L
883.153 519.057 L
S
GR
GS
[0.5 0 0 0.5 0 0] CT
0.502 GC
[8 2 4 2] 0 setdash
2 LJ
2 LW
N
889.71 479.463 M
890.533 476.161 L
890.949 519.057 L
S
GR
GS
[0.5 0 0 0.5 0 0] CT
0.502 GC
[8 2 4 2] 0 setdash
2 LJ
2 LW
N
897.943 478.076 M
898.767 477.424 L
898.838 519.057 L
S
GR
GS
[0.5 0 0 0.5 0 0] CT
0.502 GC
[8 2 4 2] 0 setdash
2 LJ
2 LW
N
904.53 468.259 M
905.353 466.077 L
905.679 519.057 L
S
GR
GS
[0.5 0 0 0.5 0 0] CT
0.502 GC
[8 2 4 2] 0 setdash
2 LJ
2 LW
N
914.41 449.027 M
915.233 434.527 L
916.057 451.449 L
916.852 519.057 L
S
GR
GS
[0.5 0 0 0.5 0 0] CT
0.502 GC
[8 2 4 2] 0 setdash
2 LJ
2 LW
N
917.269 519.057 M
917.703 516.4 L
917.744 519.057 L
S
GR
GS
[0.5 0 0 0.5 0 0] CT
0.502 GC
[8 2 4 2] 0 setdash
2 LJ
2 LW
N
920.158 519.057 M
920.173 493.974 L
920.997 478.004 L
921.82 493.363 L
S
GR
GS
[0.5 0 0 0.5 0 0] CT
0.502 GC
[8 2 4 2] 0 setdash
2 LJ
2 LW
N
963.614 519.057 M
963.81 485.81 L
964.633 487.91 L
S
GR
GS
[0.5 0 0 0.5 0 0] CT
0.502 GC
[8 2 4 2] 0 setdash
2 LJ
2 LW
N
970.121 519.057 M
970.397 481.82 L
971.22 484.409 L
S
GR
GS
[0.5 0 0 0.5 0 0] CT
0.502 GC
[8 2 4 2] 0 setdash
2 LJ
2 LW
N
981.923 488.515 M
982.747 467.347 L
983.57 479.016 L
983.595 519.057 L
S
GR
GS
[0.5 0 0 0.5 0 0] CT
0.502 GC
[8 2 4 2] 0 setdash
2 LJ
2 LW
N
1011.563 504.153 M
1012.387 475.544 L
1013.21 484.344 L
S
GR
GS
[0.5 0 0 0.5 0 0] CT
0.502 GC
[8 2 4 2] 0 setdash
2 LJ
2 LW
N
1034.617 497.18 M
1035.44 495.514 L
1035.548 519.057 L
S
GR
GS
[0.5 0 0 0.5 0 0] CT
0.502 GC
[8 2 4 2] 0 setdash
2 LJ
2 LW
N
1037.197 519.057 M
1037.91 504.731 L
1038.733 487.24 L
1039.557 495.208 L
S
GR
GS
[0.5 0 0 0.5 0 0] CT
0.502 GC
[8 2 4 2] 0 setdash
2 LJ
2 LW
N
1047.606 519.057 M
1047.79 459.197 L
1048.613 460.337 L
S
GR
GS
[0.5 0 0 0.5 0 0] CT
0.502 GC
[8 2 4 2] 0 setdash
2 LJ
2 LW
N
1066.692 519.057 M
1066.727 455.299 L
1067.55 455.512 L
S
GR
GS
[0.5 0 0 0.5 0 0] CT
0.502 GC
[8 2 4 2] 0 setdash
2 LJ
2 LW
N
1086.453 519.057 M
1086.487 463.461 L
1087.31 462.465 L
1088.038 519.057 L
S
GR
GS
[0.5 0 0 0.5 0 0] CT
0.502 GC
[8 2 4 2] 0 setdash
2 LJ
2 LW
N
1096.367 502.766 M
1097.19 488.534 L
1098.013 505.779 L
S
GR
GS
[0.5 0 0 0.5 0 0] CT
0.502 GC
[8 2 4 2] 0 setdash
2 LJ
2 LW
N
1107.04 519.057 M
1107.07 473.02 L
1107.893 468.867 L
1108.521 519.057 L
S
GR
GS
[0.5 0 0 0.5 0 0] CT
0.502 GC
[8 2 4 2] 0 setdash
2 LJ
2 LW
N
1113.217 519.057 M
1113.657 514.843 L
1113.764 519.057 L
S
GR
GS
[0.5 0 0 0.5 0 0] CT
0.502 GC
[8 2 4 2] 0 setdash
2 LJ
2 LW
N
1128.477 454.294 M
1129.3 440.108 L
1130.123 457.412 L
S
GR
GS
[0.5 0 0 0.5 0 0] CT
[8 2 4 2] 0 setdash
2 LJ
2 LW
N
166 368.267 M
166.823 383.928 L
S
GR
GS
[0.5 0 0 0.5 0 0] CT
[8 2 4 2] 0 setdash
2 LJ
2 LW
N
170.193 519.057 M
170.94 477.746 L
171.763 446.418 L
172.587 431.218 L
173.41 433.412 L
174.233 446.599 L
175.057 451.887 L
175.88 462.091 L
176.703 430.676 L
177.527 433.307 L
177.582 519.057 L
S
GR
GS
[0.5 0 0 0.5 0 0] CT
[8 2 4 2] 0 setdash
2 LJ
2 LW
N
179.136 519.057 M
179.173 461.941 L
179.997 424.579 L
180.82 431.028 L
181.643 485.242 L
182.467 495.135 L
182.483 519.057 L
S
GR
GS
[0.5 0 0 0.5 0 0] CT
[8 2 4 2] 0 setdash
2 LJ
2 LW
N
184.878 519.057 M
184.937 429.451 L
185.76 410.636 L
186.583 424.081 L
187.142 519.057 L
S
GR
GS
[0.5 0 0 0.5 0 0] CT
[8 2 4 2] 0 setdash
2 LJ
2 LW
N
187.826 519.057 M
188.23 475.658 L
189.053 457.568 L
189.877 467.865 L
190.486 519.057 L
S
GR
GS
[0.5 0 0 0.5 0 0] CT
[8 2 4 2] 0 setdash
2 LJ
2 LW
N
191.037 519.057 M
191.523 493.141 L
192.347 440.867 L
193.17 435.02 L
193.993 437.467 L
194.817 445.484 L
195.332 519.057 L
S
GR
GS
[0.5 0 0 0.5 0 0] CT
[8 2 4 2] 0 setdash
2 LJ
2 LW
N
197.218 519.057 M
197.287 508.045 L
198.11 413.808 L
198.933 390.367 L
199.757 401.005 L
200.58 494.619 L
201.403 497.474 L
202.227 483.983 L
203.05 486.778 L
203.873 431.013 L
204.697 431.3 L
205.52 460.481 L
206.343 479.324 L
207.167 467.932 L
207.99 413.739 L
208.813 412.749 L
209.637 458.106 L
210.46 395.071 L
211.283 395.44 L
212.107 436.224 L
212.93 448.612 L
213.753 479.308 L
214.577 425.711 L
215.4 414.718 L
216.223 427.554 L
217.047 440.34 L
217.87 471.521 L
218.693 491.54 L
219.517 454.73 L
220.34 427.598 L
221.163 416.949 L
221.987 400.067 L
222.81 391.888 L
223.633 411.522 L
224.457 398.409 L
225.28 386.862 L
226.103 395.578 L
226.927 397.098 L
227.75 413.619 L
228.573 403.834 L
229.397 406.082 L
230.22 474.17 L
231.043 430.808 L
231.867 400.476 L
232.69 400.724 L
233.513 434.393 L
234.337 425.735 L
235.16 424.501 L
235.983 415.177 L
236.807 401.697 L
237.63 390.345 L
238.453 383.184 L
239.277 399.647 L
240.1 432.743 L
240.289 519.057 L
S
GR
GS
[0.5 0 0 0.5 0 0] CT
[8 2 4 2] 0 setdash
2 LJ
2 LW
N
242.368 519.057 M
242.57 489.999 L
243.393 401.465 L
244.217 392.471 L
245.04 406.056 L
245.863 363.424 L
246.687 351.312 L
247.51 370.019 L
248.333 360.733 L
249.157 360.061 L
249.98 404.425 L
250.803 359.025 L
251.627 358.598 L
252.45 375.993 L
253.273 361.88 L
254.097 369.47 L
254.92 383.373 L
255.743 333.747 L
256.567 323.505 L
257.39 325.103 L
258.213 321.194 L
259.037 323.632 L
259.86 304.86 L
260.683 286.25 L
261.507 279.923 L
262.33 259.096 L
263.153 220.757 L
263.977 162.378 L
264.8 138.788 L
265.623 142.92 L
266.447 179.805 L
267.27 229.967 L
268.093 253.951 L
268.917 293.055 L
269.74 288.079 L
270.563 287.701 L
271.387 291.84 L
272.21 327.318 L
272.415 519.057 L
S
GR
GS
[0.5 0 0 0.5 0 0] CT
[8 2 4 2] 0 setdash
2 LJ
2 LW
N
273.745 519.057 M
273.857 428.063 L
274.68 377.187 L
275.503 382.412 L
276.23 519.057 L
S
GR
GS
[0.5 0 0 0.5 0 0] CT
[8 2 4 2] 0 setdash
2 LJ
2 LW
N
276.47 519.057 M
277.15 433.016 L
277.973 396.345 L
278.797 377.411 L
279.62 388.807 L
280.443 496.59 L
281.267 509.972 L
282.09 418.503 L
282.913 372.735 L
283.737 370.695 L
284.56 396.629 L
285.383 410.011 L
286.207 407.308 L
287.03 388.005 L
287.853 381.28 L
288.677 406.006 L
289.5 447.921 L
290.323 422.91 L
291.147 426.906 L
291.97 396.955 L
292.793 385.788 L
293.617 404.965 L
294.44 449.044 L
295.263 435.713 L
296.087 426.232 L
296.91 450.864 L
297.733 390.804 L
298.557 391.645 L
299.38 440.304 L
300.203 410.765 L
301.027 399.254 L
301.85 400.337 L
302.673 405.431 L
303.497 383.255 L
304.32 378.505 L
305.143 397.848 L
305.967 403.102 L
306.79 405.029 L
307.613 414.048 L
308.437 465.618 L
309.26 442.461 L
310.083 396.599 L
310.907 400.957 L
311.73 487.821 L
312.553 476.978 L
313.377 453.247 L
314.2 423.204 L
315.023 423.575 L
315.847 447.521 L
316.67 401.106 L
317.493 394.046 L
318.317 422.047 L
319.14 472.993 L
319.963 486.703 L
320.787 424.512 L
321.61 413.403 L
322.433 426.682 L
323.257 419.854 L
324.08 416.731 L
324.903 405.277 L
325.727 409.767 L
326.55 447.684 L
327.373 459.174 L
328.197 446.214 L
329.02 426.198 L
329.843 433.382 L
330.667 423.294 L
331.49 416.759 L
332.313 435.327 L
333.137 447.25 L
333.96 447.309 L
334.783 460.81 L
335.607 441.705 L
336.43 428.956 L
337.253 433.585 L
338.077 460.622 L
338.9 496.895 L
339.723 429.609 L
340.547 428.973 L
341.37 457.239 L
342.193 458.067 L
343.017 420.423 L
343.84 412.812 L
344.663 419.446 L
345.487 435.365 L
346.31 455.033 L
347.133 457.867 L
347.957 488.294 L
348.78 488.525 L
349.603 472.699 L
350.427 438.41 L
351.25 441.371 L
352.014 519.057 L
S
GR
GS
[0.5 0 0 0.5 0 0] CT
[8 2 4 2] 0 setdash
2 LJ
2 LW
N
352.129 519.057 M
352.897 436.107 L
353.72 430.889 L
354.543 469.274 L
355.367 483.781 L
356.19 445.233 L
357.013 433.607 L
357.837 443.535 L
358.66 459.093 L
359.483 480.883 L
360.307 490.785 L
361.13 449.216 L
361.953 447.66 L
362.777 426.486 L
363.6 416.463 L
364.423 416.404 L
365.247 429.1 L
366.07 460.458 L
366.893 471.872 L
367.717 476.795 L
368.54 480.657 L
369.363 489.173 L
370.187 490.05 L
371.01 452.607 L
371.833 448.776 L
372.657 463.628 L
373.48 469.586 L
374.303 493.465 L
375.127 483.326 L
375.95 478.567 L
376.773 486.76 L
377.597 440.788 L
378.42 434.893 L
379.243 447.539 L
380.067 479.069 L
380.89 498.614 L
381.713 495.687 L
382.537 472.589 L
383.36 461.295 L
384.183 454.293 L
385.007 454.559 L
385.83 479.849 L
386.653 488.301 L
387.477 464.847 L
388.3 468.589 L
389.123 489.617 L
389.947 479.386 L
390.77 479.24 L
391.593 476.925 L
392.417 488.805 L
393.24 514.446 L
394.063 466.804 L
394.887 461.705 L
395.71 450.254 L
396.533 448.028 L
397.357 446.483 L
398.18 426.017 L
399.003 432.835 L
399.827 498.677 L
400.65 478.565 L
401.473 483.463 L
402.297 493.307 L
403.12 486.256 L
403.943 509.358 L
404.62 519.057 L
S
GR
GS
[0.5 0 0 0.5 0 0] CT
[8 2 4 2] 0 setdash
2 LJ
2 LW
N
404.824 519.057 M
405.59 490.869 L
406.413 481.069 L
407.237 467.328 L
408.06 461.912 L
408.883 467.063 L
409.707 478.414 L
410.53 494.075 L
411.353 488.762 L
412.177 488.053 L
413 468.68 L
413.823 465.077 L
414.647 477.084 L
415.47 494.401 L
416.293 506.118 L
417.117 487.578 L
417.94 466.894 L
418.763 471.462 L
419.587 467.8 L
420.41 455.318 L
421.233 465.627 L
422.057 467.411 L
422.88 470.314 L
423.703 467.539 L
424.527 464.906 L
425.35 474.24 L
426.173 479.487 L
426.997 473.011 L
427.82 473.757 L
428.643 490.931 L
429.467 512.441 L
430.29 491.637 L
431.113 496.801 L
431.937 487.75 L
432.76 484.53 L
433.583 492.3 L
434.407 479.558 L
435.23 461.768 L
436.053 460.009 L
436.877 480.405 L
437.7 490.79 L
438.523 518.85 L
439.347 479.124 L
440.17 476.239 L
440.993 488.442 L
441.817 477.487 L
442.64 488.238 L
443.463 463.297 L
444.287 463.789 L
445.11 494.555 L
445.933 502.753 L
446.307 519.057 L
S
GR
GS
[0.5 0 0 0.5 0 0] CT
[8 2 4 2] 0 setdash
2 LJ
2 LW
N
447.029 519.057 M
447.58 479.317 L
448.403 462.405 L
449.227 460.279 L
450.05 469.345 L
450.873 500.738 L
451.697 471.142 L
452.52 457.501 L
453.343 473.059 L
453.694 519.057 L
S
GR
GS
[0.5 0 0 0.5 0 0] CT
[8 2 4 2] 0 setdash
2 LJ
2 LW
N
454.643 519.057 M
454.99 474.088 L
455.813 466.939 L
456.637 464.703 L
457.46 456.89 L
458.283 447.404 L
459.107 444.56 L
459.93 439.42 L
460.753 426.639 L
461.577 412.66 L
462.4 418.063 L
463.223 432.996 L
464.047 431.313 L
464.87 437.134 L
465.693 441.893 L
466.517 443.995 L
467.34 458.498 L
468.163 463.504 L
468.987 478.089 L
469.81 506.066 L
470.633 471.889 L
471.457 463.843 L
472.28 494.252 L
472.619 519.057 L
S
GR
GS
[0.5 0 0 0.5 0 0] CT
[8 2 4 2] 0 setdash
2 LJ
2 LW
N
473.615 519.057 M
473.927 497.538 L
474.75 485.305 L
475.573 497.216 L
476.397 485.165 L
477.22 483.895 L
478.043 491.587 L
478.867 482.21 L
479.69 489.779 L
480.513 489.223 L
481.337 453.324 L
482.16 458.581 L
482.923 519.057 L
S
GR
GS
[0.5 0 0 0.5 0 0] CT
[8 2 4 2] 0 setdash
2 LJ
2 LW
N
483.532 519.057 M
483.807 516.658 L
484.052 519.057 L
S
GR
GS
[0.5 0 0 0.5 0 0] CT
[8 2 4 2] 0 setdash
2 LJ
2 LW
N
484.77 519.057 M
485.453 491.518 L
486.277 493.575 L
487.1 512.966 L
487.923 493.974 L
488.747 503.27 L
489.547 519.057 L
S
GR
GS
[0.5 0 0 0.5 0 0] CT
[8 2 4 2] 0 setdash
2 LJ
2 LW
N
489.58 519.057 M
490.393 483.623 L
491.217 482.745 L
492.04 487.541 L
492.863 482.661 L
493.687 483.015 L
494.51 483.459 L
495.333 498.885 L
496.157 501.046 L
496.98 504.421 L
497.803 506.997 L
498.627 508.92 L
499.45 502.191 L
500.273 483.753 L
501.097 473.957 L
501.92 481.657 L
502.743 478.284 L
503.567 478.583 L
504.39 471.83 L
505.213 465.962 L
506.037 489.411 L
506.734 519.057 L
S
GR
GS
[0.5 0 0 0.5 0 0] CT
[8 2 4 2] 0 setdash
2 LJ
2 LW
N
507.348 519.057 M
507.683 515.379 L
508.027 519.057 L
S
GR
GS
[0.5 0 0 0.5 0 0] CT
[8 2 4 2] 0 setdash
2 LJ
2 LW
N
508.71 519.057 M
509.33 503.382 L
510.153 497.685 L
510.977 514.901 L
511.8 489.667 L
512.623 487.454 L
513.447 503.876 L
514.27 502.601 L
515.093 511.54 L
515.917 511.96 L
516.74 491.876 L
517.563 490.558 L
518.387 510.961 L
519.21 492.019 L
520.033 492.398 L
520.857 498.877 L
521.68 509.362 L
522.07 519.057 L
S
GR
GS
[0.5 0 0 0.5 0 0] CT
[8 2 4 2] 0 setdash
2 LJ
2 LW
N
522.824 519.057 M
523.327 502.114 L
524.15 495.918 L
524.973 497.049 L
525.797 512.928 L
526.62 504.621 L
527.443 496.238 L
528.267 503.88 L
529.09 483.158 L
529.913 483.615 L
530.737 457.339 L
531.56 456.917 L
532.383 493.372 L
533.207 487.742 L
534.03 493.836 L
534.853 493.163 L
535.677 497.568 L
536.233 519.057 L
S
GR
GS
[0.5 0 0 0.5 0 0] CT
[8 2 4 2] 0 setdash
2 LJ
2 LW
N
536.742 519.057 M
537.323 494.226 L
538.147 490.554 L
538.625 519.057 L
S
GR
GS
[0.5 0 0 0.5 0 0] CT
[8 2 4 2] 0 setdash
2 LJ
2 LW
N
539.45 519.057 M
539.793 504.3 L
540.617 484.886 L
541.44 490.185 L
542.263 491.018 L
543.087 486.206 L
543.91 489.471 L
544.733 496.379 L
545.557 517.476 L
546.38 511.865 L
547.203 490.432 L
548.027 491.786 L
548.85 484.778 L
549.673 477.242 L
550.497 501.978 L
551.32 506.632 L
552.143 500.551 L
552.967 506.072 L
553.79 497.274 L
554.613 488.57 L
555.437 491.303 L
556.26 492.62 L
557.083 487.845 L
557.907 492.981 L
558.73 499.47 L
559.553 478.949 L
560.377 472.706 L
561.2 479.494 L
562.023 481.964 L
562.847 466.137 L
563.67 466.608 L
564.192 519.057 L
S
GR
GS
[0.5 0 0 0.5 0 0] CT
[8 2 4 2] 0 setdash
2 LJ
2 LW
N
568.003 519.057 M
568.61 504.192 L
569.433 494.272 L
570.257 499.89 L
571.08 513.093 L
571.903 492.754 L
572.727 499.107 L
573.55 480.314 L
574.373 480.193 L
574.983 519.057 L
S
GR
GS
[0.5 0 0 0.5 0 0] CT
[8 2 4 2] 0 setdash
2 LJ
2 LW
N
575.557 519.057 M
576.02 501.607 L
576.843 494.131 L
577.667 490.023 L
578.49 502.839 L
579.313 488.815 L
580.137 483.9 L
580.96 509.634 L
581.783 487.157 L
582.607 480.365 L
583.43 490.298 L
584.253 486.795 L
585.077 487.924 L
585.9 510.815 L
586.723 500.886 L
587.547 495.405 L
588.37 503.09 L
589.193 487.277 L
590.017 478.097 L
590.84 487.452 L
591.663 506.754 L
592.487 518.095 L
593.31 516.62 L
593.342 519.057 L
S
GR
GS
[0.5 0 0 0.5 0 0] CT
[8 2 4 2] 0 setdash
2 LJ
2 LW
N
594.675 519.057 M
594.957 487.784 L
595.78 484.846 L
596.603 500.073 L
597.427 484.201 L
598.25 487.293 L
599.073 498.394 L
599.897 491.112 L
600.72 495.478 L
601.543 512.268 L
602.367 507.785 L
603.19 498.866 L
604.013 492.514 L
604.837 504.421 L
605.66 499.913 L
606.483 494.103 L
607.307 515.536 L
607.47 519.057 L
S
GR
GS
[0.5 0 0 0.5 0 0] CT
[8 2 4 2] 0 setdash
2 LJ
2 LW
N
609.618 519.057 M
609.777 516.664 L
610.6 501.269 L
611.423 493.007 L
612.247 507.235 L
612.623 519.057 L
S
GR
GS
[0.5 0 0 0.5 0 0] CT
[8 2 4 2] 0 setdash
2 LJ
2 LW
N
615.166 519.057 M
615.54 495.187 L
616.363 496.569 L
617.187 516.309 L
618.01 508.104 L
618.833 477.78 L
619.657 472.668 L
620.48 486.889 L
621.303 501.285 L
622.127 479.542 L
622.95 478.756 L
623.773 493.215 L
624.597 501.016 L
625.356 519.057 L
S
GR
GS
[0.5 0 0 0.5 0 0] CT
[8 2 4 2] 0 setdash
2 LJ
2 LW
N
628.252 519.057 M
628.713 492.369 L
629.537 489.875 L
629.935 519.057 L
S
GR
GS
[0.5 0 0 0.5 0 0] CT
[8 2 4 2] 0 setdash
2 LJ
2 LW
N
631.425 519.057 M
632.007 504.387 L
632.83 504.168 L
633.653 516.559 L
633.917 519.057 L
S
GR
GS
[0.5 0 0 0.5 0 0] CT
[8 2 4 2] 0 setdash
2 LJ
2 LW
N
635.313 519.057 M
636.123 496.349 L
636.947 499.178 L
637.77 500.282 L
638.593 480.695 L
639.417 488.788 L
640.214 519.057 L
S
GR
GS
[0.5 0 0 0.5 0 0] CT
[8 2 4 2] 0 setdash
2 LJ
2 LW
N
640.265 519.057 M
641.063 488.554 L
641.887 489.992 L
642.71 474.521 L
643.533 461.294 L
644.357 477.862 L
644.75 519.057 L
S
GR
GS
[0.5 0 0 0.5 0 0] CT
[8 2 4 2] 0 setdash
2 LJ
2 LW
N
646.935 519.057 M
647.65 496.596 L
648.473 483.394 L
649.297 485.582 L
650.12 485.276 L
650.943 475.495 L
651.767 488.324 L
652.59 469.122 L
653.413 459.206 L
654.237 474.968 L
655.06 468.241 L
655.883 452.047 L
656.707 457.455 L
657.53 486.674 L
658.353 424.904 L
659.177 424.664 L
660 453.719 L
660.823 462.847 L
661.647 449.432 L
662.47 434.866 L
663.293 430.585 L
664.117 435.02 L
664.94 443.689 L
665.763 444.229 L
666.587 446.406 L
667.41 457.048 L
668.233 478.356 L
669.057 456.59 L
669.88 455.42 L
670.703 479.903 L
671.527 496.638 L
672.35 505.027 L
673.03 519.057 L
S
GR
GS
[0.5 0 0 0.5 0 0] CT
[8 2 4 2] 0 setdash
2 LJ
2 LW
N
673.217 519.057 M
673.997 466.066 L
674.82 449.746 L
675.643 464.09 L
676.467 518.756 L
677.29 502.191 L
678.113 498.083 L
678.937 515.875 L
679.76 492.606 L
680.583 485.227 L
681.407 515.617 L
681.471 519.057 L
S
GR
GS
[0.5 0 0 0.5 0 0] CT
[8 2 4 2] 0 setdash
2 LJ
2 LW
N
682.737 519.057 M
683.053 493.828 L
683.877 492.396 L
684.7 508.137 L
685.523 501.887 L
686.347 500.759 L
686.847 519.057 L
S
GR
GS
[0.5 0 0 0.5 0 0] CT
[8 2 4 2] 0 setdash
2 LJ
2 LW
N
688.548 519.057 M
688.817 513.906 L
689.165 519.057 L
S
GR
GS
[0.5 0 0 0.5 0 0] CT
[8 2 4 2] 0 setdash
2 LJ
2 LW
N
690.731 519.057 M
691.287 452.404 L
692.11 439.12 L
692.933 457.041 L
693.757 517.37 L
694.58 509.417 L
695.403 509.647 L
696.227 512.074 L
697.05 505.75 L
697.873 486.957 L
698.697 493.572 L
699.442 519.057 L
S
GR
GS
[0.5 0 0 0.5 0 0] CT
[8 2 4 2] 0 setdash
2 LJ
2 LW
N
700.662 519.057 M
701.167 498.477 L
701.99 500.583 L
702.813 516.941 L
703.097 519.057 L
S
GR
GS
[0.5 0 0 0.5 0 0] CT
[8 2 4 2] 0 setdash
2 LJ
2 LW
N
705.99 519.057 M
706.107 517.752 L
706.298 519.057 L
S
GR
GS
[0.5 0 0 0.5 0 0] CT
[8 2 4 2] 0 setdash
2 LJ
2 LW
N
709.049 519.057 M
709.4 506.345 L
710.223 485.301 L
711.047 489.027 L
711.87 504.816 L
712.693 516.406 L
712.873 519.057 L
S
GR
GS
[0.5 0 0 0.5 0 0] CT
[8 2 4 2] 0 setdash
2 LJ
2 LW
N
715.669 519.057 M
715.987 516.86 L
716.81 498.895 L
717.633 495.202 L
718.457 501.634 L
719.28 509.392 L
720.055 519.057 L
S
GR
GS
[0.5 0 0 0.5 0 0] CT
[8 2 4 2] 0 setdash
2 LJ
2 LW
N
720.149 519.057 M
720.927 508.813 L
721.75 510.688 L
722.457 519.057 L
S
GR
GS
[0.5 0 0 0.5 0 0] CT
[8 2 4 2] 0 setdash
2 LJ
2 LW
N
722.684 519.057 M
723.397 510.148 L
724.22 509.215 L
725 519.057 L
S
GR
GS
[0.5 0 0 0.5 0 0] CT
[8 2 4 2] 0 setdash
2 LJ
2 LW
N
726.217 519.057 M
726.69 493.59 L
727.513 487.871 L
728.337 513.931 L
728.516 519.057 L
S
GR
GS
[0.5 0 0 0.5 0 0] CT
[8 2 4 2] 0 setdash
2 LJ
2 LW
N
729.426 519.057 M
729.983 480.495 L
730.807 481.445 L
731.502 519.057 L
S
GR
GS
[0.5 0 0 0.5 0 0] CT
[8 2 4 2] 0 setdash
2 LJ
2 LW
N
733.144 519.057 M
733.277 516.616 L
734.1 516.266 L
734.923 511.926 L
735.747 505.186 L
736.57 517.514 L
737.393 508.789 L
738.217 512.795 L
738.613 519.057 L
S
GR
GS
[0.5 0 0 0.5 0 0] CT
[8 2 4 2] 0 setdash
2 LJ
2 LW
N
740.286 519.057 M
740.687 505.228 L
741.51 499.248 L
742.333 506.88 L
743.157 514.927 L
743.296 519.057 L
S
GR
GS
[0.5 0 0 0.5 0 0] CT
[8 2 4 2] 0 setdash
2 LJ
2 LW
N
744.489 519.057 M
744.803 506.544 L
745.627 502.789 L
746.046 519.057 L
S
GR
GS
[0.5 0 0 0.5 0 0] CT
[8 2 4 2] 0 setdash
2 LJ
2 LW
N
747.421 519.057 M
748.097 495.311 L
748.92 498.204 L
749.743 501.69 L
750.567 498.257 L
751.39 496.275 L
752.213 489.902 L
753.037 504.135 L
753.572 519.057 L
S
GR
GS
[0.5 0 0 0.5 0 0] CT
[8 2 4 2] 0 setdash
2 LJ
2 LW
N
754.626 519.057 M
754.683 518.457 L
754.764 519.057 L
S
GR
GS
[0.5 0 0 0.5 0 0] CT
[8 2 4 2] 0 setdash
2 LJ
2 LW
N
756.562 519.057 M
757.153 507.128 L
757.977 509.541 L
758.8 518.636 L
758.961 519.057 L
S
GR
GS
[0.5 0 0 0.5 0 0] CT
[8 2 4 2] 0 setdash
2 LJ
2 LW
N
760.215 519.057 M
760.447 518.378 L
761.27 482.361 L
762.093 478.089 L
762.917 509.731 L
763.156 519.057 L
S
GR
GS
[0.5 0 0 0.5 0 0] CT
[8 2 4 2] 0 setdash
2 LJ
2 LW
N
765.807 519.057 M
766.21 513.231 L
767.033 513.805 L
767.857 510.749 L
768.68 504.485 L
769.433 519.057 L
S
GR
GS
[0.5 0 0 0.5 0 0] CT
[8 2 4 2] 0 setdash
2 LJ
2 LW
N
771.987 519.057 M
772.797 511.471 L
773.62 516.847 L
774.443 501.646 L
775.267 509.288 L
776.09 504.763 L
776.913 493.675 L
777.737 498.379 L
778.56 512.816 L
778.652 519.057 L
S
GR
GS
[0.5 0 0 0.5 0 0] CT
[8 2 4 2] 0 setdash
2 LJ
2 LW
N
780.181 519.057 M
780.207 517.445 L
781.03 511.238 L
781.595 519.057 L
S
GR
GS
[0.5 0 0 0.5 0 0] CT
[8 2 4 2] 0 setdash
2 LJ
2 LW
N
782.129 519.057 M
782.677 511.954 L
783.5 517.785 L
783.592 519.057 L
S
GR
GS
[0.5 0 0 0.5 0 0] CT
[8 2 4 2] 0 setdash
2 LJ
2 LW
N
785.161 519.057 M
785.97 502.011 L
786.793 503.58 L
787.49 519.057 L
S
GR
GS
[0.5 0 0 0.5 0 0] CT
[8 2 4 2] 0 setdash
2 LJ
2 LW
N
789.557 519.057 M
790.087 513.384 L
790.423 519.057 L
S
GR
GS
[0.5 0 0 0.5 0 0] CT
[8 2 4 2] 0 setdash
2 LJ
2 LW
N
792.153 519.057 M
792.557 508.015 L
793.38 496.853 L
794.203 507.119 L
795.027 512.846 L
795.85 492.324 L
796.673 480.27 L
797.497 491.203 L
798.059 519.057 L
S
GR
GS
[0.5 0 0 0.5 0 0] CT
[8 2 4 2] 0 setdash
2 LJ
2 LW
N
798.695 519.057 M
799.143 503.664 L
799.967 506.24 L
800.239 519.057 L
S
GR
GS
[0.5 0 0 0.5 0 0] CT
[8 2 4 2] 0 setdash
2 LJ
2 LW
N
801.455 519.057 M
801.613 512.852 L
802.437 506.085 L
803.26 510.08 L
804.083 516.136 L
804.907 513.949 L
805.73 514.466 L
805.983 519.057 L
S
GR
GS
[0.5 0 0 0.5 0 0] CT
[8 2 4 2] 0 setdash
2 LJ
2 LW
N
813.857 519.057 M
813.963 512.134 L
814.787 504.227 L
815.61 507.425 L
816.433 504.584 L
817.075 519.057 L
S
GR
GS
[0.5 0 0 0.5 0 0] CT
[8 2 4 2] 0 setdash
2 LJ
2 LW
N
819.717 519.057 M
819.727 518.832 L
820.55 513.034 L
820.897 519.057 L
S
GR
GS
[0.5 0 0 0.5 0 0] CT
[8 2 4 2] 0 setdash
2 LJ
2 LW
N
824.503 519.057 M
824.667 518.357 L
825.49 516.349 L
826.313 506.038 L
827.137 514.172 L
827.286 519.057 L
S
GR
GS
[0.5 0 0 0.5 0 0] CT
[8 2 4 2] 0 setdash
2 LJ
2 LW
N
830.959 519.057 M
831.253 515.124 L
831.721 519.057 L
S
GR
GS
[0.5 0 0 0.5 0 0] CT
[8 2 4 2] 0 setdash
2 LJ
2 LW
N
833.29 519.057 M
833.723 505.6 L
834.547 498.859 L
835.37 516.724 L
835.49 519.057 L
S
GR
GS
[0.5 0 0 0.5 0 0] CT
[8 2 4 2] 0 setdash
2 LJ
2 LW
N
838.595 519.057 M
838.663 518.001 L
838.749 519.057 L
S
GR
GS
[0.5 0 0 0.5 0 0] CT
[8 2 4 2] 0 setdash
2 LJ
2 LW
N
841.088 519.057 M
841.133 515.263 L
841.957 513.076 L
842.181 519.057 L
S
GR
GS
[0.5 0 0 0.5 0 0] CT
[8 2 4 2] 0 setdash
2 LJ
2 LW
N
844.146 519.057 M
844.427 508.942 L
845.25 502.445 L
845.767 519.057 L
S
GR
GS
[0.5 0 0 0.5 0 0] CT
[8 2 4 2] 0 setdash
2 LJ
2 LW
N
846.47 519.057 M
846.897 508.474 L
847.72 489.751 L
848.543 490.525 L
849.367 511.28 L
849.531 519.057 L
S
GR
GS
[0.5 0 0 0.5 0 0] CT
[8 2 4 2] 0 setdash
2 LJ
2 LW
N
850.704 519.057 M
851.013 500.33 L
851.837 483.393 L
852.66 481.797 L
853.483 498.523 L
853.6 519.057 L
S
GR
GS
[0.5 0 0 0.5 0 0] CT
[8 2 4 2] 0 setdash
2 LJ
2 LW
N
854.841 519.057 M
855.13 452.092 L
855.953 445.756 L
856.777 473.698 L
857.6 474.432 L
858.423 478.615 L
859.247 481.763 L
860.07 478.317 L
860.893 469.82 L
861.717 470.094 L
862.54 465.09 L
863.363 467.93 L
864.187 483.252 L
865.01 477.998 L
865.833 488.997 L
866.657 472.789 L
867.48 478.594 L
868.303 511.771 L
869.127 506.358 L
869.95 484.385 L
870.773 476.171 L
871.597 494.12 L
872.42 512.964 L
872.936 519.057 L
S
GR
GS
[0.5 0 0 0.5 0 0] CT
[8 2 4 2] 0 setdash
2 LJ
2 LW
N
877.163 519.057 M
877.36 513.2 L
878.183 477.546 L
879.007 484.251 L
879.377 519.057 L
S
GR
GS
[0.5 0 0 0.5 0 0] CT
[8 2 4 2] 0 setdash
2 LJ
2 LW
N
885.559 519.057 M
885.593 517.701 L
886.417 509.579 L
887.24 512.632 L
888.063 512.744 L
888.21 519.057 L
S
GR
GS
[0.5 0 0 0.5 0 0] CT
[8 2 4 2] 0 setdash
2 LJ
2 LW
N
889.742 519.057 M
890.533 508.883 L
891.357 504.186 L
892.18 510.556 L
892.574 519.057 L
S
GR
GS
[0.5 0 0 0.5 0 0] CT
[8 2 4 2] 0 setdash
2 LJ
2 LW
N
893.774 519.057 M
893.827 518.419 L
894.65 511.434 L
895.473 511.526 L
896.297 517.358 L
897.12 518.734 L
897.145 519.057 L
S
GR
GS
[0.5 0 0 0.5 0 0] CT
[8 2 4 2] 0 setdash
2 LJ
2 LW
N
899.287 519.057 M
899.59 509.214 L
900.413 508.297 L
900.762 519.057 L
S
GR
GS
[0.5 0 0 0.5 0 0] CT
[8 2 4 2] 0 setdash
2 LJ
2 LW
N
901.447 519.057 M
902.06 476.382 L
902.883 475.513 L
903.498 519.057 L
S
GR
GS
[0.5 0 0 0.5 0 0] CT
[8 2 4 2] 0 setdash
2 LJ
2 LW
N
904.25 519.057 M
904.53 511.46 L
905.23 519.057 L
S
GR
GS
[0.5 0 0 0.5 0 0] CT
[8 2 4 2] 0 setdash
2 LJ
2 LW
N
907.561 519.057 M
907.823 510.078 L
908.647 504.518 L
909.47 508.778 L
910.293 510.883 L
911.117 513.106 L
911.442 519.057 L
S
GR
GS
[0.5 0 0 0.5 0 0] CT
[8 2 4 2] 0 setdash
2 LJ
2 LW
N
914.377 519.057 M
914.41 518.417 L
915.233 502.896 L
916.057 504.076 L
916.88 516.832 L
917.03 519.057 L
S
GR
GS
[0.5 0 0 0.5 0 0] CT
[8 2 4 2] 0 setdash
2 LJ
2 LW
N
920.934 519.057 M
920.997 516.765 L
921.82 518.076 L
922.012 519.057 L
S
GR
GS
[0.5 0 0 0.5 0 0] CT
[8 2 4 2] 0 setdash
2 LJ
2 LW
N
924.988 519.057 M
925.113 510.946 L
925.937 510.039 L
926.498 519.057 L
S
GR
GS
[0.5 0 0 0.5 0 0] CT
[8 2 4 2] 0 setdash
2 LJ
2 LW
N
927.237 519.057 M
927.583 516.011 L
928.211 519.057 L
S
GR
GS
[0.5 0 0 0.5 0 0] CT
[8 2 4 2] 0 setdash
2 LJ
2 LW
N
928.432 519.057 M
929.23 489.668 L
930.053 493.756 L
930.693 519.057 L
S
GR
GS
[0.5 0 0 0.5 0 0] CT
[8 2 4 2] 0 setdash
2 LJ
2 LW
N
939.004 519.057 M
939.11 518.046 L
939.933 518.546 L
939.945 519.057 L
S
GR
GS
[0.5 0 0 0.5 0 0] CT
[8 2 4 2] 0 setdash
2 LJ
2 LW
N
946.444 519.057 M
946.52 517.32 L
947.343 504.789 L
948.167 509.168 L
948.99 517.443 L
949.161 519.057 L
S
GR
GS
[0.5 0 0 0.5 0 0] CT
[8 2 4 2] 0 setdash
2 LJ
2 LW
N
953.415 519.057 M
953.93 511.456 L
954.753 511.452 L
955.099 519.057 L
S
GR
GS
[0.5 0 0 0.5 0 0] CT
[8 2 4 2] 0 setdash
2 LJ
2 LW
N
959.372 519.057 M
959.693 508.791 L
960.517 489.168 L
961.34 495.11 L
962.012 519.057 L
S
GR
GS
[0.5 0 0 0.5 0 0] CT
[8 2 4 2] 0 setdash
2 LJ
2 LW
N
973.662 519.057 M
973.69 518.322 L
973.82 519.057 L
S
GR
GS
[0.5 0 0 0.5 0 0] CT
[8 2 4 2] 0 setdash
2 LJ
2 LW
N
975.325 519.057 M
975.337 518.999 L
975.456 519.057 L
S
GR
GS
[0.5 0 0 0.5 0 0] CT
[8 2 4 2] 0 setdash
2 LJ
2 LW
N
978.56 519.057 M
978.63 515.909 L
979.453 512.479 L
979.675 519.057 L
S
GR
GS
[0.5 0 0 0.5 0 0] CT
[8 2 4 2] 0 setdash
2 LJ
2 LW
N
981.84 519.057 M
981.923 518.486 L
981.988 519.057 L
S
GR
GS
[0.5 0 0 0.5 0 0] CT
[8 2 4 2] 0 setdash
2 LJ
2 LW
N
991.556 519.057 M
991.803 517.788 L
991.829 519.057 L
S
GR
GS
[0.5 0 0 0.5 0 0] CT
[8 2 4 2] 0 setdash
2 LJ
2 LW
N
994.837 519.057 M
995.097 511.331 L
995.92 502.316 L
996.743 518.944 L
996.747 519.057 L
S
GR
GS
[0.5 0 0 0.5 0 0] CT
[8 2 4 2] 0 setdash
2 LJ
2 LW
N
998.247 519.057 M
998.39 513.454 L
999.213 503.131 L
1000.037 503.648 L
1000.86 512.588 L
1001.22 519.057 L
S
GR
GS
[0.5 0 0 0.5 0 0] CT
[8 2 4 2] 0 setdash
2 LJ
2 LW
N
1012.774 519.057 M
1013.21 509.569 L
1014.033 511.59 L
1014.537 519.057 L
S
GR
GS
[0.5 0 0 0.5 0 0] CT
[8 2 4 2] 0 setdash
2 LJ
2 LW
N
1042.382 519.057 M
1042.85 511.756 L
1043.673 510.011 L
1043.995 519.057 L
S
GR
GS
[0.5 0 0 0.5 0 0] CT
[8 2 4 2] 0 setdash
2 LJ
2 LW
N
1046.836 519.057 M
1046.967 517.797 L
1047.79 502.135 L
1048.613 497.475 L
1049.437 514.835 L
1049.502 519.057 L
S
GR
GS
[0.5 0 0 0.5 0 0] CT
[8 2 4 2] 0 setdash
2 LJ
2 LW
N
1051.578 519.057 M
1051.907 475.472 L
1052.73 451.236 L
1053.553 461.025 L
1054.377 499.272 L
1055.2 487.058 L
1056.023 487.774 L
1056.847 487.282 L
1057.67 484.077 L
1058.493 481.486 L
1059.317 465.112 L
1060.14 461.307 L
1060.963 471.807 L
1061.787 456.618 L
1062.61 459.002 L
1063.433 488.128 L
1064.257 474.748 L
1065.08 479.231 L
1065.903 492.794 L
1066.727 469.294 L
1067.55 470.349 L
1068.152 519.057 L
S
GR
GS
[0.5 0 0 0.5 0 0] CT
[8 2 4 2] 0 setdash
2 LJ
2 LW
N
1069.12 519.057 M
1069.197 517.219 L
1070.02 509.592 L
1070.548 519.057 L
S
GR
GS
[0.5 0 0 0.5 0 0] CT
[8 2 4 2] 0 setdash
2 LJ
2 LW
N
1070.932 519.057 M
1071.667 475.484 L
1072.49 477.077 L
1073.313 515.694 L
1074.137 496.69 L
1074.96 506.935 L
1075.127 519.057 L
S
GR
GS
[0.5 0 0 0.5 0 0] CT
[8 2 4 2] 0 setdash
2 LJ
2 LW
N
1080.993 519.057 M
1081.547 487.175 L
1082.37 490.383 L
1082.791 519.057 L
S
GR
GS
[0.5 0 0 0.5 0 0] CT
[8 2 4 2] 0 setdash
2 LJ
2 LW
N
1090.892 519.057 M
1091.427 509.2 L
1092.25 502.596 L
1093.073 515.798 L
1093.392 519.057 L
S
GR
GS
[0.5 0 0 0.5 0 0] CT
[8 2 4 2] 0 setdash
2 LJ
2 LW
N
1101.627 519.057 M
1102.13 507.726 L
1102.953 513.451 L
1103.066 519.057 L
S
GR
GS
[0.5 0 0 0.5 0 0] CT
[8 2 4 2] 0 setdash
2 LJ
2 LW
N
1111.793 519.057 M
1112.01 501.944 L
1112.833 473.459 L
1113.657 479.529 L
1114.179 519.057 L
S
GR
GS
[0.5 0 0 0.5 0 0] CT
[8 2 4 2] 0 setdash
2 LJ
2 LW
N
1123.413 519.057 M
1123.537 516.24 L
1123.868 519.057 L
S
GR
GS
[0.5 0 0 0.5 0 0] CT
[8 2 4 2] 0 setdash
2 LJ
2 LW
N
1128.309 519.057 M
1128.477 509.999 L
1129.3 511.628 L
1129.822 519.057 L
S
GR
GS
[0.5 0 0 0.5 0 0] CT
[8 2 4 2] 0 setdash
2 LJ
2 LW
N
1130.759 519.057 M
1130.947 517.79 L
1131.065 519.057 L
S
GR
GS
[0.5 0 0 0.5 0 0] CT
[8 2 4 2] 0 setdash
2 LJ
2 LW
N
1137.5 519.057 M
1137.533 516.265 L
1138.357 512.104 L
1138.639 519.057 L
S
GR
GS
[0.5 0 0 0.5 0 0] CT
[8 2 4 2] 0 setdash
2 LJ
2 LW
N
1146.423 519.057 M
1146.59 517.591 L
1147.005 519.057 L
S
GR
GS
[0.5 0 0 0.5 0 0] CT
[8 2 4 2] 0 setdash
2 LJ
2 LW
N
1150.62 519.057 M
1150.707 515.396 L
1151.53 505.474 L
1152.353 517.873 L
1152.406 519.057 L
S
GR
GS
[0.5 0 0 0.5 0 0] CT
1 LJ
3 LW
N
166 391.043 M
166.823 405.127 L
167.647 433.523 L
168.47 423.85 L
169.293 419.672 L
170.117 421.362 L
170.94 421.126 L
171.763 419.742 L
172.587 422.413 L
173.41 418.872 L
174.233 414.973 L
175.057 415.227 L
175.88 420.538 L
176.703 414.781 L
177.527 414.352 L
178.35 414.826 L
179.173 412.137 L
179.997 402.662 L
180.82 402.064 L
181.643 403.622 L
182.467 403.766 L
183.29 404.286 L
184.113 404.156 L
184.937 400.739 L
185.76 396.32 L
186.583 401.188 L
187.407 407.65 L
188.23 407.66 L
189.053 410.356 L
189.877 415.581 L
190.7 414.233 L
191.523 413.803 L
192.347 411.433 L
193.17 412.687 L
193.993 416.201 L
194.817 415.066 L
195.64 413.763 L
196.463 415.154 L
197.287 420.024 L
198.11 401.854 L
198.933 389.567 L
199.757 401.383 L
200.58 423.6 L
201.403 421.629 L
202.227 418.999 L
203.05 417.852 L
203.873 413.177 L
204.697 415.183 L
205.52 419.244 L
206.343 418.46 L
207.167 420.207 L
207.99 406.805 L
208.813 408.526 L
209.637 422.711 L
210.46 418.297 L
211.283 417.197 L
212.107 419.318 L
212.93 418.87 L
213.753 420.328 L
214.577 415.495 L
215.4 409.146 L
216.223 415.512 L
217.047 420.167 L
217.87 414.687 L
218.693 413.061 L
219.517 414.879 L
220.34 404.718 L
221.163 401.129 L
221.987 409.815 L
222.81 410.085 L
223.633 410.395 L
224.457 402.497 L
225.28 394.78 L
226.103 402.144 L
226.927 406.614 L
227.75 404.129 L
228.573 399.726 L
229.397 398.672 L
230.22 397.467 L
231.043 395.984 L
231.867 394.445 L
232.69 396.771 L
233.513 397.194 L
234.337 389.925 L
235.16 391.186 L
235.983 393.94 L
236.807 392.053 L
237.63 391.733 L
238.453 388.357 L
239.277 386.234 L
240.1 382.091 L
240.923 381.115 L
241.747 382.849 L
242.57 378.834 L
243.393 376.78 L
244.217 371.952 L
245.04 367.437 L
245.863 364.064 L
246.687 359.895 L
247.51 356.858 L
248.333 357.261 L
249.157 356.38 L
249.98 353.595 L
250.803 355.541 L
251.627 352.942 L
252.45 346.61 L
253.273 345.826 L
254.097 345.734 L
254.92 340.397 L
255.743 333.645 L
256.567 328.506 L
257.39 326.341 L
258.213 323.51 L
259.037 320.409 L
259.86 309.941 L
260.683 299.872 L
261.507 289.246 L
262.33 273.72 L
263.153 242.355 L
263.977 62.683 L
264.8 45 L
265.623 58.984 L
266.447 231.585 L
267.27 270.876 L
268.093 289.76 L
268.917 300.003 L
269.74 305.413 L
270.563 313.913 L
271.387 328.797 L
272.21 335.708 L
273.033 335.559 L
273.857 336.596 L
274.68 342.123 L
275.503 350.054 L
276.327 354.016 L
277.15 355.989 L
277.973 355.54 L
278.797 357.295 L
279.62 361.93 L
280.443 364.909 L
281.267 369.676 L
282.09 369.411 L
282.913 368.632 L
283.737 371.787 L
284.56 376.172 L
285.383 377.68 L
286.207 378.644 L
287.03 382.146 L
287.853 383.428 L
288.677 383.252 L
289.5 385.61 L
290.323 387.178 L
291.147 386.695 L
291.97 388.627 L
292.793 389.425 L
293.617 389.706 L
294.44 392.958 L
295.263 392.521 L
296.087 394.161 L
296.91 396.356 L
297.733 393.161 L
298.557 393.254 L
299.38 392.798 L
300.203 396.051 L
301.027 399.066 L
301.85 398.213 L
302.673 401.054 L
303.497 402.544 L
304.32 395.451 L
305.143 400.671 L
305.967 410.776 L
306.79 411.902 L
307.613 408.603 L
308.437 398.454 L
309.26 402.688 L
310.083 416.027 L
310.907 411.897 L
311.73 408.656 L
312.553 413.837 L
313.377 418.364 L
314.2 411.419 L
315.023 412.115 L
315.847 418.766 L
316.67 422.872 L
317.493 421.456 L
318.317 421.159 L
319.14 420.934 L
319.963 424.464 L
320.787 415.536 L
321.61 411.87 L
322.433 421.819 L
323.257 421.22 L
324.08 423.237 L
324.903 422.654 L
325.727 422.083 L
326.55 425.795 L
327.373 427.361 L
328.197 428.941 L
329.02 431.332 L
329.843 416.159 L
330.667 404.238 L
331.49 414.01 L
332.313 432.555 L
333.137 426.826 L
333.96 424.111 L
334.783 426.92 L
335.607 433.54 L
336.43 426.396 L
337.253 424.227 L
338.077 430.82 L
338.9 427.672 L
339.723 427.827 L
340.547 427.67 L
341.37 428.084 L
342.193 432.272 L
343.017 427.819 L
343.84 415.77 L
344.663 419.542 L
345.487 431.253 L
346.31 431.051 L
347.133 430.067 L
347.957 431.133 L
348.78 431.461 L
349.603 429.651 L
350.427 433.336 L
351.25 437.076 L
352.073 432.861 L
352.897 429.564 L
353.72 437.985 L
354.543 436.47 L
355.367 432.141 L
356.19 433.298 L
357.013 436.889 L
357.837 436.659 L
358.66 437.862 L
359.483 438.756 L
360.307 437.073 L
361.13 438.507 L
361.953 443.835 L
362.777 438.799 L
363.6 414.787 L
364.423 420.412 L
365.247 443.731 L
366.07 439.382 L
366.893 434.406 L
367.717 429.853 L
368.54 430.095 L
369.363 429.18 L
370.187 431.471 L
371.01 427.487 L
371.833 420.489 L
372.657 415.838 L
373.48 417.633 L
374.303 419.344 L
375.127 421.525 L
375.95 423.981 L
376.773 424.498 L
377.597 407.942 L
378.42 407.757 L
379.243 411.496 L
380.067 408.076 L
380.89 408.992 L
381.713 408.152 L
382.537 407.672 L
383.36 405.629 L
384.183 408.509 L
385.007 410.344 L
385.83 409.499 L
386.653 413.066 L
387.477 419.179 L
388.3 419.74 L
389.123 422.562 L
389.947 423.613 L
390.77 425.396 L
391.593 425.817 L
392.417 423.775 L
393.24 419.957 L
394.063 418.366 L
394.887 423.928 L
395.71 406.298 L
396.533 392.511 L
397.357 404.033 L
398.18 428.801 L
399.003 427.284 L
399.827 426.22 L
400.65 428.002 L
401.473 429.426 L
402.297 431.731 L
403.12 432.355 L
403.943 428.149 L
404.767 425.57 L
405.59 427.663 L
406.413 432.991 L
407.237 441.863 L
408.06 441.51 L
408.883 439.31 L
409.707 442.343 L
410.53 441.671 L
411.353 443.259 L
412.177 443.943 L
413 442.638 L
413.823 448.399 L
414.647 450.098 L
415.47 449.446 L
416.293 446.06 L
417.117 443.49 L
417.94 448.561 L
418.763 448.664 L
419.587 448.784 L
420.41 452.55 L
421.233 457.997 L
422.057 451.448 L
422.88 441.496 L
423.703 448.78 L
424.527 457.555 L
425.35 452.45 L
426.173 452.26 L
426.997 452.454 L
427.82 449.071 L
428.643 452.168 L
429.467 451.602 L
430.29 454.369 L
431.113 457.888 L
431.937 457.843 L
432.76 460.333 L
433.583 451.304 L
434.407 447.932 L
435.23 458.4 L
436.053 458.416 L
436.877 457.467 L
437.7 459.576 L
438.523 462.042 L
439.347 463.798 L
440.17 459.322 L
440.993 461.701 L
441.817 464.584 L
442.64 463.636 L
443.463 465.245 L
444.287 460.955 L
445.11 462.626 L
445.933 466.56 L
446.757 461.471 L
447.58 460.34 L
448.403 465.154 L
449.227 465.802 L
450.05 464.813 L
450.873 464.738 L
451.697 464.326 L
452.52 463.889 L
453.343 465.875 L
454.167 463.509 L
454.99 461.552 L
455.813 464.148 L
456.637 463.289 L
457.46 460.523 L
458.283 460.036 L
459.107 458.198 L
459.93 455.149 L
460.753 443.614 L
461.577 412.141 L
462.4 401.197 L
463.223 416.136 L
464.047 457.981 L
464.87 464.822 L
465.693 463.137 L
466.517 464.836 L
467.34 466.61 L
468.163 465.874 L
468.987 466.799 L
469.81 466.391 L
470.633 467.134 L
471.457 470.939 L
472.28 469.744 L
473.103 469.349 L
473.927 468.825 L
474.75 468.393 L
475.573 468.886 L
476.397 470.85 L
477.22 468.329 L
478.043 464.166 L
478.867 463.627 L
479.69 467.079 L
480.513 466.995 L
481.337 468.701 L
482.16 471.662 L
482.983 471.815 L
483.807 468.78 L
484.63 465.734 L
485.453 469.453 L
486.277 469.806 L
487.1 467.29 L
487.923 469.367 L
488.747 472.21 L
489.57 473.074 L
490.393 461.493 L
491.217 460.797 L
492.04 472.991 L
492.863 470.011 L
493.687 469.031 L
494.51 468.535 L
495.333 466.102 L
496.157 468.235 L
496.98 466.717 L
497.803 466.796 L
498.627 469.985 L
499.45 469.155 L
500.273 471.942 L
501.097 466.757 L
501.92 455.462 L
502.743 460.973 L
503.567 472.728 L
504.39 472.084 L
505.213 467.16 L
506.037 462.604 L
506.86 465.479 L
507.683 465.728 L
508.507 464.818 L
509.33 466.373 L
510.153 466.361 L
510.977 466.926 L
511.8 464.987 L
512.623 466.898 L
513.447 466.439 L
514.27 462.66 L
515.093 464.767 L
515.917 460.369 L
516.74 457.908 L
517.563 460.781 L
518.387 454.368 L
519.21 450.44 L
520.033 453.82 L
520.857 455.058 L
521.68 455.588 L
522.503 451.933 L
523.327 449.792 L
524.15 456.42 L
524.973 459.174 L
525.797 456.288 L
526.62 457.101 L
527.443 435.11 L
528.267 422.338 L
529.09 434.651 L
529.913 456.526 L
530.737 453.195 L
531.56 452.099 L
532.383 452.972 L
533.207 453.349 L
534.03 449.846 L
534.853 448.907 L
535.677 450.411 L
536.5 451.595 L
537.323 450.932 L
538.147 444.926 L
538.97 442.898 L
539.793 444.149 L
540.617 443.727 L
541.44 435.374 L
542.263 435.472 L
543.087 441.545 L
543.91 444.81 L
544.733 442.917 L
545.557 443.143 L
546.38 447.35 L
547.203 441.656 L
548.027 446.671 L
548.85 455.38 L
549.673 456.465 L
550.497 456.773 L
551.32 457.169 L
552.143 454.272 L
552.967 455.458 L
553.79 463.616 L
554.613 467.661 L
555.437 467.747 L
556.26 469.199 L
557.083 468.861 L
557.907 467.061 L
558.73 471.28 L
559.553 476.975 L
560.377 478.045 L
561.2 453.204 L
562.023 454.587 L
562.847 487.235 L
563.67 480.633 L
564.493 477.14 L
565.317 475.379 L
566.14 475.563 L
566.963 473.309 L
567.787 473.811 L
568.61 473.221 L
569.433 470.002 L
570.257 469.16 L
571.08 471.919 L
571.903 472.849 L
572.727 470.577 L
573.55 472.343 L
574.373 475.301 L
575.197 462.51 L
576.02 460.592 L
576.843 469.998 L
577.667 466.701 L
578.49 464.547 L
579.313 465.229 L
580.137 465.102 L
580.96 455.27 L
581.783 455.165 L
582.607 459.962 L
583.43 460.68 L
584.253 464.035 L
585.077 468.931 L
585.9 468.376 L
586.723 467.251 L
587.547 467.695 L
588.37 469.579 L
589.193 471.057 L
590.017 470.246 L
590.84 466.353 L
591.663 466.651 L
592.487 473.928 L
593.31 457.532 L
594.133 444.49 L
594.957 455.333 L
595.78 475.709 L
596.603 474.24 L
597.427 473.489 L
598.25 473.987 L
599.073 471.114 L
599.897 474.863 L
600.72 479.745 L
601.543 476.568 L
602.367 474.624 L
603.19 472.966 L
604.013 474.052 L
604.837 479.605 L
605.66 479.866 L
606.483 480.762 L
607.307 484.007 L
608.13 483.125 L
608.953 484.271 L
609.777 483.458 L
610.6 480.335 L
611.423 485.149 L
612.247 484.708 L
613.07 482.775 L
613.893 485.039 L
614.717 486.988 L
615.54 484.171 L
616.363 482.324 L
617.187 486.365 L
618.01 489.751 L
618.833 489.815 L
619.657 484.585 L
620.48 474.843 L
621.303 479.518 L
622.127 488.725 L
622.95 487.206 L
623.773 484.718 L
624.597 484.064 L
625.42 481.437 L
626.243 480.556 L
627.067 481.712 L
627.89 484.68 L
628.713 485.71 L
629.537 482.138 L
630.36 484.75 L
631.183 485.668 L
632.007 480.739 L
632.83 483.115 L
633.653 486.702 L
634.477 485.296 L
635.3 482.668 L
636.123 484.42 L
636.947 486.239 L
637.77 483.62 L
638.593 484.342 L
639.417 480.795 L
640.24 480.105 L
641.063 485.291 L
641.887 481.384 L
642.71 478.89 L
643.533 481.194 L
644.357 478.882 L
645.18 479.622 L
646.003 483.912 L
646.827 476.789 L
647.65 477.545 L
648.473 484.506 L
649.297 481.244 L
650.12 479.112 L
650.943 478.446 L
651.767 475.847 L
652.59 476.761 L
653.413 478.978 L
654.237 470.433 L
655.06 468.78 L
655.883 474.277 L
656.707 464.764 L
657.53 459.207 L
658.353 446.911 L
659.177 423.288 L
660 408.648 L
660.823 415.013 L
661.647 442.728 L
662.47 455.972 L
663.293 462.299 L
664.117 471.33 L
664.94 470.847 L
665.763 474.362 L
666.587 479.909 L
667.41 480.17 L
668.233 476.704 L
669.057 479.871 L
669.88 480.602 L
670.703 478.83 L
671.527 484.67 L
672.35 487.394 L
673.173 484.573 L
673.997 485.599 L
674.82 484.152 L
675.643 483.779 L
676.467 487.843 L
677.29 491.925 L
678.113 488.155 L
678.937 485.941 L
679.76 488.285 L
680.583 489.719 L
681.407 490.74 L
682.23 491.483 L
683.053 491.716 L
683.877 491.837 L
684.7 490.509 L
685.523 489.771 L
686.347 491.938 L
687.17 471.497 L
687.993 468.582 L
688.817 487.726 L
689.64 494.997 L
690.463 490.303 L
691.287 489.763 L
692.11 493.517 L
692.933 489.33 L
693.757 487.601 L
694.58 488.187 L
695.403 490.344 L
696.227 491.339 L
697.05 490.84 L
697.873 495.208 L
698.697 495.475 L
699.52 483.158 L
700.343 485.372 L
701.167 494.479 L
701.99 494.127 L
702.813 493.606 L
703.637 490.563 L
704.46 491.781 L
705.283 492.368 L
706.107 491.322 L
706.93 494.434 L
707.753 495.167 L
708.577 497.017 L
709.4 496.256 L
710.223 496.904 L
711.047 495.045 L
711.87 493.997 L
712.693 494.353 L
713.517 492.71 L
714.34 493.04 L
715.163 492.678 L
715.987 488.697 L
716.81 484.067 L
717.633 487.184 L
718.457 489.807 L
719.28 488.191 L
720.103 487.336 L
720.927 486.471 L
721.75 488.012 L
722.573 486.468 L
723.397 486.202 L
724.22 486.041 L
725.043 468.653 L
725.867 456.627 L
726.69 467.986 L
727.513 489.198 L
728.337 483.33 L
729.16 480.231 L
729.983 482.101 L
730.807 484.386 L
731.63 484.125 L
732.453 481.036 L
733.277 479.606 L
734.1 477.772 L
734.923 477.862 L
735.747 473.914 L
736.57 471.099 L
737.393 473.188 L
738.217 475.556 L
739.04 470.971 L
739.863 468.886 L
740.687 473.952 L
741.51 475.938 L
742.333 472.394 L
743.157 471.645 L
743.98 475.103 L
744.803 468.248 L
745.627 472.224 L
746.45 484.396 L
747.273 485.752 L
748.097 484.421 L
748.92 483.322 L
749.743 483.546 L
750.567 483.116 L
751.39 487.704 L
752.213 490.164 L
753.037 491.24 L
753.86 490.23 L
754.683 491.165 L
755.507 491.684 L
756.33 492.235 L
757.153 496 L
757.977 498.161 L
758.8 477.817 L
759.623 473.726 L
760.447 490.17 L
761.27 496.208 L
762.093 490.505 L
762.917 489.447 L
763.74 490.208 L
764.563 489.626 L
765.387 485.525 L
766.21 484.3 L
767.033 479.73 L
767.857 471.631 L
768.68 472.949 L
769.503 479.541 L
770.327 478.749 L
771.15 479.371 L
771.973 479.578 L
772.797 462.72 L
773.62 458.988 L
774.443 470.698 L
775.267 466.459 L
776.09 463.677 L
776.913 462.678 L
777.737 464.714 L
778.56 459.653 L
779.383 459.853 L
780.207 464.233 L
781.03 466.245 L
781.853 467.564 L
782.677 472.678 L
783.5 473.234 L
784.323 473.122 L
785.147 477.419 L
785.97 479.934 L
786.793 478.303 L
787.617 478.503 L
788.44 476.791 L
789.263 474.647 L
790.087 481.186 L
790.91 461.839 L
791.733 448.272 L
792.557 459.568 L
793.38 483.25 L
794.203 484.442 L
795.027 484.236 L
795.85 487.811 L
796.673 484.368 L
797.497 483.52 L
798.32 483.619 L
799.143 481.277 L
799.967 484.122 L
800.79 487.38 L
801.613 490.258 L
802.437 495.627 L
803.26 490.557 L
804.083 487.589 L
804.907 491.171 L
805.73 489.801 L
806.553 491.697 L
807.377 489.856 L
808.2 488.739 L
809.023 495.667 L
809.847 496.468 L
810.67 495.635 L
811.493 495.351 L
812.317 494.898 L
813.14 497.324 L
813.963 497.523 L
814.787 496.453 L
815.61 498.296 L
816.433 501.032 L
817.257 498.421 L
818.08 488.855 L
818.903 491.049 L
819.727 498.673 L
820.55 498.119 L
821.373 497.245 L
822.197 496.077 L
823.02 493.812 L
823.843 496.269 L
824.667 498.79 L
825.49 501.101 L
826.313 501.257 L
827.137 500.618 L
827.96 503.748 L
828.783 501.65 L
829.607 493.874 L
830.43 498.192 L
831.253 505.436 L
832.077 503.99 L
832.9 501.314 L
833.723 500.416 L
834.547 505.125 L
835.37 504.379 L
836.193 501.931 L
837.017 502.028 L
837.84 501.85 L
838.663 503.171 L
839.487 499.878 L
840.31 500.051 L
841.133 505.001 L
841.957 503.982 L
842.78 501.593 L
843.603 503.459 L
844.427 503.031 L
845.25 502.589 L
846.073 502.898 L
846.897 500.199 L
847.72 500.465 L
848.543 501.16 L
849.367 498.972 L
850.19 493.379 L
851.013 494.938 L
851.837 500.3 L
852.66 494.492 L
853.483 487.066 L
854.307 486.238 L
855.13 479.051 L
855.953 466.095 L
856.777 446.551 L
857.6 437.457 L
858.423 446.716 L
859.247 469.285 L
860.07 485.596 L
860.893 484.426 L
861.717 485.003 L
862.54 497.194 L
863.363 498.071 L
864.187 495.376 L
865.01 495.552 L
865.833 498.947 L
866.657 499.388 L
867.48 501.169 L
868.303 500.516 L
869.127 498.962 L
869.95 501.64 L
870.773 502.56 L
871.597 503.524 L
872.42 498.77 L
873.243 498.422 L
874.067 504.142 L
874.89 504.784 L
875.713 498.148 L
876.537 497.659 L
877.36 503.444 L
878.183 501.405 L
879.007 501.59 L
879.83 501.254 L
880.653 504.266 L
881.477 506.551 L
882.3 503.358 L
883.123 502.4 L
883.947 501.671 L
884.77 504.799 L
885.593 502.566 L
886.417 498.134 L
887.24 502.613 L
888.063 502.584 L
888.887 504.259 L
889.71 505.474 L
890.533 502.962 L
891.357 504.193 L
892.18 503.83 L
893.003 502.912 L
893.827 504.774 L
894.65 506.018 L
895.473 501.005 L
896.297 493.213 L
897.12 492.076 L
897.943 499.155 L
898.767 508.375 L
899.59 506.118 L
900.413 504.602 L
901.237 502.685 L
902.06 503.631 L
902.883 501.012 L
903.707 499.02 L
904.53 502.203 L
905.353 502.58 L
906.177 501.593 L
907 498.789 L
907.823 500.346 L
908.647 499.999 L
909.47 496.791 L
910.293 497.599 L
911.117 499.855 L
911.94 497.854 L
912.763 493.509 L
913.587 489.295 L
914.41 485.303 L
915.233 485.245 L
916.057 487.511 L
916.88 487.37 L
917.703 484.727 L
918.527 484.651 L
919.35 486.075 L
920.173 487.566 L
920.997 491.699 L
921.82 490.492 L
922.643 466.445 L
923.467 454.665 L
924.29 467.06 L
925.113 487.675 L
925.937 482.978 L
926.76 482.399 L
927.583 485.663 L
928.407 488.464 L
929.23 488.976 L
930.053 485.164 L
930.877 482.785 L
931.7 481.507 L
932.523 483.535 L
933.347 479.478 L
934.17 475.634 L
934.993 476.595 L
935.817 476.489 L
936.64 472.838 L
937.463 472.284 L
938.287 478.501 L
939.11 480.349 L
939.933 479.728 L
940.757 481.078 L
941.58 485.035 L
942.403 477.985 L
943.227 481.178 L
944.05 496.747 L
944.873 498.549 L
945.697 496.608 L
946.52 491.577 L
947.343 490.578 L
948.167 490.769 L
948.99 493.613 L
949.813 498.244 L
950.637 500.842 L
951.46 498.257 L
952.283 500.632 L
953.107 501.972 L
953.93 502.396 L
954.753 510.832 L
955.577 510.019 L
956.4 497.504 L
957.223 486.28 L
958.047 494.034 L
958.87 510.046 L
959.693 505.859 L
960.517 502.585 L
961.34 501.635 L
962.163 503.203 L
962.987 502.085 L
963.81 500.613 L
964.633 493.882 L
965.457 488.337 L
966.28 491.345 L
967.103 495.952 L
967.927 494.675 L
968.75 494.198 L
969.573 493.771 L
970.397 486.76 L
971.22 484.055 L
972.043 489.288 L
972.867 487.553 L
973.69 485.923 L
974.513 486.539 L
975.337 489.406 L
976.16 484.138 L
976.983 483.271 L
977.807 485.288 L
978.63 485.821 L
979.453 489.5 L
980.277 492.097 L
981.1 491.86 L
981.923 491.707 L
982.747 492.233 L
983.57 494.329 L
984.393 496.794 L
985.217 495.609 L
986.04 492.699 L
986.863 495.42 L
987.687 500.729 L
988.51 480.968 L
989.333 469.531 L
990.157 481.114 L
990.98 500.724 L
991.803 500.082 L
992.627 499.489 L
993.45 499.904 L
994.273 500.27 L
995.097 498.397 L
995.92 497.214 L
996.743 495.813 L
997.567 495.962 L
998.39 499.104 L
999.213 499.484 L
1000.037 501.715 L
1000.86 502.96 L
1001.683 503.386 L
1002.507 506.719 L
1003.33 504.46 L
1004.153 505.704 L
1004.977 502.743 L
1005.8 503.998 L
1006.623 511.955 L
1007.447 512.281 L
1008.27 509.14 L
1009.093 509.464 L
1009.917 509.145 L
1010.74 508.557 L
1011.563 507.496 L
1012.387 508.166 L
1013.21 512.236 L
1014.033 513.933 L
1014.857 512.126 L
1015.68 503.723 L
1016.503 505.056 L
1017.327 514.388 L
1018.15 511.121 L
1018.973 511.785 L
1019.797 510.912 L
1020.62 507.896 L
1021.443 508.596 L
1022.267 509.327 L
1023.09 511.103 L
1023.913 512.889 L
1024.737 508.144 L
1025.56 508.948 L
1026.383 511.856 L
1027.207 507.444 L
1028.03 509.063 L
1028.853 514.924 L
1029.677 513.947 L
1030.5 508.654 L
1031.323 508.915 L
1032.147 512.167 L
1032.97 511.483 L
1033.793 511.167 L
1034.617 510.536 L
1035.44 510.589 L
1036.263 512.407 L
1037.087 511.546 L
1037.91 507.989 L
1038.733 509.402 L
1039.557 512.287 L
1040.38 509.857 L
1041.203 507.908 L
1042.027 508.403 L
1042.85 509.504 L
1043.673 509.132 L
1044.497 508.164 L
1045.32 502.955 L
1046.143 502.377 L
1046.967 507.903 L
1047.79 506.53 L
1048.613 503.225 L
1049.437 502.08 L
1050.26 496.903 L
1051.083 492.885 L
1051.907 489.369 L
1052.73 479.379 L
1053.553 469.592 L
1054.377 452.093 L
1055.2 440.165 L
1056.023 442.84 L
1056.847 459.185 L
1057.67 474.879 L
1058.493 488.085 L
1059.317 483.32 L
1060.14 481.103 L
1060.963 497.44 L
1061.787 499.951 L
1062.61 501.357 L
1063.433 498.326 L
1064.257 496.476 L
1065.08 501.694 L
1065.903 510.478 L
1066.727 506.98 L
1067.55 506.197 L
1068.373 510.969 L
1069.197 505.706 L
1070.02 505.816 L
1070.843 508.591 L
1071.667 509.722 L
1072.49 511.801 L
1073.313 511.955 L
1074.137 505.603 L
1074.96 508.159 L
1075.783 514.357 L
1076.607 514.359 L
1077.43 514.547 L
1078.253 515.73 L
1079.077 513.619 L
1079.9 512.55 L
1080.723 514.932 L
1081.547 514.868 L
1082.37 515.141 L
1083.193 514.42 L
1084.017 508.754 L
1084.84 511.527 L
1085.663 512.985 L
1086.487 513.958 L
1087.31 515.575 L
1088.133 513.175 L
1088.957 511.94 L
1089.78 510.821 L
1090.603 513.53 L
1091.427 513.693 L
1092.25 511.55 L
1093.073 512.635 L
1093.897 513.537 L
1094.72 506.232 L
1095.543 507.751 L
1096.367 519 L
1097.19 517.944 L
1098.013 517.302 L
1098.837 511.608 L
1099.66 510.642 L
1100.483 514.4 L
1101.307 514.848 L
1102.13 513.92 L
1102.953 514.529 L
1103.777 515.165 L
1104.6 500.883 L
1105.423 501.188 L
1106.247 515.267 L
1107.07 511.845 L
1107.893 511.071 L
1108.717 512.862 L
1109.54 510.064 L
1110.363 508.512 L
1111.187 507.489 L
1112.01 500.851 L
1112.833 503.07 L
1113.657 509.3 L
1114.48 505.485 L
1115.303 501.672 L
1116.127 501.359 L
1116.95 503.055 L
1117.773 505.139 L
1118.597 507.605 L
1119.42 508.261 L
1120.243 488.168 L
1121.067 476.569 L
1121.89 488.93 L
1122.713 510.141 L
1123.537 503.646 L
1124.36 501.456 L
1125.183 503.866 L
1126.007 504.266 L
1126.83 502.007 L
1127.653 499.518 L
1128.477 500.961 L
1129.3 500.348 L
1130.123 497.777 L
1130.947 494.593 L
1131.77 493.219 L
1132.593 493.163 L
1133.417 490.919 L
1134.24 486.177 L
1135.063 486.573 L
1135.887 493.854 L
1136.71 496.366 L
1137.533 496.639 L
1138.357 492.21 L
1139.18 494.763 L
1140.003 491.756 L
1140.827 493.899 L
1141.65 506.817 L
1142.473 505.478 L
1143.297 506.457 L
1144.12 504.63 L
1144.943 505.123 L
1145.767 504.035 L
1146.59 503.834 L
1147.413 509.212 L
1148.237 512.855 L
1149.06 511.498 L
1149.883 511.006 L
1150.707 514.488 L
1151.53 513.542 L
1152.353 516.253 L
1153.177 518.085 L
1154 510.612 L
S
GR
GS
[0.5 0 0 0.5 0 0] CT
1 GC
N
1138 137 M
1138 61 L
888 61 L
888 137 L
cp
f
GR
GS
[0.5 0 0 0.5 479 41.5] CT
N
/f-990293328{2.797 -0.266 M
2.797 -0.391 2.828 -0.469 QT
4.719 -6.641 L
3.094 -6.641 L
2.438 -6.641 1.867 -6.227 QT
1.297 -5.813 0.922 -5.188 QT
0.875 -5.109 0.813 -5.109 QT
0.594 -5.109 L
0.438 -5.109 0.438 -5.297 QT
0.438 -5.328 0.469 -5.391 QT
1.063 -6.406 1.734 -7.086 QT
2.406 -7.766 3.25 -7.766 QT
8.766 -7.766 L
8.953 -7.766 9.086 -7.633 QT
9.219 -7.5 9.219 -7.297 QT
9.219 -7.047 9.031 -6.844 QT
8.844 -6.641 8.563 -6.641 QT
5.313 -6.641 L
4.109 -0.438 L
4.031 -0.141 3.836 0.047 QT
3.641 0.234 3.344 0.234 QT
3.125 0.234 2.961 0.094 QT
2.797 -0.047 2.797 -0.266 QT
cp}def
f-990293328
f
GR
GS
[0.5 0 0 0.5 483 41.5] CT
/Helvetica 18 F
GS
[1 0 0 1 0 0] CT
0 0 moveto 
1 -1 scale
( = 0.1, ) t 
GR
GR
GS
[0.5 0 0 0.5 511 41.5] CT
N
/f-1732591168{0.969 0 M
0.828 0 0.828 -0.141 QT
0.828 -0.156 0.836 -0.164 QT
0.844 -0.172 0.844 -0.203 QT
7.047 -12.688 L
7.125 -12.891 7.359 -12.891 QT
7.609 -12.891 L
7.859 -12.891 7.938 -12.688 QT
14.141 -0.203 L
14.141 -0.188 14.148 -0.172 QT
14.156 -0.156 14.156 -0.141 QT
14.156 0 14 0 QT
0.969 0 L
cp
2.156 -1.438 M
11.641 -1.438 L
6.906 -11 L
2.156 -1.438 L
cp}def
f-1732591168
f
GR
GS
[0.5 0 0 0.5 518.5 41.5] CT
/Helvetica 18 F
GS
[1 0 0 1 0 0] CT
0 0 moveto 
1 -1 scale
(x = 0.1) t 
GR
GR
GS
[0.5 0 0 0.5 0 0] CT
0.502 GC
[8 2 4 2] 0 setdash
2 LJ
2 LW
N
893.988 75.405 M
953.868 75.405 L
S
GR
GS
[0.5 0 0 0.5 479 53.5] CT
N
f-990293328
f
GR
GS
[0.5 0 0 0.5 483 53.5] CT
/Helvetica 18 F
GS
[1 0 0 1 0 0] CT
0 0 moveto 
1 -1 scale
( = 0.05, ) t 
GR
GR
GS
[0.5 0 0 0.5 516 53.5] CT
N
f-1732591168
f
GR
GS
[0.5 0 0 0.5 523.5 53.5] CT
/Helvetica 18 F
GS
[1 0 0 1 0 0] CT
0 0 moveto 
1 -1 scale
(x = 0.01) t 
GR
GR
GS
[0.5 0 0 0.5 0 0] CT
[8 2 4 2] 0 setdash
2 LJ
2 LW
N
893.988 99 M
953.868 99 L
S
GR
GS
[0.5 0 0 0.5 479 65.5] CT
N
f-990293328
f
GR
GS
[0.5 0 0 0.5 483 65.5] CT
/Helvetica 18 F
GS
[1 0 0 1 0 0] CT
0 0 moveto 
1 -1 scale
( = 0.025, ) t 
GR
GR
GS
[0.5 0 0 0.5 521 65.5] CT
N
f-1732591168
f
GR
GS
[0.5 0 0 0.5 528.5 65.5] CT
/Helvetica 18 F
GS
[1 0 0 1 0 0] CT
0 0 moveto 
1 -1 scale
(x = 0.001) t 
GR
GR
GS
[0.5 0 0 0.5 0 0] CT
1 LJ
3 LW
N
893.988 122.595 M
953.868 122.595 L
S
GR
GS
[0.5 0 0 0.5 0 0] CT
0.149 GC
10.0 ML
N
888 137 M
888 61 L
1138 61 L
1138 137 L
cp
S
GR
%%Trailer
%%Pages: 1
%%EOF
