%!PS-Adobe-3.0 EPSF-3.0
%%Creator: (MATLAB, The Mathworks, Inc. Version 9.6.0.1072779 \(R2019a\). Operating System: Windows 10)
%%Title: C:/Users/ngovinda/Documents/koopman-periodic-approximation/scripts/untitled.eps
%%CreationDate: 2020-04-22T17:20:20
%%Pages: (atend)
%%BoundingBox: 0 0 638 300
%%LanguageLevel: 3
%%EndComments
%%BeginProlog
%%BeginResource: procset (Apache XML Graphics Std ProcSet) 1.2 0
%%Version: 1.2 0
%%Copyright: (Copyright 2001-2003,2010 The Apache Software Foundation. License terms: http://www.apache.org/licenses/LICENSE-2.0)
/bd{bind def}bind def
/ld{load def}bd
/GR/grestore ld
/GS/gsave ld
/RM/rmoveto ld
/C/curveto ld
/t/show ld
/L/lineto ld
/ML/setmiterlimit ld
/CT/concat ld
/f/fill ld
/N/newpath ld
/S/stroke ld
/CC/setcmykcolor ld
/A/ashow ld
/cp/closepath ld
/RC/setrgbcolor ld
/LJ/setlinejoin ld
/GC/setgray ld
/LW/setlinewidth ld
/M/moveto ld
/re {4 2 roll M
1 index 0 rlineto
0 exch rlineto
neg 0 rlineto
cp } bd
/_ctm matrix def
/_tm matrix def
/BT { _ctm currentmatrix pop matrix _tm copy pop 0 0 moveto } bd
/ET { _ctm setmatrix } bd
/iTm { _ctm setmatrix _tm concat } bd
/Tm { _tm astore pop iTm 0 0 moveto } bd
/ux 0.0 def
/uy 0.0 def
/F {
  /Tp exch def
  /Tf exch def
  Tf findfont Tp scalefont setfont
  /cf Tf def  /cs Tp def
} bd
/ULS {currentpoint /uy exch def /ux exch def} bd
/ULE {
  /Tcx currentpoint pop def
  gsave
  newpath
  cf findfont cs scalefont dup
  /FontMatrix get 0 get /Ts exch def /FontInfo get dup
  /UnderlinePosition get Ts mul /To exch def
  /UnderlineThickness get Ts mul /Tt exch def
  ux uy To add moveto  Tcx uy To add lineto
  Tt setlinewidth stroke
  grestore
} bd
/OLE {
  /Tcx currentpoint pop def
  gsave
  newpath
  cf findfont cs scalefont dup
  /FontMatrix get 0 get /Ts exch def /FontInfo get dup
  /UnderlinePosition get Ts mul /To exch def
  /UnderlineThickness get Ts mul /Tt exch def
  ux uy To add cs add moveto Tcx uy To add cs add lineto
  Tt setlinewidth stroke
  grestore
} bd
/SOE {
  /Tcx currentpoint pop def
  gsave
  newpath
  cf findfont cs scalefont dup
  /FontMatrix get 0 get /Ts exch def /FontInfo get dup
  /UnderlinePosition get Ts mul /To exch def
  /UnderlineThickness get Ts mul /Tt exch def
  ux uy To add cs 10 mul 26 idiv add moveto Tcx uy To add cs 10 mul 26 idiv add lineto
  Tt setlinewidth stroke
  grestore
} bd
/QT {
/Y22 exch store
/X22 exch store
/Y21 exch store
/X21 exch store
currentpoint
/Y21 load 2 mul add 3 div exch
/X21 load 2 mul add 3 div exch
/X21 load 2 mul /X22 load add 3 div
/Y21 load 2 mul /Y22 load add 3 div
/X22 load /Y22 load curveto
} bd
/SSPD {
dup length /d exch dict def
{
/v exch def
/k exch def
currentpagedevice k known {
/cpdv currentpagedevice k get def
v cpdv ne {
/upd false def
/nullv v type /nulltype eq def
/nullcpdv cpdv type /nulltype eq def
nullv nullcpdv or
{
/upd true def
} {
/sametype v type cpdv type eq def
sametype {
v type /arraytype eq {
/vlen v length def
/cpdvlen cpdv length def
vlen cpdvlen eq {
0 1 vlen 1 sub {
/i exch def
/obj v i get def
/cpdobj cpdv i get def
obj cpdobj ne {
/upd true def
exit
} if
} for
} {
/upd true def
} ifelse
} {
v type /dicttype eq {
v {
/dv exch def
/dk exch def
/cpddv cpdv dk get def
dv cpddv ne {
/upd true def
exit
} if
} forall
} {
/upd true def
} ifelse
} ifelse
} if
} ifelse
upd true eq {
d k v put
} if
} if
} if
} forall
d length 0 gt {
d setpagedevice
} if
} bd
/RE { % /NewFontName [NewEncodingArray] /FontName RE -
  findfont dup length dict begin
  {
    1 index /FID ne
    {def} {pop pop} ifelse
  } forall
  /Encoding exch def
  /FontName 1 index def
  currentdict definefont pop
  end
} bind def
%%EndResource
%%BeginResource: procset (Apache XML Graphics EPS ProcSet) 1.0 0
%%Version: 1.0 0
%%Copyright: (Copyright 2002-2003 The Apache Software Foundation. License terms: http://www.apache.org/licenses/LICENSE-2.0)
/BeginEPSF { %def
/b4_Inc_state save def         % Save state for cleanup
/dict_count countdictstack def % Count objects on dict stack
/op_count count 1 sub def      % Count objects on operand stack
userdict begin                 % Push userdict on dict stack
/showpage { } def              % Redefine showpage, { } = null proc
0 setgray 0 setlinecap         % Prepare graphics state
1 setlinewidth 0 setlinejoin
10 setmiterlimit [ ] 0 setdash newpath
/languagelevel where           % If level not equal to 1 then
{pop languagelevel             % set strokeadjust and
1 ne                           % overprint to their defaults.
{false setstrokeadjust false setoverprint
} if
} if
} bd
/EndEPSF { %def
count op_count sub {pop} repeat            % Clean up stacks
countdictstack dict_count sub {end} repeat
b4_Inc_state restore
} bd
%%EndResource
%FOPBeginFontDict
%%IncludeResource: font Courier-Oblique
%%IncludeResource: font Courier-BoldOblique
%%IncludeResource: font Courier-Bold
%%IncludeResource: font ZapfDingbats
%%IncludeResource: font Symbol
%%IncludeResource: font Helvetica
%%IncludeResource: font Helvetica-Oblique
%%IncludeResource: font Helvetica-Bold
%%IncludeResource: font Helvetica-BoldOblique
%%IncludeResource: font Times-Roman
%%IncludeResource: font Times-Italic
%%IncludeResource: font Times-Bold
%%IncludeResource: font Times-BoldItalic
%%IncludeResource: font Courier
%FOPEndFontDict
%%BeginResource: encoding WinAnsiEncoding
/WinAnsiEncoding [
/.notdef /.notdef /.notdef /.notdef /.notdef
/.notdef /.notdef /.notdef /.notdef /.notdef
/.notdef /.notdef /.notdef /.notdef /.notdef
/.notdef /.notdef /.notdef /.notdef /.notdef
/.notdef /.notdef /.notdef /.notdef /.notdef
/.notdef /.notdef /.notdef /.notdef /.notdef
/.notdef /.notdef /space /exclam /quotedbl
/numbersign /dollar /percent /ampersand /quotesingle
/parenleft /parenright /asterisk /plus /comma
/hyphen /period /slash /zero /one
/two /three /four /five /six
/seven /eight /nine /colon /semicolon
/less /equal /greater /question /at
/A /B /C /D /E
/F /G /H /I /J
/K /L /M /N /O
/P /Q /R /S /T
/U /V /W /X /Y
/Z /bracketleft /backslash /bracketright /asciicircum
/underscore /quoteleft /a /b /c
/d /e /f /g /h
/i /j /k /l /m
/n /o /p /q /r
/s /t /u /v /w
/x /y /z /braceleft /bar
/braceright /asciitilde /bullet /Euro /bullet
/quotesinglbase /florin /quotedblbase /ellipsis /dagger
/daggerdbl /circumflex /perthousand /Scaron /guilsinglleft
/OE /bullet /Zcaron /bullet /bullet
/quoteleft /quoteright /quotedblleft /quotedblright /bullet
/endash /emdash /asciitilde /trademark /scaron
/guilsinglright /oe /bullet /zcaron /Ydieresis
/space /exclamdown /cent /sterling /currency
/yen /brokenbar /section /dieresis /copyright
/ordfeminine /guillemotleft /logicalnot /sfthyphen /registered
/macron /degree /plusminus /twosuperior /threesuperior
/acute /mu /paragraph /middot /cedilla
/onesuperior /ordmasculine /guillemotright /onequarter /onehalf
/threequarters /questiondown /Agrave /Aacute /Acircumflex
/Atilde /Adieresis /Aring /AE /Ccedilla
/Egrave /Eacute /Ecircumflex /Edieresis /Igrave
/Iacute /Icircumflex /Idieresis /Eth /Ntilde
/Ograve /Oacute /Ocircumflex /Otilde /Odieresis
/multiply /Oslash /Ugrave /Uacute /Ucircumflex
/Udieresis /Yacute /Thorn /germandbls /agrave
/aacute /acircumflex /atilde /adieresis /aring
/ae /ccedilla /egrave /eacute /ecircumflex
/edieresis /igrave /iacute /icircumflex /idieresis
/eth /ntilde /ograve /oacute /ocircumflex
/otilde /odieresis /divide /oslash /ugrave
/uacute /ucircumflex /udieresis /yacute /thorn
/ydieresis
] def
%%EndResource
%FOPBeginFontReencode
/Courier-Oblique findfont
dup length dict begin
  {1 index /FID ne {def} {pop pop} ifelse} forall
  /Encoding WinAnsiEncoding def
  currentdict
end
/Courier-Oblique exch definefont pop
/Courier-BoldOblique findfont
dup length dict begin
  {1 index /FID ne {def} {pop pop} ifelse} forall
  /Encoding WinAnsiEncoding def
  currentdict
end
/Courier-BoldOblique exch definefont pop
/Courier-Bold findfont
dup length dict begin
  {1 index /FID ne {def} {pop pop} ifelse} forall
  /Encoding WinAnsiEncoding def
  currentdict
end
/Courier-Bold exch definefont pop
/Helvetica findfont
dup length dict begin
  {1 index /FID ne {def} {pop pop} ifelse} forall
  /Encoding WinAnsiEncoding def
  currentdict
end
/Helvetica exch definefont pop
/Helvetica-Oblique findfont
dup length dict begin
  {1 index /FID ne {def} {pop pop} ifelse} forall
  /Encoding WinAnsiEncoding def
  currentdict
end
/Helvetica-Oblique exch definefont pop
/Helvetica-Bold findfont
dup length dict begin
  {1 index /FID ne {def} {pop pop} ifelse} forall
  /Encoding WinAnsiEncoding def
  currentdict
end
/Helvetica-Bold exch definefont pop
/Helvetica-BoldOblique findfont
dup length dict begin
  {1 index /FID ne {def} {pop pop} ifelse} forall
  /Encoding WinAnsiEncoding def
  currentdict
end
/Helvetica-BoldOblique exch definefont pop
/Times-Roman findfont
dup length dict begin
  {1 index /FID ne {def} {pop pop} ifelse} forall
  /Encoding WinAnsiEncoding def
  currentdict
end
/Times-Roman exch definefont pop
/Times-Italic findfont
dup length dict begin
  {1 index /FID ne {def} {pop pop} ifelse} forall
  /Encoding WinAnsiEncoding def
  currentdict
end
/Times-Italic exch definefont pop
/Times-Bold findfont
dup length dict begin
  {1 index /FID ne {def} {pop pop} ifelse} forall
  /Encoding WinAnsiEncoding def
  currentdict
end
/Times-Bold exch definefont pop
/Times-BoldItalic findfont
dup length dict begin
  {1 index /FID ne {def} {pop pop} ifelse} forall
  /Encoding WinAnsiEncoding def
  currentdict
end
/Times-BoldItalic exch definefont pop
/Courier findfont
dup length dict begin
  {1 index /FID ne {def} {pop pop} ifelse} forall
  /Encoding WinAnsiEncoding def
  currentdict
end
/Courier exch definefont pop
%FOPEndFontReencode
%%EndProlog
%%Page: 1 1
%%PageBoundingBox: 0 0 638 300
%%BeginPageSetup
[1 0 0 -1 0 300] CT
%%EndPageSetup
GS
[0.5 0 0 0.5 0 0] CT
1 GC
N
0 0 1275 600 re
f
GR
GS
[0.5 0 0 0.5 0 0] CT
1 GC
N
0 0 1275 600 re
f
GR
GS
[0.5 0 0 0.5 0 0] CT
1 GC
N
166 519 M
1154 519 L
1154 45 L
166 45 L
cp
f
GR
GS
[0.5 0 0 0.5 0 0] CT
0.149 GC
2 setlinecap
1 LJ
N
166 519 M
1154 519 L
S
GR
GS
[0.5 0 0 0.5 0 0] CT
0.149 GC
2 setlinecap
1 LJ
N
166 45 M
1154 45 L
S
GR
GS
[0.5 0 0 0.5 0 0] CT
0.149 GC
2 setlinecap
1 LJ
N
166 519 M
166 509.12 L
S
GR
GS
[0.5 0 0 0.5 0 0] CT
0.149 GC
2 setlinecap
1 LJ
N
495.333 519 M
495.333 509.12 L
S
GR
GS
[0.5 0 0 0.5 0 0] CT
0.149 GC
2 setlinecap
1 LJ
N
824.667 519 M
824.667 509.12 L
S
GR
GS
[0.5 0 0 0.5 0 0] CT
0.149 GC
2 setlinecap
1 LJ
N
1154 519 M
1154 509.12 L
S
GR
GS
[0.5 0 0 0.5 0 0] CT
0.149 GC
2 setlinecap
1 LJ
N
166 45 M
166 54.88 L
S
GR
GS
[0.5 0 0 0.5 0 0] CT
0.149 GC
2 setlinecap
1 LJ
N
495.333 45 M
495.333 54.88 L
S
GR
GS
[0.5 0 0 0.5 0 0] CT
0.149 GC
2 setlinecap
1 LJ
N
824.667 45 M
824.667 54.88 L
S
GR
GS
[0.5 0 0 0.5 0 0] CT
0.149 GC
2 setlinecap
1 LJ
N
1154 45 M
1154 54.88 L
S
GR
GS
[0.5 0 0 0.5 83 263.5] CT
0.149 GC
/Helvetica 20 F
GS
[1 0 0 1 0 0] CT
-6 21 moveto 
1 -1 scale
(0) t 
GR
GR
GS
[0.5 0 0 0.5 247.66667 263.5] CT
0.149 GC
/Helvetica 20 F
GS
[1 0 0 1 0 0] CT
-6 21 moveto 
1 -1 scale
(5) t 
GR
GR
GS
[0.5 0 0 0.5 412.33334 263.5] CT
0.149 GC
/Helvetica 20 F
GS
[1 0 0 1 0 0] CT
-11.5 21 moveto 
1 -1 scale
(10) t 
GR
GR
GS
[0.5 0 0 0.5 577 263.5] CT
0.149 GC
/Helvetica 20 F
GS
[1 0 0 1 0 0] CT
-11.5 21 moveto 
1 -1 scale
(15) t 
GR
GR
GS
[0.5 0 0 0.5 324 296] CT
0.149 GC
N
4.359 0.406 M
2.328 0.406 1.422 -1.086 QT
0.516 -2.578 0.516 -4.75 QT
0.516 -6.172 0.766 -7.531 QT
1.016 -8.891 1.539 -10.289 QT
2.063 -11.688 2.727 -12.914 QT
3.391 -14.141 4.219 -15.297 QT
4.375 -15.516 4.641 -15.516 QT
4.875 -15.516 5.016 -15.375 QT
5.156 -15.234 5.156 -15.047 QT
5.156 -14.859 5.047 -14.703 QT
1.766 -10.172 1.766 -6.359 QT
1.766 -4.719 2.523 -3.531 QT
3.281 -2.344 4.859 -2.344 QT
6.203 -2.344 7.359 -3.133 QT
8.516 -3.922 9.359 -5.156 QT
9.359 -5.781 9.578 -7.117 QT
9.797 -8.453 10.258 -9.5 QT
10.719 -10.547 11.375 -10.547 QT
12.203 -10.547 12.203 -9.578 QT
12.203 -9.016 11.961 -8.164 QT
11.719 -7.313 11.43 -6.578 QT
11.141 -5.844 10.719 -4.906 QT
11.141 -2.344 13.297 -2.344 QT
14.531 -2.344 15.789 -3.063 QT
17.047 -3.781 18.016 -4.953 QT
18.984 -6.125 19.539 -7.477 QT
20.094 -8.828 20.094 -10.031 QT
20.094 -11.125 19.75 -11.734 QT
19.406 -12.344 18.844 -13.008 QT
18.281 -13.672 18.281 -14.078 QT
18.281 -14.781 18.883 -15.359 QT
19.484 -15.938 20.156 -15.938 QT
21.047 -15.938 21.414 -15.141 QT
21.781 -14.344 21.781 -13.328 QT
21.781 -11.672 21.125 -9.156 QT
20.469 -6.641 19.625 -4.969 QT
18.453 -2.703 16.703 -1.148 QT
14.953 0.406 12.781 0.406 QT
11.391 0.406 10.539 -0.43 QT
9.688 -1.266 9.438 -2.703 QT
8.438 -1.281 7.156 -0.438 QT
5.875 0.406 4.359 0.406 QT
cp
f
GR
GS
[0.5 0 0 0.5 0 0] CT
0.149 GC
2 setlinecap
1 LJ
N
166 519 M
166 45 L
S
GR
GS
[0.5 0 0 0.5 0 0] CT
0.149 GC
2 setlinecap
1 LJ
N
1154 519 M
1154 45 L
S
GR
GS
[0.5 0 0 0.5 0 0] CT
0.149 GC
2 setlinecap
1 LJ
N
166 446.967 M
175.88 446.967 L
S
GR
GS
[0.5 0 0 0.5 0 0] CT
0.149 GC
2 setlinecap
1 LJ
N
166 360.951 M
175.88 360.951 L
S
GR
GS
[0.5 0 0 0.5 0 0] CT
0.149 GC
2 setlinecap
1 LJ
N
166 274.936 M
175.88 274.936 L
S
GR
GS
[0.5 0 0 0.5 0 0] CT
0.149 GC
2 setlinecap
1 LJ
N
166 188.92 M
175.88 188.92 L
S
GR
GS
[0.5 0 0 0.5 0 0] CT
0.149 GC
2 setlinecap
1 LJ
N
166 102.905 M
175.88 102.905 L
S
GR
GS
[0.5 0 0 0.5 0 0] CT
0.149 GC
2 setlinecap
1 LJ
N
1154 446.967 M
1144.12 446.967 L
S
GR
GS
[0.5 0 0 0.5 0 0] CT
0.149 GC
2 setlinecap
1 LJ
N
1154 360.951 M
1144.12 360.951 L
S
GR
GS
[0.5 0 0 0.5 0 0] CT
0.149 GC
2 setlinecap
1 LJ
N
1154 274.936 M
1144.12 274.936 L
S
GR
GS
[0.5 0 0 0.5 0 0] CT
0.149 GC
2 setlinecap
1 LJ
N
1154 188.92 M
1144.12 188.92 L
S
GR
GS
[0.5 0 0 0.5 0 0] CT
0.149 GC
2 setlinecap
1 LJ
N
1154 102.905 M
1144.12 102.905 L
S
GR
GS
[0.5 0 0 0.5 0 0] CT
0.149 GC
2 setlinecap
1 LJ
N
166 512.462 M
170.94 512.462 L
S
GR
GS
[0.5 0 0 0.5 0 0] CT
0.149 GC
2 setlinecap
1 LJ
N
166 507.089 M
170.94 507.089 L
S
GR
GS
[0.5 0 0 0.5 0 0] CT
0.149 GC
2 setlinecap
1 LJ
N
166 502.921 M
170.94 502.921 L
S
GR
GS
[0.5 0 0 0.5 0 0] CT
0.149 GC
2 setlinecap
1 LJ
N
166 499.516 M
170.94 499.516 L
S
GR
GS
[0.5 0 0 0.5 0 0] CT
0.149 GC
2 setlinecap
1 LJ
N
166 496.637 M
170.94 496.637 L
S
GR
GS
[0.5 0 0 0.5 0 0] CT
0.149 GC
2 setlinecap
1 LJ
N
166 494.142 M
170.94 494.142 L
S
GR
GS
[0.5 0 0 0.5 0 0] CT
0.149 GC
2 setlinecap
1 LJ
N
166 491.943 M
170.94 491.943 L
S
GR
GS
[0.5 0 0 0.5 0 0] CT
0.149 GC
2 setlinecap
1 LJ
N
166 489.975 M
170.94 489.975 L
S
GR
GS
[0.5 0 0 0.5 0 0] CT
0.149 GC
2 setlinecap
1 LJ
N
166 477.028 M
170.94 477.028 L
S
GR
GS
[0.5 0 0 0.5 0 0] CT
0.149 GC
2 setlinecap
1 LJ
N
166 469.455 M
170.94 469.455 L
S
GR
GS
[0.5 0 0 0.5 0 0] CT
0.149 GC
2 setlinecap
1 LJ
N
166 464.081 M
170.94 464.081 L
S
GR
GS
[0.5 0 0 0.5 0 0] CT
0.149 GC
2 setlinecap
1 LJ
N
166 459.913 M
170.94 459.913 L
S
GR
GS
[0.5 0 0 0.5 0 0] CT
0.149 GC
2 setlinecap
1 LJ
N
166 456.508 M
170.94 456.508 L
S
GR
GS
[0.5 0 0 0.5 0 0] CT
0.149 GC
2 setlinecap
1 LJ
N
166 453.629 M
170.94 453.629 L
S
GR
GS
[0.5 0 0 0.5 0 0] CT
0.149 GC
2 setlinecap
1 LJ
N
166 451.135 M
170.94 451.135 L
S
GR
GS
[0.5 0 0 0.5 0 0] CT
0.149 GC
2 setlinecap
1 LJ
N
166 448.935 M
170.94 448.935 L
S
GR
GS
[0.5 0 0 0.5 0 0] CT
0.149 GC
2 setlinecap
1 LJ
N
166 446.967 M
170.94 446.967 L
S
GR
GS
[0.5 0 0 0.5 0 0] CT
0.149 GC
2 setlinecap
1 LJ
N
166 434.02 M
170.94 434.02 L
S
GR
GS
[0.5 0 0 0.5 0 0] CT
0.149 GC
2 setlinecap
1 LJ
N
166 426.447 M
170.94 426.447 L
S
GR
GS
[0.5 0 0 0.5 0 0] CT
0.149 GC
2 setlinecap
1 LJ
N
166 421.074 M
170.94 421.074 L
S
GR
GS
[0.5 0 0 0.5 0 0] CT
0.149 GC
2 setlinecap
1 LJ
N
166 416.906 M
170.94 416.906 L
S
GR
GS
[0.5 0 0 0.5 0 0] CT
0.149 GC
2 setlinecap
1 LJ
N
166 413.5 M
170.94 413.5 L
S
GR
GS
[0.5 0 0 0.5 0 0] CT
0.149 GC
2 setlinecap
1 LJ
N
166 410.621 M
170.94 410.621 L
S
GR
GS
[0.5 0 0 0.5 0 0] CT
0.149 GC
2 setlinecap
1 LJ
N
166 408.127 M
170.94 408.127 L
S
GR
GS
[0.5 0 0 0.5 0 0] CT
0.149 GC
2 setlinecap
1 LJ
N
166 405.927 M
170.94 405.927 L
S
GR
GS
[0.5 0 0 0.5 0 0] CT
0.149 GC
2 setlinecap
1 LJ
N
166 403.959 M
170.94 403.959 L
S
GR
GS
[0.5 0 0 0.5 0 0] CT
0.149 GC
2 setlinecap
1 LJ
N
166 391.012 M
170.94 391.012 L
S
GR
GS
[0.5 0 0 0.5 0 0] CT
0.149 GC
2 setlinecap
1 LJ
N
166 383.439 M
170.94 383.439 L
S
GR
GS
[0.5 0 0 0.5 0 0] CT
0.149 GC
2 setlinecap
1 LJ
N
166 378.066 M
170.94 378.066 L
S
GR
GS
[0.5 0 0 0.5 0 0] CT
0.149 GC
2 setlinecap
1 LJ
N
166 373.898 M
170.94 373.898 L
S
GR
GS
[0.5 0 0 0.5 0 0] CT
0.149 GC
2 setlinecap
1 LJ
N
166 370.492 M
170.94 370.492 L
S
GR
GS
[0.5 0 0 0.5 0 0] CT
0.149 GC
2 setlinecap
1 LJ
N
166 367.613 M
170.94 367.613 L
S
GR
GS
[0.5 0 0 0.5 0 0] CT
0.149 GC
2 setlinecap
1 LJ
N
166 365.119 M
170.94 365.119 L
S
GR
GS
[0.5 0 0 0.5 0 0] CT
0.149 GC
2 setlinecap
1 LJ
N
166 362.919 M
170.94 362.919 L
S
GR
GS
[0.5 0 0 0.5 0 0] CT
0.149 GC
2 setlinecap
1 LJ
N
166 360.951 M
170.94 360.951 L
S
GR
GS
[0.5 0 0 0.5 0 0] CT
0.149 GC
2 setlinecap
1 LJ
N
166 348.005 M
170.94 348.005 L
S
GR
GS
[0.5 0 0 0.5 0 0] CT
0.149 GC
2 setlinecap
1 LJ
N
166 340.431 M
170.94 340.431 L
S
GR
GS
[0.5 0 0 0.5 0 0] CT
0.149 GC
2 setlinecap
1 LJ
N
166 335.058 M
170.94 335.058 L
S
GR
GS
[0.5 0 0 0.5 0 0] CT
0.149 GC
2 setlinecap
1 LJ
N
166 330.89 M
170.94 330.89 L
S
GR
GS
[0.5 0 0 0.5 0 0] CT
0.149 GC
2 setlinecap
1 LJ
N
166 327.485 M
170.94 327.485 L
S
GR
GS
[0.5 0 0 0.5 0 0] CT
0.149 GC
2 setlinecap
1 LJ
N
166 324.605 M
170.94 324.605 L
S
GR
GS
[0.5 0 0 0.5 0 0] CT
0.149 GC
2 setlinecap
1 LJ
N
166 322.111 M
170.94 322.111 L
S
GR
GS
[0.5 0 0 0.5 0 0] CT
0.149 GC
2 setlinecap
1 LJ
N
166 319.911 M
170.94 319.911 L
S
GR
GS
[0.5 0 0 0.5 0 0] CT
0.149 GC
2 setlinecap
1 LJ
N
166 317.943 M
170.94 317.943 L
S
GR
GS
[0.5 0 0 0.5 0 0] CT
0.149 GC
2 setlinecap
1 LJ
N
166 304.997 M
170.94 304.997 L
S
GR
GS
[0.5 0 0 0.5 0 0] CT
0.149 GC
2 setlinecap
1 LJ
N
166 297.424 M
170.94 297.424 L
S
GR
GS
[0.5 0 0 0.5 0 0] CT
0.149 GC
2 setlinecap
1 LJ
N
166 292.05 M
170.94 292.05 L
S
GR
GS
[0.5 0 0 0.5 0 0] CT
0.149 GC
2 setlinecap
1 LJ
N
166 287.882 M
170.94 287.882 L
S
GR
GS
[0.5 0 0 0.5 0 0] CT
0.149 GC
2 setlinecap
1 LJ
N
166 284.477 M
170.94 284.477 L
S
GR
GS
[0.5 0 0 0.5 0 0] CT
0.149 GC
2 setlinecap
1 LJ
N
166 281.598 M
170.94 281.598 L
S
GR
GS
[0.5 0 0 0.5 0 0] CT
0.149 GC
2 setlinecap
1 LJ
N
166 279.104 M
170.94 279.104 L
S
GR
GS
[0.5 0 0 0.5 0 0] CT
0.149 GC
2 setlinecap
1 LJ
N
166 276.904 M
170.94 276.904 L
S
GR
GS
[0.5 0 0 0.5 0 0] CT
0.149 GC
2 setlinecap
1 LJ
N
166 274.936 M
170.94 274.936 L
S
GR
GS
[0.5 0 0 0.5 0 0] CT
0.149 GC
2 setlinecap
1 LJ
N
166 261.989 M
170.94 261.989 L
S
GR
GS
[0.5 0 0 0.5 0 0] CT
0.149 GC
2 setlinecap
1 LJ
N
166 254.416 M
170.94 254.416 L
S
GR
GS
[0.5 0 0 0.5 0 0] CT
0.149 GC
2 setlinecap
1 LJ
N
166 249.042 M
170.94 249.042 L
S
GR
GS
[0.5 0 0 0.5 0 0] CT
0.149 GC
2 setlinecap
1 LJ
N
166 244.874 M
170.94 244.874 L
S
GR
GS
[0.5 0 0 0.5 0 0] CT
0.149 GC
2 setlinecap
1 LJ
N
166 241.469 M
170.94 241.469 L
S
GR
GS
[0.5 0 0 0.5 0 0] CT
0.149 GC
2 setlinecap
1 LJ
N
166 238.59 M
170.94 238.59 L
S
GR
GS
[0.5 0 0 0.5 0 0] CT
0.149 GC
2 setlinecap
1 LJ
N
166 236.096 M
170.94 236.096 L
S
GR
GS
[0.5 0 0 0.5 0 0] CT
0.149 GC
2 setlinecap
1 LJ
N
166 233.896 M
170.94 233.896 L
S
GR
GS
[0.5 0 0 0.5 0 0] CT
0.149 GC
2 setlinecap
1 LJ
N
166 231.928 M
170.94 231.928 L
S
GR
GS
[0.5 0 0 0.5 0 0] CT
0.149 GC
2 setlinecap
1 LJ
N
166 218.981 M
170.94 218.981 L
S
GR
GS
[0.5 0 0 0.5 0 0] CT
0.149 GC
2 setlinecap
1 LJ
N
166 211.408 M
170.94 211.408 L
S
GR
GS
[0.5 0 0 0.5 0 0] CT
0.149 GC
2 setlinecap
1 LJ
N
166 206.035 M
170.94 206.035 L
S
GR
GS
[0.5 0 0 0.5 0 0] CT
0.149 GC
2 setlinecap
1 LJ
N
166 201.867 M
170.94 201.867 L
S
GR
GS
[0.5 0 0 0.5 0 0] CT
0.149 GC
2 setlinecap
1 LJ
N
166 198.461 M
170.94 198.461 L
S
GR
GS
[0.5 0 0 0.5 0 0] CT
0.149 GC
2 setlinecap
1 LJ
N
166 195.582 M
170.94 195.582 L
S
GR
GS
[0.5 0 0 0.5 0 0] CT
0.149 GC
2 setlinecap
1 LJ
N
166 193.088 M
170.94 193.088 L
S
GR
GS
[0.5 0 0 0.5 0 0] CT
0.149 GC
2 setlinecap
1 LJ
N
166 190.888 M
170.94 190.888 L
S
GR
GS
[0.5 0 0 0.5 0 0] CT
0.149 GC
2 setlinecap
1 LJ
N
166 188.92 M
170.94 188.92 L
S
GR
GS
[0.5 0 0 0.5 0 0] CT
0.149 GC
2 setlinecap
1 LJ
N
166 175.973 M
170.94 175.973 L
S
GR
GS
[0.5 0 0 0.5 0 0] CT
0.149 GC
2 setlinecap
1 LJ
N
166 168.4 M
170.94 168.4 L
S
GR
GS
[0.5 0 0 0.5 0 0] CT
0.149 GC
2 setlinecap
1 LJ
N
166 163.027 M
170.94 163.027 L
S
GR
GS
[0.5 0 0 0.5 0 0] CT
0.149 GC
2 setlinecap
1 LJ
N
166 158.859 M
170.94 158.859 L
S
GR
GS
[0.5 0 0 0.5 0 0] CT
0.149 GC
2 setlinecap
1 LJ
N
166 155.454 M
170.94 155.454 L
S
GR
GS
[0.5 0 0 0.5 0 0] CT
0.149 GC
2 setlinecap
1 LJ
N
166 152.574 M
170.94 152.574 L
S
GR
GS
[0.5 0 0 0.5 0 0] CT
0.149 GC
2 setlinecap
1 LJ
N
166 150.08 M
170.94 150.08 L
S
GR
GS
[0.5 0 0 0.5 0 0] CT
0.149 GC
2 setlinecap
1 LJ
N
166 147.88 M
170.94 147.88 L
S
GR
GS
[0.5 0 0 0.5 0 0] CT
0.149 GC
2 setlinecap
1 LJ
N
166 145.912 M
170.94 145.912 L
S
GR
GS
[0.5 0 0 0.5 0 0] CT
0.149 GC
2 setlinecap
1 LJ
N
166 132.966 M
170.94 132.966 L
S
GR
GS
[0.5 0 0 0.5 0 0] CT
0.149 GC
2 setlinecap
1 LJ
N
166 125.392 M
170.94 125.392 L
S
GR
GS
[0.5 0 0 0.5 0 0] CT
0.149 GC
2 setlinecap
1 LJ
N
166 120.019 M
170.94 120.019 L
S
GR
GS
[0.5 0 0 0.5 0 0] CT
0.149 GC
2 setlinecap
1 LJ
N
166 115.851 M
170.94 115.851 L
S
GR
GS
[0.5 0 0 0.5 0 0] CT
0.149 GC
2 setlinecap
1 LJ
N
166 112.446 M
170.94 112.446 L
S
GR
GS
[0.5 0 0 0.5 0 0] CT
0.149 GC
2 setlinecap
1 LJ
N
166 109.567 M
170.94 109.567 L
S
GR
GS
[0.5 0 0 0.5 0 0] CT
0.149 GC
2 setlinecap
1 LJ
N
166 107.072 M
170.94 107.072 L
S
GR
GS
[0.5 0 0 0.5 0 0] CT
0.149 GC
2 setlinecap
1 LJ
N
166 104.872 M
170.94 104.872 L
S
GR
GS
[0.5 0 0 0.5 0 0] CT
0.149 GC
2 setlinecap
1 LJ
N
166 102.905 M
170.94 102.905 L
S
GR
GS
[0.5 0 0 0.5 0 0] CT
0.149 GC
2 setlinecap
1 LJ
N
166 89.958 M
170.94 89.958 L
S
GR
GS
[0.5 0 0 0.5 0 0] CT
0.149 GC
2 setlinecap
1 LJ
N
166 82.385 M
170.94 82.385 L
S
GR
GS
[0.5 0 0 0.5 0 0] CT
0.149 GC
2 setlinecap
1 LJ
N
166 77.011 M
170.94 77.011 L
S
GR
GS
[0.5 0 0 0.5 0 0] CT
0.149 GC
2 setlinecap
1 LJ
N
166 72.843 M
170.94 72.843 L
S
GR
GS
[0.5 0 0 0.5 0 0] CT
0.149 GC
2 setlinecap
1 LJ
N
166 69.438 M
170.94 69.438 L
S
GR
GS
[0.5 0 0 0.5 0 0] CT
0.149 GC
2 setlinecap
1 LJ
N
166 66.559 M
170.94 66.559 L
S
GR
GS
[0.5 0 0 0.5 0 0] CT
0.149 GC
2 setlinecap
1 LJ
N
166 64.065 M
170.94 64.065 L
S
GR
GS
[0.5 0 0 0.5 0 0] CT
0.149 GC
2 setlinecap
1 LJ
N
166 61.865 M
170.94 61.865 L
S
GR
GS
[0.5 0 0 0.5 0 0] CT
0.149 GC
2 setlinecap
1 LJ
N
166 59.897 M
170.94 59.897 L
S
GR
GS
[0.5 0 0 0.5 0 0] CT
0.149 GC
2 setlinecap
1 LJ
N
166 46.95 M
170.94 46.95 L
S
GR
GS
[0.5 0 0 0.5 0 0] CT
0.149 GC
2 setlinecap
1 LJ
N
1154 512.462 M
1149.06 512.462 L
S
GR
GS
[0.5 0 0 0.5 0 0] CT
0.149 GC
2 setlinecap
1 LJ
N
1154 507.089 M
1149.06 507.089 L
S
GR
GS
[0.5 0 0 0.5 0 0] CT
0.149 GC
2 setlinecap
1 LJ
N
1154 502.921 M
1149.06 502.921 L
S
GR
GS
[0.5 0 0 0.5 0 0] CT
0.149 GC
2 setlinecap
1 LJ
N
1154 499.516 M
1149.06 499.516 L
S
GR
GS
[0.5 0 0 0.5 0 0] CT
0.149 GC
2 setlinecap
1 LJ
N
1154 496.637 M
1149.06 496.637 L
S
GR
GS
[0.5 0 0 0.5 0 0] CT
0.149 GC
2 setlinecap
1 LJ
N
1154 494.142 M
1149.06 494.142 L
S
GR
GS
[0.5 0 0 0.5 0 0] CT
0.149 GC
2 setlinecap
1 LJ
N
1154 491.943 M
1149.06 491.943 L
S
GR
GS
[0.5 0 0 0.5 0 0] CT
0.149 GC
2 setlinecap
1 LJ
N
1154 489.975 M
1149.06 489.975 L
S
GR
GS
[0.5 0 0 0.5 0 0] CT
0.149 GC
2 setlinecap
1 LJ
N
1154 477.028 M
1149.06 477.028 L
S
GR
GS
[0.5 0 0 0.5 0 0] CT
0.149 GC
2 setlinecap
1 LJ
N
1154 469.455 M
1149.06 469.455 L
S
GR
GS
[0.5 0 0 0.5 0 0] CT
0.149 GC
2 setlinecap
1 LJ
N
1154 464.081 M
1149.06 464.081 L
S
GR
GS
[0.5 0 0 0.5 0 0] CT
0.149 GC
2 setlinecap
1 LJ
N
1154 459.913 M
1149.06 459.913 L
S
GR
GS
[0.5 0 0 0.5 0 0] CT
0.149 GC
2 setlinecap
1 LJ
N
1154 456.508 M
1149.06 456.508 L
S
GR
GS
[0.5 0 0 0.5 0 0] CT
0.149 GC
2 setlinecap
1 LJ
N
1154 453.629 M
1149.06 453.629 L
S
GR
GS
[0.5 0 0 0.5 0 0] CT
0.149 GC
2 setlinecap
1 LJ
N
1154 451.135 M
1149.06 451.135 L
S
GR
GS
[0.5 0 0 0.5 0 0] CT
0.149 GC
2 setlinecap
1 LJ
N
1154 448.935 M
1149.06 448.935 L
S
GR
GS
[0.5 0 0 0.5 0 0] CT
0.149 GC
2 setlinecap
1 LJ
N
1154 446.967 M
1149.06 446.967 L
S
GR
GS
[0.5 0 0 0.5 0 0] CT
0.149 GC
2 setlinecap
1 LJ
N
1154 434.02 M
1149.06 434.02 L
S
GR
GS
[0.5 0 0 0.5 0 0] CT
0.149 GC
2 setlinecap
1 LJ
N
1154 426.447 M
1149.06 426.447 L
S
GR
GS
[0.5 0 0 0.5 0 0] CT
0.149 GC
2 setlinecap
1 LJ
N
1154 421.074 M
1149.06 421.074 L
S
GR
GS
[0.5 0 0 0.5 0 0] CT
0.149 GC
2 setlinecap
1 LJ
N
1154 416.906 M
1149.06 416.906 L
S
GR
GS
[0.5 0 0 0.5 0 0] CT
0.149 GC
2 setlinecap
1 LJ
N
1154 413.5 M
1149.06 413.5 L
S
GR
GS
[0.5 0 0 0.5 0 0] CT
0.149 GC
2 setlinecap
1 LJ
N
1154 410.621 M
1149.06 410.621 L
S
GR
GS
[0.5 0 0 0.5 0 0] CT
0.149 GC
2 setlinecap
1 LJ
N
1154 408.127 M
1149.06 408.127 L
S
GR
GS
[0.5 0 0 0.5 0 0] CT
0.149 GC
2 setlinecap
1 LJ
N
1154 405.927 M
1149.06 405.927 L
S
GR
GS
[0.5 0 0 0.5 0 0] CT
0.149 GC
2 setlinecap
1 LJ
N
1154 403.959 M
1149.06 403.959 L
S
GR
GS
[0.5 0 0 0.5 0 0] CT
0.149 GC
2 setlinecap
1 LJ
N
1154 391.012 M
1149.06 391.012 L
S
GR
GS
[0.5 0 0 0.5 0 0] CT
0.149 GC
2 setlinecap
1 LJ
N
1154 383.439 M
1149.06 383.439 L
S
GR
GS
[0.5 0 0 0.5 0 0] CT
0.149 GC
2 setlinecap
1 LJ
N
1154 378.066 M
1149.06 378.066 L
S
GR
GS
[0.5 0 0 0.5 0 0] CT
0.149 GC
2 setlinecap
1 LJ
N
1154 373.898 M
1149.06 373.898 L
S
GR
GS
[0.5 0 0 0.5 0 0] CT
0.149 GC
2 setlinecap
1 LJ
N
1154 370.492 M
1149.06 370.492 L
S
GR
GS
[0.5 0 0 0.5 0 0] CT
0.149 GC
2 setlinecap
1 LJ
N
1154 367.613 M
1149.06 367.613 L
S
GR
GS
[0.5 0 0 0.5 0 0] CT
0.149 GC
2 setlinecap
1 LJ
N
1154 365.119 M
1149.06 365.119 L
S
GR
GS
[0.5 0 0 0.5 0 0] CT
0.149 GC
2 setlinecap
1 LJ
N
1154 362.919 M
1149.06 362.919 L
S
GR
GS
[0.5 0 0 0.5 0 0] CT
0.149 GC
2 setlinecap
1 LJ
N
1154 360.951 M
1149.06 360.951 L
S
GR
GS
[0.5 0 0 0.5 0 0] CT
0.149 GC
2 setlinecap
1 LJ
N
1154 348.005 M
1149.06 348.005 L
S
GR
GS
[0.5 0 0 0.5 0 0] CT
0.149 GC
2 setlinecap
1 LJ
N
1154 340.431 M
1149.06 340.431 L
S
GR
GS
[0.5 0 0 0.5 0 0] CT
0.149 GC
2 setlinecap
1 LJ
N
1154 335.058 M
1149.06 335.058 L
S
GR
GS
[0.5 0 0 0.5 0 0] CT
0.149 GC
2 setlinecap
1 LJ
N
1154 330.89 M
1149.06 330.89 L
S
GR
GS
[0.5 0 0 0.5 0 0] CT
0.149 GC
2 setlinecap
1 LJ
N
1154 327.485 M
1149.06 327.485 L
S
GR
GS
[0.5 0 0 0.5 0 0] CT
0.149 GC
2 setlinecap
1 LJ
N
1154 324.605 M
1149.06 324.605 L
S
GR
GS
[0.5 0 0 0.5 0 0] CT
0.149 GC
2 setlinecap
1 LJ
N
1154 322.111 M
1149.06 322.111 L
S
GR
GS
[0.5 0 0 0.5 0 0] CT
0.149 GC
2 setlinecap
1 LJ
N
1154 319.911 M
1149.06 319.911 L
S
GR
GS
[0.5 0 0 0.5 0 0] CT
0.149 GC
2 setlinecap
1 LJ
N
1154 317.943 M
1149.06 317.943 L
S
GR
GS
[0.5 0 0 0.5 0 0] CT
0.149 GC
2 setlinecap
1 LJ
N
1154 304.997 M
1149.06 304.997 L
S
GR
GS
[0.5 0 0 0.5 0 0] CT
0.149 GC
2 setlinecap
1 LJ
N
1154 297.424 M
1149.06 297.424 L
S
GR
GS
[0.5 0 0 0.5 0 0] CT
0.149 GC
2 setlinecap
1 LJ
N
1154 292.05 M
1149.06 292.05 L
S
GR
GS
[0.5 0 0 0.5 0 0] CT
0.149 GC
2 setlinecap
1 LJ
N
1154 287.882 M
1149.06 287.882 L
S
GR
GS
[0.5 0 0 0.5 0 0] CT
0.149 GC
2 setlinecap
1 LJ
N
1154 284.477 M
1149.06 284.477 L
S
GR
GS
[0.5 0 0 0.5 0 0] CT
0.149 GC
2 setlinecap
1 LJ
N
1154 281.598 M
1149.06 281.598 L
S
GR
GS
[0.5 0 0 0.5 0 0] CT
0.149 GC
2 setlinecap
1 LJ
N
1154 279.104 M
1149.06 279.104 L
S
GR
GS
[0.5 0 0 0.5 0 0] CT
0.149 GC
2 setlinecap
1 LJ
N
1154 276.904 M
1149.06 276.904 L
S
GR
GS
[0.5 0 0 0.5 0 0] CT
0.149 GC
2 setlinecap
1 LJ
N
1154 274.936 M
1149.06 274.936 L
S
GR
GS
[0.5 0 0 0.5 0 0] CT
0.149 GC
2 setlinecap
1 LJ
N
1154 261.989 M
1149.06 261.989 L
S
GR
GS
[0.5 0 0 0.5 0 0] CT
0.149 GC
2 setlinecap
1 LJ
N
1154 254.416 M
1149.06 254.416 L
S
GR
GS
[0.5 0 0 0.5 0 0] CT
0.149 GC
2 setlinecap
1 LJ
N
1154 249.042 M
1149.06 249.042 L
S
GR
GS
[0.5 0 0 0.5 0 0] CT
0.149 GC
2 setlinecap
1 LJ
N
1154 244.874 M
1149.06 244.874 L
S
GR
GS
[0.5 0 0 0.5 0 0] CT
0.149 GC
2 setlinecap
1 LJ
N
1154 241.469 M
1149.06 241.469 L
S
GR
GS
[0.5 0 0 0.5 0 0] CT
0.149 GC
2 setlinecap
1 LJ
N
1154 238.59 M
1149.06 238.59 L
S
GR
GS
[0.5 0 0 0.5 0 0] CT
0.149 GC
2 setlinecap
1 LJ
N
1154 236.096 M
1149.06 236.096 L
S
GR
GS
[0.5 0 0 0.5 0 0] CT
0.149 GC
2 setlinecap
1 LJ
N
1154 233.896 M
1149.06 233.896 L
S
GR
GS
[0.5 0 0 0.5 0 0] CT
0.149 GC
2 setlinecap
1 LJ
N
1154 231.928 M
1149.06 231.928 L
S
GR
GS
[0.5 0 0 0.5 0 0] CT
0.149 GC
2 setlinecap
1 LJ
N
1154 218.981 M
1149.06 218.981 L
S
GR
GS
[0.5 0 0 0.5 0 0] CT
0.149 GC
2 setlinecap
1 LJ
N
1154 211.408 M
1149.06 211.408 L
S
GR
GS
[0.5 0 0 0.5 0 0] CT
0.149 GC
2 setlinecap
1 LJ
N
1154 206.035 M
1149.06 206.035 L
S
GR
GS
[0.5 0 0 0.5 0 0] CT
0.149 GC
2 setlinecap
1 LJ
N
1154 201.867 M
1149.06 201.867 L
S
GR
GS
[0.5 0 0 0.5 0 0] CT
0.149 GC
2 setlinecap
1 LJ
N
1154 198.461 M
1149.06 198.461 L
S
GR
GS
[0.5 0 0 0.5 0 0] CT
0.149 GC
2 setlinecap
1 LJ
N
1154 195.582 M
1149.06 195.582 L
S
GR
GS
[0.5 0 0 0.5 0 0] CT
0.149 GC
2 setlinecap
1 LJ
N
1154 193.088 M
1149.06 193.088 L
S
GR
GS
[0.5 0 0 0.5 0 0] CT
0.149 GC
2 setlinecap
1 LJ
N
1154 190.888 M
1149.06 190.888 L
S
GR
GS
[0.5 0 0 0.5 0 0] CT
0.149 GC
2 setlinecap
1 LJ
N
1154 188.92 M
1149.06 188.92 L
S
GR
GS
[0.5 0 0 0.5 0 0] CT
0.149 GC
2 setlinecap
1 LJ
N
1154 175.973 M
1149.06 175.973 L
S
GR
GS
[0.5 0 0 0.5 0 0] CT
0.149 GC
2 setlinecap
1 LJ
N
1154 168.4 M
1149.06 168.4 L
S
GR
GS
[0.5 0 0 0.5 0 0] CT
0.149 GC
2 setlinecap
1 LJ
N
1154 163.027 M
1149.06 163.027 L
S
GR
GS
[0.5 0 0 0.5 0 0] CT
0.149 GC
2 setlinecap
1 LJ
N
1154 158.859 M
1149.06 158.859 L
S
GR
GS
[0.5 0 0 0.5 0 0] CT
0.149 GC
2 setlinecap
1 LJ
N
1154 155.454 M
1149.06 155.454 L
S
GR
GS
[0.5 0 0 0.5 0 0] CT
0.149 GC
2 setlinecap
1 LJ
N
1154 152.574 M
1149.06 152.574 L
S
GR
GS
[0.5 0 0 0.5 0 0] CT
0.149 GC
2 setlinecap
1 LJ
N
1154 150.08 M
1149.06 150.08 L
S
GR
GS
[0.5 0 0 0.5 0 0] CT
0.149 GC
2 setlinecap
1 LJ
N
1154 147.88 M
1149.06 147.88 L
S
GR
GS
[0.5 0 0 0.5 0 0] CT
0.149 GC
2 setlinecap
1 LJ
N
1154 145.912 M
1149.06 145.912 L
S
GR
GS
[0.5 0 0 0.5 0 0] CT
0.149 GC
2 setlinecap
1 LJ
N
1154 132.966 M
1149.06 132.966 L
S
GR
GS
[0.5 0 0 0.5 0 0] CT
0.149 GC
2 setlinecap
1 LJ
N
1154 125.392 M
1149.06 125.392 L
S
GR
GS
[0.5 0 0 0.5 0 0] CT
0.149 GC
2 setlinecap
1 LJ
N
1154 120.019 M
1149.06 120.019 L
S
GR
GS
[0.5 0 0 0.5 0 0] CT
0.149 GC
2 setlinecap
1 LJ
N
1154 115.851 M
1149.06 115.851 L
S
GR
GS
[0.5 0 0 0.5 0 0] CT
0.149 GC
2 setlinecap
1 LJ
N
1154 112.446 M
1149.06 112.446 L
S
GR
GS
[0.5 0 0 0.5 0 0] CT
0.149 GC
2 setlinecap
1 LJ
N
1154 109.567 M
1149.06 109.567 L
S
GR
GS
[0.5 0 0 0.5 0 0] CT
0.149 GC
2 setlinecap
1 LJ
N
1154 107.072 M
1149.06 107.072 L
S
GR
GS
[0.5 0 0 0.5 0 0] CT
0.149 GC
2 setlinecap
1 LJ
N
1154 104.872 M
1149.06 104.872 L
S
GR
GS
[0.5 0 0 0.5 0 0] CT
0.149 GC
2 setlinecap
1 LJ
N
1154 102.905 M
1149.06 102.905 L
S
GR
GS
[0.5 0 0 0.5 0 0] CT
0.149 GC
2 setlinecap
1 LJ
N
1154 89.958 M
1149.06 89.958 L
S
GR
GS
[0.5 0 0 0.5 0 0] CT
0.149 GC
2 setlinecap
1 LJ
N
1154 82.385 M
1149.06 82.385 L
S
GR
GS
[0.5 0 0 0.5 0 0] CT
0.149 GC
2 setlinecap
1 LJ
N
1154 77.011 M
1149.06 77.011 L
S
GR
GS
[0.5 0 0 0.5 0 0] CT
0.149 GC
2 setlinecap
1 LJ
N
1154 72.843 M
1149.06 72.843 L
S
GR
GS
[0.5 0 0 0.5 0 0] CT
0.149 GC
2 setlinecap
1 LJ
N
1154 69.438 M
1149.06 69.438 L
S
GR
GS
[0.5 0 0 0.5 0 0] CT
0.149 GC
2 setlinecap
1 LJ
N
1154 66.559 M
1149.06 66.559 L
S
GR
GS
[0.5 0 0 0.5 0 0] CT
0.149 GC
2 setlinecap
1 LJ
N
1154 64.065 M
1149.06 64.065 L
S
GR
GS
[0.5 0 0 0.5 0 0] CT
0.149 GC
2 setlinecap
1 LJ
N
1154 61.865 M
1149.06 61.865 L
S
GR
GS
[0.5 0 0 0.5 0 0] CT
0.149 GC
2 setlinecap
1 LJ
N
1154 59.897 M
1149.06 59.897 L
S
GR
GS
[0.5 0 0 0.5 0 0] CT
0.149 GC
2 setlinecap
1 LJ
N
1154 46.95 M
1149.06 46.95 L
S
GR
GS
[0.5 0 0 0.5 63 229] CT
0.149 GC
/Helvetica 20 F
GS
[1 0 0 1 0 0] CT
0 0 moveto 
1 -1 scale
(10) t 
GR
GR
GS
[0.5 0 0 0.5 74.5 224] CT
0.149 GC
/Helvetica 16 F
GS
[1 0 0 1 0 0] CT
0 0 moveto 
1 -1 scale
(0) t 
GR
GR
GS
[0.5 0 0 0.5 63 186] CT
0.149 GC
/Helvetica 20 F
GS
[1 0 0 1 0 0] CT
0 0 moveto 
1 -1 scale
(10) t 
GR
GR
GS
[0.5 0 0 0.5 74.5 181] CT
0.149 GC
/Helvetica 16 F
GS
[1 0 0 1 0 0] CT
0 0 moveto 
1 -1 scale
(2) t 
GR
GR
GS
[0.5 0 0 0.5 63 143] CT
0.149 GC
/Helvetica 20 F
GS
[1 0 0 1 0 0] CT
0 0 moveto 
1 -1 scale
(10) t 
GR
GR
GS
[0.5 0 0 0.5 74.5 138] CT
0.149 GC
/Helvetica 16 F
GS
[1 0 0 1 0 0] CT
0 0 moveto 
1 -1 scale
(4) t 
GR
GR
GS
[0.5 0 0 0.5 63 100] CT
0.149 GC
/Helvetica 20 F
GS
[1 0 0 1 0 0] CT
0 0 moveto 
1 -1 scale
(10) t 
GR
GR
GS
[0.5 0 0 0.5 74.5 95] CT
0.149 GC
/Helvetica 16 F
GS
[1 0 0 1 0 0] CT
0 0 moveto 
1 -1 scale
(6) t 
GR
GR
GS
[0.5 0 0 0.5 63 57] CT
0.149 GC
/Helvetica 20 F
GS
[1 0 0 1 0 0] CT
0 0 moveto 
1 -1 scale
(10) t 
GR
GR
GS
[0.5 0 0 0.5 74.5 52] CT
0.149 GC
/Helvetica 16 F
GS
[1 0 0 1 0 0] CT
0 0 moveto 
1 -1 scale
(8) t 
GR
GR
GS
[0 -0.5 0.5 0 48 170] CT
0.149 GC
N
1 6.766 M
1 6.563 1.031 6.484 QT
4.609 -7.891 L
5.109 -9.828 6.352 -11.68 QT
7.594 -13.531 9.352 -14.719 QT
11.109 -15.906 13.063 -15.906 QT
14.625 -15.906 15.797 -15.094 QT
16.969 -14.281 17.555 -12.953 QT
18.141 -11.625 18.141 -10.031 QT
18.141 -8.297 17.43 -6.438 QT
16.719 -4.578 15.461 -3.031 QT
14.203 -1.484 12.57 -0.539 QT
10.938 0.406 9.141 0.406 QT
8.094 0.406 7.156 -0.219 QT
6.219 -0.844 5.703 -1.859 QT
3.563 6.625 L
3.469 7.141 3.047 7.453 QT
2.625 7.766 2.094 7.766 QT
1.656 7.766 1.328 7.492 QT
1 7.219 1 6.766 QT
cp
9.219 -0.547 M
11.125 -0.547 12.539 -2.508 QT
13.953 -4.469 14.703 -7.109 QT
15.453 -9.75 15.453 -11.578 QT
15.453 -12.953 14.852 -13.969 QT
14.25 -14.984 12.984 -14.984 QT
11.422 -14.984 10.227 -13.797 QT
9.031 -12.609 8.313 -11.008 QT
7.594 -9.406 7.141 -7.672 QT
6.156 -3.641 L
6.375 -2.344 7.18 -1.445 QT
7.984 -0.547 9.219 -0.547 QT
cp
f
GR
GS
[0 -0.5 0.5 0 57 160.5] CT
0.149 GC
N
5.828 0.328 M
4.453 0.328 3.391 -0.328 QT
2.328 -0.984 1.742 -2.086 QT
1.156 -3.188 1.156 -4.594 QT
1.156 -6.563 2.258 -8.484 QT
3.359 -10.406 5.18 -11.609 QT
7 -12.813 8.984 -12.813 QT
10.469 -12.813 11.586 -12.039 QT
12.703 -11.266 13.281 -9.984 QT
13.859 -8.703 13.859 -7.25 QT
13.891 -5.313 L
14.875 -6.688 15.563 -8.164 QT
16.25 -9.641 16.625 -11.234 QT
16.688 -11.406 16.844 -11.406 QT
17.188 -11.406 L
17.453 -11.406 17.453 -11.125 QT
17.453 -11.109 17.438 -11.047 QT
17.094 -9.719 16.586 -8.492 QT
16.078 -7.266 15.391 -6.117 QT
14.703 -4.969 13.891 -4.031 QT
13.891 -0.438 14.734 -0.438 QT
15.266 -0.438 15.609 -0.758 QT
15.953 -1.078 16.219 -1.547 QT
16.484 -2.016 16.547 -2.031 QT
16.906 -2.031 L
17.141 -2.031 17.141 -1.734 QT
17.141 -1.016 16.313 -0.344 QT
15.484 0.328 14.672 0.328 QT
13.625 0.328 12.93 -0.352 QT
12.234 -1.031 11.984 -2.125 QT
10.625 -0.969 9.039 -0.32 QT
7.453 0.328 5.828 0.328 QT
cp
5.891 -0.438 M
8.984 -0.438 11.844 -2.984 QT
11.828 -3.156 11.797 -3.406 QT
11.766 -3.656 11.766 -3.688 QT
11.766 -6.813 L
11.766 -12.063 8.938 -12.063 QT
7.234 -12.063 5.961 -10.609 QT
4.688 -9.156 4.047 -7.141 QT
3.406 -5.125 3.406 -3.453 QT
3.406 -2.188 4.047 -1.313 QT
4.688 -0.438 5.891 -0.438 QT
cp
f
GR
GS
[0 -0.5 0.5 0 48 151] CT
0.149 GC
/Helvetica 36 F
GS
[1 0 0 1 0 0] CT
0 0 moveto 
1 -1 scale
(\() t 
GR
GR
GS
[0 -0.5 0.5 0 48 145] CT
0.149 GC
N
/f1382725292{4.359 0.406 M
2.328 0.406 1.422 -1.086 QT
0.516 -2.578 0.516 -4.75 QT
0.516 -6.172 0.766 -7.531 QT
1.016 -8.891 1.539 -10.289 QT
2.063 -11.688 2.727 -12.914 QT
3.391 -14.141 4.219 -15.297 QT
4.375 -15.516 4.641 -15.516 QT
4.875 -15.516 5.016 -15.375 QT
5.156 -15.234 5.156 -15.047 QT
5.156 -14.859 5.047 -14.703 QT
1.766 -10.172 1.766 -6.359 QT
1.766 -4.719 2.523 -3.531 QT
3.281 -2.344 4.859 -2.344 QT
6.203 -2.344 7.359 -3.133 QT
8.516 -3.922 9.359 -5.156 QT
9.359 -5.781 9.578 -7.117 QT
9.797 -8.453 10.258 -9.5 QT
10.719 -10.547 11.375 -10.547 QT
12.203 -10.547 12.203 -9.578 QT
12.203 -9.016 11.961 -8.164 QT
11.719 -7.313 11.43 -6.578 QT
11.141 -5.844 10.719 -4.906 QT
11.141 -2.344 13.297 -2.344 QT
14.531 -2.344 15.789 -3.063 QT
17.047 -3.781 18.016 -4.953 QT
18.984 -6.125 19.539 -7.477 QT
20.094 -8.828 20.094 -10.031 QT
20.094 -11.125 19.75 -11.734 QT
19.406 -12.344 18.844 -13.008 QT
18.281 -13.672 18.281 -14.078 QT
18.281 -14.781 18.883 -15.359 QT
19.484 -15.938 20.156 -15.938 QT
21.047 -15.938 21.414 -15.141 QT
21.781 -14.344 21.781 -13.328 QT
21.781 -11.672 21.125 -9.156 QT
20.469 -6.641 19.625 -4.969 QT
18.453 -2.703 16.703 -1.148 QT
14.953 0.406 12.781 0.406 QT
11.391 0.406 10.539 -0.43 QT
9.688 -1.266 9.438 -2.703 QT
8.438 -1.281 7.156 -0.438 QT
5.875 0.406 4.359 0.406 QT
cp}def
f1382725292
f
GR
GS
[0 -0.5 0.5 0 48 133.5] CT
0.149 GC
/Helvetica 36 F
GS
[1 0 0 1 0 0] CT
0 0 moveto 
1 -1 scale
(;g\)) t 
GR
GR
GS
[0.5 0 0 0.5 0 0] CT
0.502 GC
[8 2 4 2] 0 setdash
2 LJ
2 LW
N
166 215.182 M
167.647 230.125 L
167.977 519.057 L
S
GR
GS
[0.5 0 0 0.5 0 0] CT
0.502 GC
[8 2 4 2] 0 setdash
2 LJ
2 LW
N
172.491 519.057 M
172.587 448.29 L
174.233 418.317 L
175.88 419.786 L
177.527 465.391 L
178.715 519.057 L
S
GR
GS
[0.5 0 0 0.5 0 0] CT
0.502 GC
[8 2 4 2] 0 setdash
2 LJ
2 LW
N
179.375 519.057 M
180.82 370.985 L
182.467 357.564 L
184.113 356.443 L
185.76 367.863 L
187.407 420.707 L
189.053 387.945 L
190.7 384.268 L
192.347 407.509 L
193.993 414.179 L
195.64 399.327 L
197.287 385.264 L
198.933 395.601 L
200.58 431.217 L
202.227 431.913 L
203.873 436.556 L
205.52 444.804 L
207.167 450.426 L
208.813 417.62 L
210.46 410.48 L
212.107 430.796 L
213.753 435.932 L
215.4 435.358 L
217.047 438.926 L
218.693 411.561 L
220.34 415.916 L
221.987 471.576 L
223.633 470.329 L
225.28 464.135 L
226.927 461.168 L
228.573 457.681 L
230.22 461.03 L
231.867 435.311 L
233.513 438.367 L
235.16 456.232 L
236.807 447.932 L
238.453 468.125 L
240.1 476.003 L
241.747 454.289 L
243.393 456.491 L
245.04 453.977 L
246.687 454.887 L
248.333 451.622 L
249.98 449.967 L
251.627 464.663 L
253.273 427.894 L
254.92 422.923 L
256.567 448.508 L
258.213 462.628 L
259.86 433.388 L
261.507 430.248 L
263.153 457.243 L
264.8 450.607 L
266.447 428.112 L
268.093 412.445 L
269.74 422.109 L
271.387 408.075 L
273.033 410.301 L
274.68 411.915 L
276.327 410.11 L
277.973 427.448 L
279.62 404.996 L
281.267 390.179 L
282.913 387.038 L
284.56 404.889 L
286.207 503.071 L
287.853 396.463 L
289.5 385.441 L
291.147 403.617 L
292.793 431.29 L
294.44 400.161 L
296.087 401.844 L
297.733 247.971 L
299.38 242.757 L
301.027 272.121 L
302.673 325.573 L
304.32 366.394 L
305.967 386.768 L
307.613 386.56 L
309.26 394.296 L
310.907 425.834 L
312.553 458.551 L
314.2 392.184 L
315.847 380.797 L
317.493 375.52 L
319.14 387.371 L
320.787 475.196 L
322.433 411.138 L
324.08 402.24 L
325.727 423.454 L
327.373 421.121 L
329.02 418.326 L
330.667 407.499 L
332.313 414.61 L
333.96 429.1 L
335.607 419.127 L
337.253 423.819 L
338.9 450.662 L
340.547 464.601 L
342.193 425.945 L
343.84 429.404 L
345.487 459.327 L
347.133 443.923 L
348.78 449.504 L
350.427 421.968 L
352.073 417.352 L
353.72 447.415 L
355.367 456.685 L
357.013 470.801 L
358.66 490.983 L
360.307 491.271 L
361.953 483.969 L
363.6 453.801 L
365.247 439.156 L
366.893 452.101 L
368.54 483.865 L
370.187 471.673 L
371.833 473.534 L
373.48 484.75 L
375.127 486.721 L
376.773 456.794 L
378.42 456.344 L
380.067 484.32 L
381.713 473.606 L
383.36 475.492 L
385.007 465.878 L
386.653 460.733 L
388.3 470.371 L
389.947 475.945 L
391.593 478.91 L
393.24 487.097 L
394.887 478.142 L
396.533 472.65 L
398.18 483.637 L
399.827 497.31 L
401.473 488.213 L
403.12 475.508 L
404.767 475.111 L
406.413 483.721 L
408.06 473.509 L
409.707 481.723 L
411.353 476.999 L
413 470.541 L
414.647 483.361 L
416.293 494.006 L
417.55 519.057 L
S
GR
GS
[0.5 0 0 0.5 0 0] CT
0.502 GC
[8 2 4 2] 0 setdash
2 LJ
2 LW
N
420.624 519.057 M
421.233 515.803 L
421.768 519.057 L
S
GR
GS
[0.5 0 0 0.5 0 0] CT
0.502 GC
[8 2 4 2] 0 setdash
2 LJ
2 LW
N
428.94 519.057 M
429.467 453.189 L
431.113 438.245 L
432.76 447.805 L
434.407 480.668 L
436.053 502.641 L
437.7 516.436 L
439.347 511.595 L
440.993 490.421 L
442.64 498.555 L
443.285 519.057 L
S
GR
GS
[0.5 0 0 0.5 0 0] CT
0.502 GC
[8 2 4 2] 0 setdash
2 LJ
2 LW
N
445.584 519.057 M
445.933 510.48 L
447.58 485.579 L
449.227 468.831 L
450.873 466.158 L
452.52 489.991 L
454.167 505.453 L
455.813 477.026 L
457.46 471.179 L
459.107 485.36 L
460.753 494.947 L
462.4 502.547 L
464.047 488.042 L
465.693 489.203 L
467.34 490.605 L
468.987 476.558 L
470.633 480.196 L
472.28 504.206 L
473.927 502.545 L
475.573 502.876 L
477.22 509.306 L
478.867 502.49 L
480.513 498.818 L
482.16 493.229 L
483.807 483.974 L
485.453 488.733 L
487.1 502.935 L
488.747 495.629 L
490.393 504.24 L
491.343 519.057 L
S
GR
GS
[0.5 0 0 0.5 0 0] CT
0.502 GC
[8 2 4 2] 0 setdash
2 LJ
2 LW
N
493.089 519.057 M
493.687 512.858 L
495.333 511.565 L
496.98 507.59 L
498.627 508.068 L
499.654 519.057 L
S
GR
GS
[0.5 0 0 0.5 0 0] CT
0.502 GC
[8 2 4 2] 0 setdash
2 LJ
2 LW
N
500.74 519.057 M
501.92 502.346 L
503.567 487.637 L
505.213 499.937 L
506.86 508.591 L
508.507 484.838 L
510.153 470.147 L
511.8 478.055 L
513.447 516.83 L
515.093 505.473 L
516.74 488.898 L
518.387 471.144 L
520.033 473.664 L
521.68 498.807 L
523.327 505.027 L
524.973 494.829 L
526.62 485.356 L
528.267 483.92 L
529.913 488.06 L
531.56 502.126 L
533.207 498.995 L
534.853 490.973 L
536.5 484.481 L
538.147 496.072 L
539.793 506.095 L
541.44 501.361 L
543.087 495.986 L
544.733 485.675 L
546.38 476.952 L
548.027 481.37 L
549.673 510.16 L
550.046 519.057 L
S
GR
GS
[0.5 0 0 0.5 0 0] CT
0.502 GC
[8 2 4 2] 0 setdash
2 LJ
2 LW
N
553.817 519.057 M
554.613 508.517 L
556.26 509.888 L
556.953 519.057 L
S
GR
GS
[0.5 0 0 0.5 0 0] CT
0.502 GC
[8 2 4 2] 0 setdash
2 LJ
2 LW
N
560.813 519.057 M
561.2 498.729 L
562.847 450.898 L
564.493 452.862 L
566.14 483.742 L
567.787 508.128 L
569.433 511.668 L
571.08 512.873 L
572.727 514.093 L
574.373 517.447 L
574.431 519.057 L
S
GR
GS
[0.5 0 0 0.5 0 0] CT
0.502 GC
[8 2 4 2] 0 setdash
2 LJ
2 LW
N
578.714 519.057 M
579.313 509.611 L
580.96 503.796 L
582.607 466.374 L
584.253 464.906 L
585.9 496.871 L
586.865 519.057 L
S
GR
GS
[0.5 0 0 0.5 0 0] CT
0.502 GC
[8 2 4 2] 0 setdash
2 LJ
2 LW
N
588.103 519.057 M
589.193 488.347 L
590.84 485.946 L
592.487 491.601 L
594.133 500.464 L
595.095 519.057 L
S
GR
GS
[0.5 0 0 0.5 0 0] CT
0.502 GC
[8 2 4 2] 0 setdash
2 LJ
2 LW
N
597.067 519.057 M
597.427 515.357 L
599.073 516.674 L
600.72 512.373 L
602.367 507.369 L
604.013 517.226 L
605.66 508.164 L
607.307 499.116 L
608.953 504.368 L
610.6 506.053 L
612.247 516.494 L
613.893 505.485 L
615.54 482.146 L
617.187 487.523 L
618.029 519.057 L
S
GR
GS
[0.5 0 0 0.5 0 0] CT
0.502 GC
[8 2 4 2] 0 setdash
2 LJ
2 LW
N
619.916 519.057 M
620.48 503.383 L
622.127 495.209 L
623.773 506.751 L
624.978 519.057 L
S
GR
GS
[0.5 0 0 0.5 0 0] CT
0.502 GC
[8 2 4 2] 0 setdash
2 LJ
2 LW
N
627.535 519.057 M
628.713 502.471 L
630.36 499.557 L
632.007 514.467 L
632.46 519.057 L
S
GR
GS
[0.5 0 0 0.5 0 0] CT
0.502 GC
[8 2 4 2] 0 setdash
2 LJ
2 LW
N
636.785 519.057 M
636.947 517.814 L
638.593 518.26 L
640.24 514.157 L
641.887 507.305 L
643.533 513.988 L
645.18 511.951 L
646.827 512.703 L
648.473 511.85 L
650.12 493.397 L
651.767 496.784 L
653.376 519.057 L
S
GR
GS
[0.5 0 0 0.5 0 0] CT
0.502 GC
[8 2 4 2] 0 setdash
2 LJ
2 LW
N
653.661 519.057 M
655.06 516.176 L
656.707 508.565 L
658.353 509.856 L
660 513.565 L
661.647 508.015 L
663.293 503.357 L
664.94 513.335 L
665.483 519.057 L
S
GR
GS
[0.5 0 0 0.5 0 0] CT
0.502 GC
[8 2 4 2] 0 setdash
2 LJ
2 LW
N
667.419 519.057 M
668.233 507.697 L
669.88 508.626 L
670.386 519.057 L
S
GR
GS
[0.5 0 0 0.5 0 0] CT
0.502 GC
[8 2 4 2] 0 setdash
2 LJ
2 LW
N
673.536 519.057 M
674.82 514.445 L
676.467 502.081 L
678.113 500.11 L
679.76 499.633 L
681.407 504.828 L
681.978 519.057 L
S
GR
GS
[0.5 0 0 0.5 0 0] CT
0.502 GC
[8 2 4 2] 0 setdash
2 LJ
2 LW
N
694.224 519.057 M
694.58 468.485 L
696.227 463.902 L
697.873 488.897 L
699.52 494.321 L
700.165 519.057 L
S
GR
GS
[0.5 0 0 0.5 0 0] CT
0.502 GC
[8 2 4 2] 0 setdash
2 LJ
2 LW
N
714.959 519.057 M
715.987 497.757 L
717.633 494.225 L
719.28 514.32 L
720.927 492.792 L
722.573 492.598 L
724.22 509.117 L
725.867 512.815 L
726.055 519.057 L
S
GR
GS
[0.5 0 0 0.5 0 0] CT
0.502 GC
[8 2 4 2] 0 setdash
2 LJ
2 LW
N
733.141 519.057 M
734.1 509.404 L
735.747 501.023 L
737.393 512.479 L
739.04 509.698 L
740.687 509.447 L
741.179 519.057 L
S
GR
GS
[0.5 0 0 0.5 0 0] CT
0.502 GC
[8 2 4 2] 0 setdash
2 LJ
2 LW
N
746.641 519.057 M
747.273 508.481 L
748.92 501.784 L
750.417 519.057 L
S
GR
GS
[0.5 0 0 0.5 0 0] CT
0.502 GC
[8 2 4 2] 0 setdash
2 LJ
2 LW
N
752.575 519.057 M
753.86 507.67 L
755.507 504.723 L
757.032 519.057 L
S
GR
GS
[0.5 0 0 0.5 0 0] CT
0.502 GC
[8 2 4 2] 0 setdash
2 LJ
2 LW
N
770.736 519.057 M
771.973 507.935 L
773.62 505.146 L
775.267 511.868 L
776.148 519.057 L
S
GR
GS
[0.5 0 0 0.5 0 0] CT
0.502 GC
[8 2 4 2] 0 setdash
2 LJ
2 LW
N
782.038 519.057 M
783.5 503.753 L
785.147 502.034 L
786.366 519.057 L
S
GR
GS
[0.5 0 0 0.5 0 0] CT
0.502 GC
[8 2 4 2] 0 setdash
2 LJ
2 LW
N
790.716 519.057 M
791.733 500.61 L
793.38 503.301 L
794.657 519.057 L
S
GR
GS
[0.5 0 0 0.5 0 0] CT
0.502 GC
[8 2 4 2] 0 setdash
2 LJ
2 LW
N
795.938 519.057 M
796.673 515.379 L
798.32 514.351 L
799.967 516.906 L
801.613 513.402 L
802.303 519.057 L
S
GR
GS
[0.5 0 0 0.5 0 0] CT
0.502 GC
[8 2 4 2] 0 setdash
2 LJ
2 LW
N
809.429 519.057 M
809.847 513.273 L
811.493 512.248 L
812.061 519.057 L
S
GR
GS
[0.5 0 0 0.5 0 0] CT
0.502 GC
[8 2 4 2] 0 setdash
2 LJ
2 LW
N
825.441 519.057 M
826.313 491.136 L
827.96 467.605 L
829.607 476.135 L
831.253 493.212 L
832.9 494.133 L
834.068 519.057 L
S
GR
GS
[0.5 0 0 0.5 0 0] CT
0.502 GC
[8 2 4 2] 0 setdash
2 LJ
2 LW
N
848.163 519.057 M
849.367 509.537 L
851.013 513.87 L
851.553 519.057 L
S
GR
GS
[0.5 0 0 0.5 0 0] CT
0.502 GC
[8 2 4 2] 0 setdash
2 LJ
2 LW
N
853.367 519.057 M
854.307 504.927 L
855.953 506.889 L
857.575 519.057 L
S
GR
GS
[0.5 0 0 0.5 0 0] CT
0.502 GC
[8 2 4 2] 0 setdash
2 LJ
2 LW
N
867.577 519.057 M
869.127 516.984 L
870.773 516.271 L
872.182 519.057 L
S
GR
GS
[0.5 0 0 0.5 0 0] CT
0.502 GC
[8 2 4 2] 0 setdash
2 LJ
2 LW
N
880.132 519.057 M
880.653 508.957 L
882.3 511.914 L
882.952 519.057 L
S
GR
GS
[0.5 0 0 0.5 0 0] CT
0.502 GC
[8 2 4 2] 0 setdash
2 LJ
2 LW
N
887.761 519.057 M
888.887 509.083 L
890.533 515.438 L
890.876 519.057 L
S
GR
GS
[0.5 0 0 0.5 0 0] CT
0.502 GC
[8 2 4 2] 0 setdash
2 LJ
2 LW
N
893.181 519.057 M
893.827 510.183 L
895.473 516.377 L
895.609 519.057 L
S
GR
GS
[0.5 0 0 0.5 0 0] CT
0.502 GC
[8 2 4 2] 0 setdash
2 LJ
2 LW
N
906.315 519.057 M
907 511.534 L
908.647 510.817 L
909.714 519.057 L
S
GR
GS
[0.5 0 0 0.5 0 0] CT
0.502 GC
[8 2 4 2] 0 setdash
2 LJ
2 LW
N
942.96 519.057 M
943.227 512.961 L
944.873 512.924 L
945.522 519.057 L
S
GR
GS
[0.5 0 0 0.5 0 0] CT
0.502 GC
[8 2 4 2] 0 setdash
2 LJ
2 LW
N
958.892 519.057 M
959.693 474.072 L
961.34 472.727 L
962.728 519.057 L
S
GR
GS
[0.5 0 0 0.5 0 0] CT
0.502 GC
[8 2 4 2] 0 setdash
2 LJ
2 LW
N
964.06 519.057 M
964.633 514.442 L
966.28 517.822 L
966.343 519.057 L
S
GR
GS
[0.5 0 0 0.5 0 0] CT
0.502 GC
[8 2 4 2] 0 setdash
2 LJ
2 LW
N
981.397 519.057 M
982.747 509.705 L
984.166 519.057 L
S
GR
GS
[0.5 0 0 0.5 0 0] CT
0.502 GC
[8 2 4 2] 0 setdash
2 LJ
2 LW
N
990.461 519.057 M
990.98 514.222 L
991.911 519.057 L
S
GR
GS
[0.5 0 0 0.5 0 0] CT
0.502 GC
[8 2 4 2] 0 setdash
2 LJ
2 LW
N
1013.671 519.057 M
1014.033 517.153 L
1014.177 519.057 L
S
GR
GS
[0.5 0 0 0.5 0 0] CT
0.502 GC
[8 2 4 2] 0 setdash
2 LJ
2 LW
N
1020.78 519.057 M
1022.267 515.824 L
1022.685 519.057 L
S
GR
GS
[0.5 0 0 0.5 0 0] CT
0.502 GC
[8 2 4 2] 0 setdash
2 LJ
2 LW
N
1038.568 519.057 M
1038.733 516.339 L
1040.38 510.231 L
1041.329 519.057 L
S
GR
GS
[0.5 0 0 0.5 0 0] CT
0.502 GC
[8 2 4 2] 0 setdash
2 LJ
2 LW
N
1047.767 519.057 M
1048.613 510.241 L
1050.26 517.351 L
1050.363 519.057 L
S
GR
GS
[0.5 0 0 0.5 0 0] CT
0.502 GC
[8 2 4 2] 0 setdash
2 LJ
2 LW
N
1053.432 519.057 M
1053.553 517.033 L
1055.2 517.281 L
1055.275 519.057 L
S
GR
GS
[0.5 0 0 0.5 0 0] CT
0.502 GC
[8 2 4 2] 0 setdash
2 LJ
2 LW
N
1065.417 519.057 M
1066.727 515.907 L
1066.999 519.057 L
S
GR
GS
[0.5 0 0 0.5 0 0] CT
0.502 GC
[8 2 4 2] 0 setdash
2 LJ
2 LW
N
1076.036 519.057 M
1076.607 513.006 L
1078.253 515.772 L
1079.027 519.057 L
S
GR
GS
[0.5 0 0 0.5 0 0] CT
0.502 GC
[8 2 4 2] 0 setdash
2 LJ
2 LW
N
1090.584 519.057 M
1091.427 494.048 L
1093.073 480.492 L
1094.72 496.49 L
1095.502 519.057 L
S
GR
GS
[0.5 0 0 0.5 0 0] CT
0.502 GC
[8 2 4 2] 0 setdash
2 LJ
2 LW
N
1119.124 519.057 M
1119.42 516.884 L
1121.067 513.517 L
1122.713 517.236 L
1123.152 519.057 L
S
GR
GS
[0.5 0 0 0.5 0 0] CT
[8 2 4 2] 0 setdash
2 LJ
2 LW
N
166 129.869 M
167.647 144.812 L
169.293 354.26 L
170.94 362.864 L
172.587 371.474 L
174.233 375.186 L
175.88 382.037 L
177.527 390.958 L
179.173 392.921 L
180.82 395.747 L
182.467 397.4 L
184.113 400.415 L
185.76 406.775 L
187.407 412.37 L
189.053 410.591 L
190.7 410.044 L
192.347 412.179 L
193.993 413.551 L
195.64 413.4 L
197.287 409.995 L
198.933 408.124 L
200.58 408.787 L
202.227 406.74 L
203.873 408.194 L
205.52 416.712 L
207.167 420.483 L
208.813 418.743 L
210.46 419.693 L
212.107 428.355 L
213.753 426.048 L
215.4 429.04 L
217.047 426.845 L
218.693 424.042 L
220.34 426.317 L
221.987 424.414 L
223.633 424.64 L
225.28 425.007 L
226.927 423.204 L
228.573 420.89 L
230.22 421.209 L
231.867 419.313 L
233.513 418.802 L
235.16 419.395 L
236.807 420.171 L
238.453 425.672 L
240.1 423.079 L
241.747 420.967 L
243.393 427.762 L
245.04 425.717 L
246.687 426.917 L
248.333 429.251 L
249.98 428.134 L
251.627 430.025 L
253.273 420.002 L
254.92 420.585 L
256.567 422.969 L
258.213 414.301 L
259.86 407.642 L
261.507 405.962 L
263.153 407.37 L
264.8 407.171 L
266.447 407.678 L
268.093 413.554 L
269.74 414.293 L
271.387 413.781 L
273.033 413.982 L
274.68 415.316 L
276.327 417.45 L
277.973 411.409 L
279.62 404.551 L
281.267 403.969 L
282.913 403.107 L
284.56 400.03 L
286.207 396.582 L
287.853 388.113 L
289.5 380.921 L
291.147 372.862 L
292.793 362.583 L
294.44 350.858 L
296.087 171.775 L
297.733 155.781 L
299.38 169.823 L
301.027 356.926 L
302.673 360.285 L
304.32 371.027 L
305.967 379.544 L
307.613 389.053 L
309.26 396.749 L
310.907 398.931 L
312.553 400.953 L
314.2 403.156 L
315.847 406.055 L
317.493 414.394 L
319.14 421.447 L
320.787 419.771 L
322.433 419.275 L
324.08 418.875 L
325.727 417.398 L
327.373 417.405 L
329.02 415.283 L
330.667 413.543 L
332.313 411.515 L
333.96 411.698 L
335.607 414.541 L
337.253 419.75 L
338.9 425.932 L
340.547 428.684 L
342.193 433.074 L
343.84 442.885 L
345.487 439.305 L
347.133 443.073 L
348.78 442.284 L
350.427 440.147 L
352.073 442.352 L
353.72 440.549 L
355.367 440.353 L
357.013 440.789 L
358.66 438.847 L
360.307 437.814 L
361.953 437.763 L
363.6 432.983 L
365.247 434.909 L
366.893 435.709 L
368.54 435.261 L
370.187 442.094 L
371.833 440.701 L
373.48 439.563 L
375.127 448.25 L
376.773 446.522 L
378.42 447.57 L
380.067 454.423 L
381.713 457.006 L
383.36 460.684 L
385.007 450.789 L
386.653 451.392 L
388.3 460.118 L
389.947 457.15 L
391.593 455.749 L
393.24 458.18 L
394.887 460.236 L
396.533 457.175 L
398.18 455.837 L
399.827 459.129 L
401.473 456.876 L
403.12 449.883 L
404.767 452.121 L
406.413 458.163 L
408.06 461.597 L
409.707 455.323 L
411.353 455.68 L
413 463.485 L
414.647 461.528 L
416.293 462.298 L
417.94 463.435 L
419.587 464.647 L
421.233 461.808 L
422.88 463.909 L
424.527 466.896 L
426.173 475.723 L
427.82 466.772 L
429.467 454.661 L
431.113 465.358 L
432.76 475.3 L
434.407 470.542 L
436.053 468.094 L
437.7 465.951 L
439.347 469.652 L
440.993 467.26 L
442.64 466.817 L
444.287 466.899 L
445.933 465.149 L
447.58 459.559 L
449.227 459.694 L
450.873 467.26 L
452.52 467.266 L
454.167 466.577 L
455.813 468.733 L
457.46 475.558 L
459.107 479.593 L
460.753 477.035 L
462.4 471.859 L
464.047 472.274 L
465.693 475.343 L
467.34 473.667 L
468.987 475.277 L
470.633 481.2 L
472.28 472.929 L
473.927 471.41 L
475.573 483.399 L
477.22 478.85 L
478.867 475.296 L
480.513 471.87 L
482.16 471.76 L
483.807 473.87 L
485.453 466.67 L
487.1 470.363 L
488.747 476.696 L
490.393 470.581 L
492.04 468.118 L
493.687 470.049 L
495.333 466.865 L
496.98 467.991 L
498.627 472.119 L
500.273 474.652 L
501.92 477.247 L
503.567 474.657 L
505.213 475.884 L
506.86 480.233 L
508.507 477.895 L
510.153 479.613 L
511.8 482.703 L
513.447 484.86 L
515.093 486.55 L
516.74 477.752 L
518.387 476.866 L
520.033 480.889 L
521.68 479.478 L
523.327 474.692 L
524.973 475.94 L
526.62 479.709 L
528.267 476.668 L
529.913 478.906 L
531.56 483.422 L
533.207 482.587 L
534.853 476.536 L
536.5 477.128 L
538.147 480.249 L
539.793 482.69 L
541.44 478.014 L
543.087 477.179 L
544.733 485.253 L
546.38 484.818 L
548.027 486.041 L
549.673 488.255 L
551.32 489.861 L
552.967 486.593 L
554.613 488.34 L
556.26 492.443 L
557.907 499.603 L
559.553 481.09 L
561.2 468.739 L
562.847 481.248 L
564.493 497.687 L
566.14 495.444 L
567.787 492.827 L
569.433 489.122 L
571.08 491.593 L
572.727 492.656 L
574.373 493.382 L
576.02 490.482 L
577.667 488.624 L
579.313 480.591 L
580.96 479.643 L
582.607 488.755 L
584.253 488.151 L
585.9 486.529 L
587.547 484.768 L
589.193 488.652 L
590.84 493.458 L
592.487 489.979 L
594.133 485.214 L
595.78 485.187 L
597.427 486.262 L
599.073 486.176 L
600.72 489.238 L
602.367 492.544 L
604.013 486.071 L
605.66 486.975 L
607.307 494.682 L
608.953 493.62 L
610.6 494.037 L
612.247 489.547 L
613.893 489.929 L
615.54 493.599 L
617.187 486.497 L
618.833 487.851 L
620.48 492.424 L
622.127 487.9 L
623.773 485.139 L
625.42 487.525 L
627.067 484.54 L
628.713 483.345 L
630.36 485.66 L
632.007 486.014 L
633.653 489.795 L
635.3 487.293 L
636.947 487.615 L
638.593 494.631 L
640.24 494.02 L
641.887 495.882 L
643.533 495.554 L
645.18 496.436 L
646.827 499.393 L
648.473 491.743 L
650.12 492.353 L
651.767 499.144 L
653.413 496.894 L
655.06 492.781 L
656.707 495.73 L
658.353 499.387 L
660 492.083 L
661.647 492.659 L
663.293 496.06 L
664.94 495.017 L
666.587 487.47 L
668.233 487.035 L
669.88 490.374 L
671.527 492.64 L
673.173 488.419 L
674.82 488.312 L
676.467 497.447 L
678.113 497.784 L
679.76 496.538 L
681.407 497.726 L
683.053 501.068 L
684.7 499.231 L
686.347 502.184 L
687.993 505.697 L
689.64 511.722 L
691.287 502.419 L
692.933 489.761 L
694.58 499.89 L
696.227 506.771 L
697.873 505.535 L
699.52 506.066 L
701.167 501.672 L
702.813 502.483 L
704.46 503.205 L
706.107 502.792 L
707.753 501.507 L
709.4 502.464 L
711.047 493.833 L
712.693 491.909 L
714.34 501.13 L
715.987 501.934 L
717.633 501.553 L
719.28 500.023 L
720.927 501.973 L
722.573 505.23 L
724.22 503.34 L
725.867 498.276 L
727.513 497.595 L
729.16 498.071 L
730.807 497.312 L
732.453 501.832 L
734.1 507.717 L
735.747 499.671 L
737.393 498.158 L
739.04 505.167 L
740.687 503.796 L
742.333 502.621 L
743.98 500.278 L
745.627 499.663 L
747.273 501.645 L
748.92 494.478 L
750.567 495.928 L
752.213 499.191 L
753.86 494.796 L
755.507 492.656 L
757.153 495.318 L
758.8 494.431 L
760.447 493.968 L
762.093 494.315 L
763.74 492.898 L
765.387 497.319 L
767.033 497.816 L
768.68 496.951 L
770.327 500.928 L
771.973 500.67 L
773.62 505.203 L
775.267 507.908 L
776.913 507.759 L
778.56 508.544 L
780.207 504.631 L
781.853 505.1 L
783.5 506.405 L
785.147 503.635 L
786.793 500.883 L
788.44 502.153 L
790.087 505.791 L
791.733 499.948 L
793.38 500.33 L
795.027 504.525 L
796.673 504.505 L
798.32 501.183 L
799.967 499.258 L
801.613 501.415 L
803.26 504.69 L
804.907 498.843 L
806.553 499.212 L
808.2 508.326 L
809.847 508.732 L
811.493 507.266 L
813.14 507.347 L
814.787 509.514 L
816.433 508.953 L
818.08 512.885 L
819.727 515.71 L
821.373 518.904 L
823.02 511.457 L
824.667 498.77 L
826.313 507.672 L
827.96 517.074 L
829.607 514.791 L
831.253 515.887 L
832.9 510.017 L
834.547 509.597 L
836.193 512.584 L
837.84 512.423 L
839.487 510.38 L
841.133 511.625 L
842.78 504.4 L
844.427 503.187 L
846.073 511.686 L
847.72 508.896 L
849.367 509.54 L
851.013 510.409 L
852.66 512.674 L
854.307 517.294 L
855.953 514.552 L
857.6 505.912 L
859.247 505.357 L
860.893 508.439 L
862.54 507.705 L
864.187 509.751 L
865.833 513.772 L
867.48 506.742 L
869.127 506.026 L
870.773 512.326 L
872.42 510.745 L
874.067 510.634 L
875.713 509.84 L
877.36 510.475 L
879.007 512.222 L
880.653 503.625 L
882.3 505.41 L
883.947 509.541 L
885.593 503.513 L
887.24 502.681 L
888.887 507.494 L
890.533 501.947 L
892.18 501.605 L
893.827 504.485 L
895.473 502.732 L
897.12 505.331 L
898.767 505.184 L
900.413 505.11 L
902.06 510.148 L
903.707 508.416 L
905.353 510.589 L
907 512.214 L
908.647 514.102 L
910.293 513.436 L
911.94 508.273 L
913.587 510.469 L
915.233 516.648 L
916.88 514.427 L
918.527 509.772 L
920.173 510.22 L
921.82 512.295 L
923.467 507.294 L
925.113 508.917 L
926.76 513.689 L
928.407 513.79 L
930.053 509.919 L
931.7 507.017 L
933.347 506.979 L
934.993 510.094 L
936.64 504.478 L
938.287 505.548 L
939.933 512.646 L
941.58 512.383 L
943.227 511.79 L
944.873 511.68 L
946.52 514.976 L
948.167 513.258 L
949.813 517.142 L
950.486 519.057 L
S
GR
GS
[0.5 0 0 0.5 0 0] CT
[8 2 4 2] 0 setdash
2 LJ
2 LW
N
954.245 519.057 M
954.753 516.398 L
956.4 505.579 L
958.047 515.623 L
958.78 519.057 L
S
GR
GS
[0.5 0 0 0.5 0 0] CT
[8 2 4 2] 0 setdash
2 LJ
2 LW
N
963.729 519.057 M
964.633 516.548 L
966.28 515.09 L
967.927 517.089 L
969.573 517.711 L
971.22 514.695 L
972.867 514.996 L
974.513 509.03 L
976.16 508.502 L
977.807 516.207 L
979.453 511.354 L
981.1 512.085 L
982.747 512.858 L
984.393 515.155 L
985.356 519.057 L
S
GR
GS
[0.5 0 0 0.5 0 0] CT
[8 2 4 2] 0 setdash
2 LJ
2 LW
N
988.209 519.057 M
989.333 512.042 L
990.98 510.196 L
992.627 514.857 L
994.273 515.306 L
995.92 516.715 L
997.567 518.523 L
999.213 511.234 L
1000.86 510.804 L
1002.507 516.981 L
1004.153 517.157 L
1005.8 517.648 L
1007.447 514.289 L
1009.093 514.039 L
1010.74 517.767 L
1012.387 508.379 L
1014.033 510.821 L
1015.68 513.347 L
1017.327 509.337 L
1018.973 509.567 L
1020.62 512.277 L
1022.267 508.588 L
1023.913 507.427 L
1025.56 508.829 L
1027.207 507.11 L
1028.853 511.802 L
1030.5 512.551 L
1032.147 511.166 L
1033.793 516.659 L
1035.44 516.97 L
1037.087 519.047 L
1037.261 519.057 L
S
GR
GS
[0.5 0 0 0.5 0 0] CT
[8 2 4 2] 0 setdash
2 LJ
2 LW
N
1042.723 519.057 M
1043.673 517.234 L
1045.32 518.604 L
1045.533 519.057 L
S
GR
GS
[0.5 0 0 0.5 0 0] CT
[8 2 4 2] 0 setdash
2 LJ
2 LW
N
1049.825 519.057 M
1050.26 517.851 L
1051.907 516.604 L
1053.553 518.726 L
1055.2 514.162 L
1056.847 514.768 L
1058.493 518.386 L
1060.14 518.617 L
1061.787 513.624 L
1063.433 512.532 L
1065.08 513.922 L
1066.727 517.451 L
1068.373 512.643 L
1070.02 513.853 L
1071.278 519.057 L
S
GR
GS
[0.5 0 0 0.5 0 0] CT
[8 2 4 2] 0 setdash
2 LJ
2 LW
N
1072.87 519.057 M
1073.313 518.464 L
1074.96 517.575 L
1076.607 517.54 L
1077.073 519.057 L
S
GR
GS
[0.5 0 0 0.5 0 0] CT
[8 2 4 2] 0 setdash
2 LJ
2 LW
N
1087.035 519.057 M
1088.133 511.824 L
1089.353 519.057 L
S
GR
GS
[0.5 0 0 0.5 0 0] CT
[8 2 4 2] 0 setdash
2 LJ
2 LW
N
1105.409 519.057 M
1106.247 514.171 L
1107.893 513.784 L
1108.777 519.057 L
S
GR
GS
[0.5 0 0 0.5 0 0] CT
[8 2 4 2] 0 setdash
2 LJ
2 LW
N
1110.85 519.057 M
1111.187 517.885 L
1112.833 516.765 L
1113.642 519.057 L
S
GR
GS
[0.5 0 0 0.5 0 0] CT
[8 2 4 2] 0 setdash
2 LJ
2 LW
N
1120.576 519.057 M
1121.067 517.353 L
1122.713 515.09 L
1124.36 517.081 L
1126.007 518.764 L
1126.261 519.057 L
S
GR
GS
[0.5 0 0 0.5 0 0] CT
[8 2 4 2] 0 setdash
2 LJ
2 LW
N
1143.508 519.057 M
1144.12 516.079 L
1145.767 518.35 L
1146.538 519.057 L
S
GR
GS
[0.5 0 0 0.5 0 0] CT
[8 2 4 2] 0 setdash
2 LJ
2 LW
N
1147.63 519.057 M
1149.06 513.761 L
1150.707 513.193 L
1152.353 514.925 L
1154 510.741 L
S
GR
GS
[0.5 0 0 0.5 0 0] CT
1 LJ
3 LW
N
166 45 M
167.647 59.942 L
169.293 320.849 L
170.94 336.521 L
172.587 345.158 L
174.233 350.65 L
175.88 352.559 L
177.527 352.488 L
179.173 353.149 L
180.82 356.265 L
182.467 361.492 L
184.113 367.338 L
185.76 374.99 L
187.407 382.888 L
189.053 388.692 L
190.7 393.612 L
192.347 396.751 L
193.993 398.881 L
195.64 401.235 L
197.287 402.42 L
198.933 402.424 L
200.58 401.601 L
202.227 399.357 L
203.873 397 L
205.52 397.644 L
207.167 400.04 L
208.813 403.214 L
210.46 407.712 L
212.107 412.071 L
213.753 414.63 L
215.4 417.586 L
217.047 418.963 L
218.693 418.517 L
220.34 415.845 L
221.987 414.851 L
223.633 418.222 L
225.28 419.089 L
226.927 418.207 L
228.573 416.224 L
230.22 413.795 L
231.867 411.642 L
233.513 410.425 L
235.16 410.762 L
236.807 411.051 L
238.453 410.072 L
240.1 407.518 L
241.747 403.936 L
243.393 407.77 L
245.04 415.609 L
246.687 418.907 L
248.333 419.564 L
249.98 419.368 L
251.627 418.305 L
253.273 414.14 L
254.92 410.369 L
256.567 407.946 L
258.213 406.957 L
259.86 407.887 L
261.507 410.871 L
263.153 412.911 L
264.8 413.456 L
266.447 413.444 L
268.093 412.627 L
269.74 410.521 L
271.387 409.066 L
273.033 407.003 L
274.68 402.817 L
276.327 397.621 L
277.973 390.581 L
279.62 383.242 L
281.267 377.354 L
282.913 373.037 L
284.56 370.661 L
286.207 369.486 L
287.853 368.007 L
289.5 363.748 L
291.147 355.537 L
292.793 343.8 L
294.44 321.952 L
296.087 86.013 L
297.733 70.894 L
299.38 85.661 L
301.027 321.648 L
302.673 343.7 L
304.32 355.672 L
305.967 362.838 L
307.613 366.667 L
309.26 368.416 L
310.907 370.015 L
312.553 373.076 L
314.2 379.104 L
315.847 386.18 L
317.493 393.328 L
319.14 399.366 L
320.787 403.648 L
322.433 407.503 L
324.08 410.035 L
325.727 411.842 L
327.373 414.295 L
329.02 415.707 L
330.667 415.899 L
332.313 415.067 L
333.96 412.682 L
335.607 409.71 L
337.253 409.716 L
338.9 411.416 L
340.547 414.42 L
342.193 419.634 L
343.84 424.293 L
345.487 427.353 L
347.133 430.216 L
348.78 430.195 L
350.427 427.421 L
352.073 420.538 L
353.72 418.141 L
355.367 424.86 L
357.013 430.418 L
358.66 432.014 L
360.307 431.754 L
361.953 430.364 L
363.6 428.787 L
365.247 428.364 L
366.893 428.825 L
368.54 428.718 L
370.187 429.057 L
371.833 431.667 L
373.48 435.246 L
375.127 439.694 L
376.773 442.522 L
378.42 443.631 L
380.067 443.968 L
381.713 444.854 L
383.36 446.581 L
385.007 446.289 L
386.653 446.033 L
388.3 444.932 L
389.947 443.504 L
391.593 441.326 L
393.24 440.574 L
394.887 442.226 L
396.533 445.667 L
398.18 450.485 L
399.827 453.794 L
401.473 454.051 L
403.12 453.863 L
404.767 453.765 L
406.413 450.743 L
408.06 446.565 L
409.707 445.133 L
411.353 447.103 L
413 449.319 L
414.647 449.285 L
416.293 448.848 L
417.94 448.227 L
419.587 447.447 L
421.233 446.73 L
422.88 446.624 L
424.527 446.464 L
426.173 446.833 L
427.82 448.21 L
429.467 448.592 L
431.113 449.548 L
432.76 448.1 L
434.407 447.204 L
436.053 448.525 L
437.7 451.108 L
439.347 453.758 L
440.993 454.98 L
442.64 455.459 L
444.287 455.823 L
445.933 456.059 L
447.58 455.261 L
449.227 454.682 L
450.873 457.334 L
452.52 462.549 L
454.167 465.438 L
455.813 465.827 L
457.46 467.097 L
459.107 467.804 L
460.753 466.165 L
462.4 463.027 L
464.047 460.491 L
465.693 458.949 L
467.34 459.229 L
468.987 461.536 L
470.633 463.491 L
472.28 465.417 L
473.927 467.592 L
475.573 469.655 L
477.22 469.817 L
478.867 470.729 L
480.513 470.971 L
482.16 470.108 L
483.807 467.322 L
485.453 462.879 L
487.1 460.814 L
488.747 459.88 L
490.393 460.015 L
492.04 460.123 L
493.687 460.1 L
495.333 460.724 L
496.98 462.029 L
498.627 463.176 L
500.273 463.994 L
501.92 464.584 L
503.567 464.741 L
505.213 463.393 L
506.86 466.226 L
508.507 470.55 L
510.153 472.217 L
511.8 472.545 L
513.447 471.972 L
515.093 472.166 L
516.74 470.671 L
518.387 468.48 L
520.033 467.1 L
521.68 466.217 L
523.327 466.234 L
524.973 468.942 L
526.62 472.554 L
528.267 475.693 L
529.913 478.13 L
531.56 479.524 L
533.207 479.356 L
534.853 479.524 L
536.5 479.793 L
538.147 477.95 L
539.793 475.037 L
541.44 471.992 L
543.087 470.315 L
544.733 469.675 L
546.38 468.808 L
548.027 468.632 L
549.673 468.691 L
551.32 469.331 L
552.967 469.804 L
554.613 470.077 L
556.26 470.313 L
557.907 470.701 L
559.553 469.6 L
561.2 467.202 L
562.847 469.879 L
564.493 471.221 L
566.14 470.69 L
567.787 471.081 L
569.433 471.777 L
571.08 472.094 L
572.727 471.632 L
574.373 471.174 L
576.02 471.668 L
577.667 473.425 L
579.313 474.699 L
580.96 476.441 L
582.607 479.677 L
584.253 483.213 L
585.9 485.106 L
587.547 485.353 L
589.193 485.737 L
590.84 486.139 L
592.487 485.1 L
594.133 483.145 L
595.78 480.584 L
597.427 477.413 L
599.073 475.271 L
600.72 475.621 L
602.367 477.556 L
604.013 480.028 L
605.66 482.655 L
607.307 485.481 L
608.953 486.533 L
610.6 487.543 L
612.247 487.288 L
613.893 485.427 L
615.54 481.198 L
617.187 478.017 L
618.833 478.496 L
620.48 477.776 L
622.127 477.266 L
623.773 477.21 L
625.42 476.584 L
627.067 475.428 L
628.713 475.254 L
630.36 475.945 L
632.007 476.598 L
633.653 477.516 L
635.3 479.482 L
636.947 480.546 L
638.593 482.932 L
640.24 485.016 L
641.887 485.745 L
643.533 486.047 L
645.18 485.82 L
646.827 486.277 L
648.473 485.465 L
650.12 484.343 L
651.767 483.129 L
653.413 482.207 L
655.06 481.286 L
656.707 482.203 L
658.353 484.421 L
660 487.077 L
661.647 490.414 L
663.293 492.832 L
664.94 492.439 L
666.587 492.112 L
668.233 492.729 L
669.88 490.206 L
671.527 486.195 L
673.173 483.513 L
674.82 482.727 L
676.467 483.012 L
678.113 482.831 L
679.76 482.751 L
681.407 482.379 L
683.053 482.233 L
684.7 481.66 L
686.347 481.09 L
687.993 480.722 L
689.64 480.964 L
691.287 482.113 L
692.933 481.716 L
694.58 482.655 L
696.227 481.809 L
697.873 481.004 L
699.52 481.721 L
701.167 482.916 L
702.813 483.812 L
704.46 483.868 L
706.107 483.678 L
707.753 484.143 L
709.4 485.638 L
711.047 486.505 L
712.693 486.967 L
714.34 489.35 L
715.987 493.668 L
717.633 495.929 L
719.28 496.02 L
720.927 496.692 L
722.573 497.345 L
724.22 496.034 L
725.867 493.528 L
727.513 490.908 L
729.16 488.658 L
730.807 487.506 L
732.453 488.437 L
734.1 489.634 L
735.747 491.156 L
737.393 493.949 L
739.04 496.586 L
740.687 497.569 L
742.333 498.741 L
743.98 498.703 L
745.627 497.427 L
747.273 494.189 L
748.92 490.051 L
750.567 487.914 L
752.213 486.135 L
753.86 486.031 L
755.507 486.597 L
757.153 486.711 L
758.8 486.459 L
760.447 487.048 L
762.093 487.537 L
763.74 487.828 L
765.387 488.246 L
767.033 488.991 L
768.68 489.477 L
770.327 491.915 L
771.973 494.196 L
773.62 495.1 L
775.267 495.328 L
776.913 495.166 L
778.56 495.392 L
780.207 494.129 L
781.853 492.721 L
783.5 491.893 L
785.147 491.485 L
786.793 491.137 L
788.44 492.751 L
790.087 495.846 L
791.733 498.693 L
793.38 501.112 L
795.027 502.534 L
796.673 501.646 L
798.32 501.314 L
799.967 502.272 L
801.613 500.807 L
803.26 497.353 L
804.907 494.586 L
806.553 493.054 L
808.2 492.271 L
809.847 491.002 L
811.493 490.642 L
813.14 490.965 L
814.787 491.47 L
816.433 491.385 L
818.08 490.963 L
819.727 490.697 L
821.373 491.44 L
823.02 491.484 L
824.667 489.587 L
826.313 491.055 L
827.96 490.727 L
829.607 489.99 L
831.253 490.984 L
832.9 492.222 L
834.547 492.891 L
836.193 492.416 L
837.84 492.254 L
839.487 492.49 L
841.133 493.64 L
842.78 494.899 L
844.427 496.41 L
846.073 499.52 L
847.72 503.344 L
849.367 504.83 L
851.013 504.809 L
852.66 505.514 L
854.307 505.966 L
855.953 504.692 L
857.6 502.062 L
859.247 499.67 L
860.893 497.374 L
862.54 495.992 L
864.187 496.748 L
865.833 497.656 L
867.48 499.253 L
869.127 502.191 L
870.773 505.023 L
872.42 506.094 L
874.067 506.857 L
875.713 506.591 L
877.36 505.49 L
879.007 502.242 L
880.653 498.337 L
882.3 497.137 L
883.947 495.89 L
885.593 495.26 L
887.24 494.854 L
888.887 493.926 L
890.533 493.463 L
892.18 493.54 L
893.827 493.995 L
895.473 494.68 L
897.12 495.501 L
898.767 496.967 L
900.413 497.692 L
902.06 499.986 L
903.707 501.565 L
905.353 501.696 L
907 501.455 L
908.647 501.522 L
910.293 502.556 L
911.94 501.965 L
913.587 501.003 L
915.233 499.835 L
916.88 498.832 L
918.527 497.94 L
920.173 499.362 L
921.82 502.506 L
923.467 505.271 L
925.113 508.057 L
926.76 509.807 L
928.407 508.845 L
930.053 508.674 L
931.7 509.06 L
933.347 506.791 L
934.993 503.394 L
936.64 500.726 L
938.287 499.825 L
939.933 499.708 L
941.58 498.771 L
943.227 498.276 L
944.873 497.881 L
946.52 498.017 L
948.167 498.013 L
949.813 497.63 L
951.46 497.603 L
953.107 498.595 L
954.753 499.271 L
956.4 498.115 L
958.047 498.934 L
959.693 497.72 L
961.34 496.893 L
962.987 497.486 L
964.633 498.597 L
966.28 499.608 L
967.927 499.46 L
969.573 499.3 L
971.22 499.793 L
972.867 500.944 L
974.513 501.471 L
976.16 502.323 L
977.807 505.032 L
979.453 509.338 L
981.1 511.573 L
982.747 511.69 L
984.393 512.654 L
986.04 513.03 L
987.687 511.665 L
989.333 509.064 L
990.98 506.379 L
992.627 504.065 L
994.273 502.595 L
995.92 503.27 L
997.567 504.855 L
999.213 506.676 L
1000.86 509.084 L
1002.507 512.007 L
1004.153 512.971 L
1005.8 513.509 L
1007.447 513.537 L
1009.093 512.203 L
1010.74 508.596 L
1012.387 504.693 L
1014.033 502.843 L
1015.68 500.847 L
1017.327 500.537 L
1018.973 500.865 L
1020.62 500.334 L
1022.267 499.877 L
1023.913 500.131 L
1025.56 501.043 L
1027.207 502.157 L
1028.853 502.914 L
1030.5 504.076 L
1032.147 504.211 L
1033.793 506.104 L
1035.44 508.081 L
1037.087 508.751 L
1038.733 508.64 L
1040.38 508.439 L
1042.027 509.226 L
1043.673 508.387 L
1045.32 506.788 L
1046.967 505.839 L
1048.613 505.134 L
1050.26 504.374 L
1051.907 505.828 L
1053.553 508.557 L
1055.2 511.352 L
1056.847 514.244 L
1058.493 516.048 L
1060.14 515.008 L
1061.787 514.713 L
1063.433 515.36 L
1065.08 513.254 L
1066.727 509.748 L
1068.373 506.754 L
1070.02 505.35 L
1071.667 504.93 L
1073.313 503.88 L
1074.96 503.595 L
1076.607 503.963 L
1078.253 504.278 L
1079.9 504.211 L
1081.547 504.129 L
1083.193 504.112 L
1084.84 504.77 L
1086.487 504.622 L
1088.133 503.13 L
1089.78 505.015 L
1091.427 504.26 L
1093.073 503.334 L
1094.72 504.165 L
1096.367 504.541 L
1098.013 504.793 L
1099.66 504.696 L
1101.307 504.466 L
1102.953 505.206 L
1104.6 506.934 L
1106.247 507.806 L
1107.893 509.036 L
1109.54 511.747 L
1111.187 515.398 L
1112.833 517.497 L
1114.48 517.823 L
1116.127 518.551 L
1117.773 518.611 L
1119.42 517.318 L
1121.067 515.114 L
1122.713 512.493 L
1124.36 509.859 L
1126.007 508.384 L
1127.653 508.951 L
1129.3 510.181 L
1130.947 511.897 L
1132.593 514.376 L
1134.24 516.882 L
1135.887 517.873 L
1137.533 519 L
1139.18 518.919 L
1140.827 517.184 L
1142.473 513.372 L
1144.12 509.292 L
1145.767 507.802 L
1147.413 506.636 L
1149.06 507.112 L
1150.707 507.695 L
1152.353 507.094 L
1154 505.744 L
S
GR
GS
[0.5 0 0 0.5 0 0] CT
1 GC
N
1138 137 M
1138 61 L
838 61 L
838 137 L
cp
f
GR
GS
[0.5 0 0 0.5 454 41.5] CT
N
/f-990293328{2.797 -0.266 M
2.797 -0.391 2.828 -0.469 QT
4.719 -6.641 L
3.094 -6.641 L
2.438 -6.641 1.867 -6.227 QT
1.297 -5.813 0.922 -5.188 QT
0.875 -5.109 0.813 -5.109 QT
0.594 -5.109 L
0.438 -5.109 0.438 -5.297 QT
0.438 -5.328 0.469 -5.391 QT
1.063 -6.406 1.734 -7.086 QT
2.406 -7.766 3.25 -7.766 QT
8.766 -7.766 L
8.953 -7.766 9.086 -7.633 QT
9.219 -7.5 9.219 -7.297 QT
9.219 -7.047 9.031 -6.844 QT
8.844 -6.641 8.563 -6.641 QT
5.313 -6.641 L
4.109 -0.438 L
4.031 -0.141 3.836 0.047 QT
3.641 0.234 3.344 0.234 QT
3.125 0.234 2.961 0.094 QT
2.797 -0.047 2.797 -0.266 QT
cp}def
f-990293328
f
GR
GS
[0.5 0 0 0.5 458 41.5] CT
/Helvetica 18 F
GS
[1 0 0 1 0 0] CT
0 0 moveto 
1 -1 scale
( = 0.125, ) t 
GR
GR
GS
[0.5 0 0 0.5 496 41.5] CT
N
/f-1732591168{0.969 0 M
0.828 0 0.828 -0.141 QT
0.828 -0.156 0.836 -0.164 QT
0.844 -0.172 0.844 -0.203 QT
7.047 -12.688 L
7.125 -12.891 7.359 -12.891 QT
7.609 -12.891 L
7.859 -12.891 7.938 -12.688 QT
14.141 -0.203 L
14.141 -0.188 14.148 -0.172 QT
14.156 -0.156 14.156 -0.141 QT
14.156 0 14 0 QT
0.969 0 L
cp
2.156 -1.438 M
11.641 -1.438 L
6.906 -11 L
2.156 -1.438 L
cp}def
f-1732591168
f
GR
GS
[0.5 0 0 0.5 503.5 41.5] CT
/Helvetica 18 F
GS
[1 0 0 1 0 0] CT
0 0 moveto 
1 -1 scale
(x = 0.025) t 
GR
GR
GS
[0.5 0 0 0.5 0 0] CT
0.502 GC
[8 2 4 2] 0 setdash
2 LJ
2 LW
N
843.99 75.405 M
903.89 75.405 L
S
GR
GS
[0.5 0 0 0.5 454 53.5] CT
N
f-990293328
f
GR
GS
[0.5 0 0 0.5 458 53.5] CT
/Helvetica 18 F
GS
[1 0 0 1 0 0] CT
0 0 moveto 
1 -1 scale
( = 0.06125, ) t 
GR
GR
GS
[0.5 0 0 0.5 506 53.5] CT
N
f-1732591168
f
GR
GS
[0.5 0 0 0.5 513.5 53.5] CT
/Helvetica 18 F
GS
[1 0 0 1 0 0] CT
0 0 moveto 
1 -1 scale
(x = 0.0025) t 
GR
GR
GS
[0.5 0 0 0.5 0 0] CT
[8 2 4 2] 0 setdash
2 LJ
2 LW
N
843.99 99 M
903.89 99 L
S
GR
GS
[0.5 0 0 0.5 454 65.5] CT
N
f-990293328
f
GR
GS
[0.5 0 0 0.5 458 65.5] CT
/Helvetica 18 F
GS
[1 0 0 1 0 0] CT
0 0 moveto 
1 -1 scale
( = 0.030625, ) t 
GR
GR
GS
[0.5 0 0 0.5 511 65.5] CT
N
f-1732591168
f
GR
GS
[0.5 0 0 0.5 518.5 65.5] CT
/Helvetica 18 F
GS
[1 0 0 1 0 0] CT
0 0 moveto 
1 -1 scale
(x = 0.00025) t 
GR
GR
GS
[0.5 0 0 0.5 0 0] CT
1 LJ
3 LW
N
843.99 122.595 M
903.89 122.595 L
S
GR
GS
[0.5 0 0 0.5 0 0] CT
0.149 GC
10.0 ML
N
838 137 M
838 61 L
1138 61 L
1138 137 L
cp
S
GR
%%Trailer
%%Pages: 1
%%EOF
