%!PS-Adobe-3.0 EPSF-3.0
%%Creator: (MATLAB, The Mathworks, Inc. Version 9.6.0.1072779 \(R2019a\). Operating System: Windows 10)
%%Title: C:/Users/ngovinda/Documents/koopman-periodic-approximation/scripts/noconvergence.eps
%%CreationDate: 2020-04-22T17:46:02
%%Pages: (atend)
%%BoundingBox: 0 0 638 300
%%LanguageLevel: 3
%%EndComments
%%BeginProlog
%%BeginResource: procset (Apache XML Graphics Std ProcSet) 1.2 0
%%Version: 1.2 0
%%Copyright: (Copyright 2001-2003,2010 The Apache Software Foundation. License terms: http://www.apache.org/licenses/LICENSE-2.0)
/bd{bind def}bind def
/ld{load def}bd
/GR/grestore ld
/GS/gsave ld
/RM/rmoveto ld
/C/curveto ld
/t/show ld
/L/lineto ld
/ML/setmiterlimit ld
/CT/concat ld
/f/fill ld
/N/newpath ld
/S/stroke ld
/CC/setcmykcolor ld
/A/ashow ld
/cp/closepath ld
/RC/setrgbcolor ld
/LJ/setlinejoin ld
/GC/setgray ld
/LW/setlinewidth ld
/M/moveto ld
/re {4 2 roll M
1 index 0 rlineto
0 exch rlineto
neg 0 rlineto
cp } bd
/_ctm matrix def
/_tm matrix def
/BT { _ctm currentmatrix pop matrix _tm copy pop 0 0 moveto } bd
/ET { _ctm setmatrix } bd
/iTm { _ctm setmatrix _tm concat } bd
/Tm { _tm astore pop iTm 0 0 moveto } bd
/ux 0.0 def
/uy 0.0 def
/F {
  /Tp exch def
  /Tf exch def
  Tf findfont Tp scalefont setfont
  /cf Tf def  /cs Tp def
} bd
/ULS {currentpoint /uy exch def /ux exch def} bd
/ULE {
  /Tcx currentpoint pop def
  gsave
  newpath
  cf findfont cs scalefont dup
  /FontMatrix get 0 get /Ts exch def /FontInfo get dup
  /UnderlinePosition get Ts mul /To exch def
  /UnderlineThickness get Ts mul /Tt exch def
  ux uy To add moveto  Tcx uy To add lineto
  Tt setlinewidth stroke
  grestore
} bd
/OLE {
  /Tcx currentpoint pop def
  gsave
  newpath
  cf findfont cs scalefont dup
  /FontMatrix get 0 get /Ts exch def /FontInfo get dup
  /UnderlinePosition get Ts mul /To exch def
  /UnderlineThickness get Ts mul /Tt exch def
  ux uy To add cs add moveto Tcx uy To add cs add lineto
  Tt setlinewidth stroke
  grestore
} bd
/SOE {
  /Tcx currentpoint pop def
  gsave
  newpath
  cf findfont cs scalefont dup
  /FontMatrix get 0 get /Ts exch def /FontInfo get dup
  /UnderlinePosition get Ts mul /To exch def
  /UnderlineThickness get Ts mul /Tt exch def
  ux uy To add cs 10 mul 26 idiv add moveto Tcx uy To add cs 10 mul 26 idiv add lineto
  Tt setlinewidth stroke
  grestore
} bd
/QT {
/Y22 exch store
/X22 exch store
/Y21 exch store
/X21 exch store
currentpoint
/Y21 load 2 mul add 3 div exch
/X21 load 2 mul add 3 div exch
/X21 load 2 mul /X22 load add 3 div
/Y21 load 2 mul /Y22 load add 3 div
/X22 load /Y22 load curveto
} bd
/SSPD {
dup length /d exch dict def
{
/v exch def
/k exch def
currentpagedevice k known {
/cpdv currentpagedevice k get def
v cpdv ne {
/upd false def
/nullv v type /nulltype eq def
/nullcpdv cpdv type /nulltype eq def
nullv nullcpdv or
{
/upd true def
} {
/sametype v type cpdv type eq def
sametype {
v type /arraytype eq {
/vlen v length def
/cpdvlen cpdv length def
vlen cpdvlen eq {
0 1 vlen 1 sub {
/i exch def
/obj v i get def
/cpdobj cpdv i get def
obj cpdobj ne {
/upd true def
exit
} if
} for
} {
/upd true def
} ifelse
} {
v type /dicttype eq {
v {
/dv exch def
/dk exch def
/cpddv cpdv dk get def
dv cpddv ne {
/upd true def
exit
} if
} forall
} {
/upd true def
} ifelse
} ifelse
} if
} ifelse
upd true eq {
d k v put
} if
} if
} if
} forall
d length 0 gt {
d setpagedevice
} if
} bd
/RE { % /NewFontName [NewEncodingArray] /FontName RE -
  findfont dup length dict begin
  {
    1 index /FID ne
    {def} {pop pop} ifelse
  } forall
  /Encoding exch def
  /FontName 1 index def
  currentdict definefont pop
  end
} bind def
%%EndResource
%%BeginResource: procset (Apache XML Graphics EPS ProcSet) 1.0 0
%%Version: 1.0 0
%%Copyright: (Copyright 2002-2003 The Apache Software Foundation. License terms: http://www.apache.org/licenses/LICENSE-2.0)
/BeginEPSF { %def
/b4_Inc_state save def         % Save state for cleanup
/dict_count countdictstack def % Count objects on dict stack
/op_count count 1 sub def      % Count objects on operand stack
userdict begin                 % Push userdict on dict stack
/showpage { } def              % Redefine showpage, { } = null proc
0 setgray 0 setlinecap         % Prepare graphics state
1 setlinewidth 0 setlinejoin
10 setmiterlimit [ ] 0 setdash newpath
/languagelevel where           % If level not equal to 1 then
{pop languagelevel             % set strokeadjust and
1 ne                           % overprint to their defaults.
{false setstrokeadjust false setoverprint
} if
} if
} bd
/EndEPSF { %def
count op_count sub {pop} repeat            % Clean up stacks
countdictstack dict_count sub {end} repeat
b4_Inc_state restore
} bd
%%EndResource
%FOPBeginFontDict
%%IncludeResource: font Courier-Oblique
%%IncludeResource: font Courier-BoldOblique
%%IncludeResource: font Courier-Bold
%%IncludeResource: font ZapfDingbats
%%IncludeResource: font Symbol
%%IncludeResource: font Helvetica
%%IncludeResource: font Helvetica-Oblique
%%IncludeResource: font Helvetica-Bold
%%IncludeResource: font Helvetica-BoldOblique
%%IncludeResource: font Times-Roman
%%IncludeResource: font Times-Italic
%%IncludeResource: font Times-Bold
%%IncludeResource: font Times-BoldItalic
%%IncludeResource: font Courier
%FOPEndFontDict
%%BeginResource: encoding WinAnsiEncoding
/WinAnsiEncoding [
/.notdef /.notdef /.notdef /.notdef /.notdef
/.notdef /.notdef /.notdef /.notdef /.notdef
/.notdef /.notdef /.notdef /.notdef /.notdef
/.notdef /.notdef /.notdef /.notdef /.notdef
/.notdef /.notdef /.notdef /.notdef /.notdef
/.notdef /.notdef /.notdef /.notdef /.notdef
/.notdef /.notdef /space /exclam /quotedbl
/numbersign /dollar /percent /ampersand /quotesingle
/parenleft /parenright /asterisk /plus /comma
/hyphen /period /slash /zero /one
/two /three /four /five /six
/seven /eight /nine /colon /semicolon
/less /equal /greater /question /at
/A /B /C /D /E
/F /G /H /I /J
/K /L /M /N /O
/P /Q /R /S /T
/U /V /W /X /Y
/Z /bracketleft /backslash /bracketright /asciicircum
/underscore /quoteleft /a /b /c
/d /e /f /g /h
/i /j /k /l /m
/n /o /p /q /r
/s /t /u /v /w
/x /y /z /braceleft /bar
/braceright /asciitilde /bullet /Euro /bullet
/quotesinglbase /florin /quotedblbase /ellipsis /dagger
/daggerdbl /circumflex /perthousand /Scaron /guilsinglleft
/OE /bullet /Zcaron /bullet /bullet
/quoteleft /quoteright /quotedblleft /quotedblright /bullet
/endash /emdash /asciitilde /trademark /scaron
/guilsinglright /oe /bullet /zcaron /Ydieresis
/space /exclamdown /cent /sterling /currency
/yen /brokenbar /section /dieresis /copyright
/ordfeminine /guillemotleft /logicalnot /sfthyphen /registered
/macron /degree /plusminus /twosuperior /threesuperior
/acute /mu /paragraph /middot /cedilla
/onesuperior /ordmasculine /guillemotright /onequarter /onehalf
/threequarters /questiondown /Agrave /Aacute /Acircumflex
/Atilde /Adieresis /Aring /AE /Ccedilla
/Egrave /Eacute /Ecircumflex /Edieresis /Igrave
/Iacute /Icircumflex /Idieresis /Eth /Ntilde
/Ograve /Oacute /Ocircumflex /Otilde /Odieresis
/multiply /Oslash /Ugrave /Uacute /Ucircumflex
/Udieresis /Yacute /Thorn /germandbls /agrave
/aacute /acircumflex /atilde /adieresis /aring
/ae /ccedilla /egrave /eacute /ecircumflex
/edieresis /igrave /iacute /icircumflex /idieresis
/eth /ntilde /ograve /oacute /ocircumflex
/otilde /odieresis /divide /oslash /ugrave
/uacute /ucircumflex /udieresis /yacute /thorn
/ydieresis
] def
%%EndResource
%FOPBeginFontReencode
/Courier-Oblique findfont
dup length dict begin
  {1 index /FID ne {def} {pop pop} ifelse} forall
  /Encoding WinAnsiEncoding def
  currentdict
end
/Courier-Oblique exch definefont pop
/Courier-BoldOblique findfont
dup length dict begin
  {1 index /FID ne {def} {pop pop} ifelse} forall
  /Encoding WinAnsiEncoding def
  currentdict
end
/Courier-BoldOblique exch definefont pop
/Courier-Bold findfont
dup length dict begin
  {1 index /FID ne {def} {pop pop} ifelse} forall
  /Encoding WinAnsiEncoding def
  currentdict
end
/Courier-Bold exch definefont pop
/Helvetica findfont
dup length dict begin
  {1 index /FID ne {def} {pop pop} ifelse} forall
  /Encoding WinAnsiEncoding def
  currentdict
end
/Helvetica exch definefont pop
/Helvetica-Oblique findfont
dup length dict begin
  {1 index /FID ne {def} {pop pop} ifelse} forall
  /Encoding WinAnsiEncoding def
  currentdict
end
/Helvetica-Oblique exch definefont pop
/Helvetica-Bold findfont
dup length dict begin
  {1 index /FID ne {def} {pop pop} ifelse} forall
  /Encoding WinAnsiEncoding def
  currentdict
end
/Helvetica-Bold exch definefont pop
/Helvetica-BoldOblique findfont
dup length dict begin
  {1 index /FID ne {def} {pop pop} ifelse} forall
  /Encoding WinAnsiEncoding def
  currentdict
end
/Helvetica-BoldOblique exch definefont pop
/Times-Roman findfont
dup length dict begin
  {1 index /FID ne {def} {pop pop} ifelse} forall
  /Encoding WinAnsiEncoding def
  currentdict
end
/Times-Roman exch definefont pop
/Times-Italic findfont
dup length dict begin
  {1 index /FID ne {def} {pop pop} ifelse} forall
  /Encoding WinAnsiEncoding def
  currentdict
end
/Times-Italic exch definefont pop
/Times-Bold findfont
dup length dict begin
  {1 index /FID ne {def} {pop pop} ifelse} forall
  /Encoding WinAnsiEncoding def
  currentdict
end
/Times-Bold exch definefont pop
/Times-BoldItalic findfont
dup length dict begin
  {1 index /FID ne {def} {pop pop} ifelse} forall
  /Encoding WinAnsiEncoding def
  currentdict
end
/Times-BoldItalic exch definefont pop
/Courier findfont
dup length dict begin
  {1 index /FID ne {def} {pop pop} ifelse} forall
  /Encoding WinAnsiEncoding def
  currentdict
end
/Courier exch definefont pop
%FOPEndFontReencode
%%EndProlog
%%Page: 1 1
%%PageBoundingBox: 0 0 638 300
%%BeginPageSetup
[1 0 0 -1 0 300] CT
%%EndPageSetup
GS
[0.5 0 0 0.5 0 0] CT
1 GC
N
0 0 1275 600 re
f
GR
GS
[0.5 0 0 0.5 0 0] CT
1 GC
N
0 0 1275 600 re
f
GR
GS
[0.5 0 0 0.5 0 0] CT
1 GC
N
166 519 M
1154 519 L
1154 45 L
166 45 L
cp
f
GR
GS
[0.5 0 0 0.5 0 0] CT
0.149 GC
2 setlinecap
1 LJ
N
166 519 M
1154 519 L
S
GR
GS
[0.5 0 0 0.5 0 0] CT
0.149 GC
2 setlinecap
1 LJ
N
166 45 M
1154 45 L
S
GR
GS
[0.5 0 0 0.5 0 0] CT
0.149 GC
2 setlinecap
1 LJ
N
166 519 M
166 509.12 L
S
GR
GS
[0.5 0 0 0.5 0 0] CT
0.149 GC
2 setlinecap
1 LJ
N
495.333 519 M
495.333 509.12 L
S
GR
GS
[0.5 0 0 0.5 0 0] CT
0.149 GC
2 setlinecap
1 LJ
N
824.667 519 M
824.667 509.12 L
S
GR
GS
[0.5 0 0 0.5 0 0] CT
0.149 GC
2 setlinecap
1 LJ
N
1154 519 M
1154 509.12 L
S
GR
GS
[0.5 0 0 0.5 0 0] CT
0.149 GC
2 setlinecap
1 LJ
N
166 45 M
166 54.88 L
S
GR
GS
[0.5 0 0 0.5 0 0] CT
0.149 GC
2 setlinecap
1 LJ
N
495.333 45 M
495.333 54.88 L
S
GR
GS
[0.5 0 0 0.5 0 0] CT
0.149 GC
2 setlinecap
1 LJ
N
824.667 45 M
824.667 54.88 L
S
GR
GS
[0.5 0 0 0.5 0 0] CT
0.149 GC
2 setlinecap
1 LJ
N
1154 45 M
1154 54.88 L
S
GR
GS
[0.5 0 0 0.5 83 263.5] CT
0.149 GC
/Helvetica 20 F
GS
[1 0 0 1 0 0] CT
-6 21 moveto 
1 -1 scale
(0) t 
GR
GR
GS
[0.5 0 0 0.5 247.66667 263.5] CT
0.149 GC
/Helvetica 20 F
GS
[1 0 0 1 0 0] CT
-6 21 moveto 
1 -1 scale
(5) t 
GR
GR
GS
[0.5 0 0 0.5 412.33334 263.5] CT
0.149 GC
/Helvetica 20 F
GS
[1 0 0 1 0 0] CT
-11.5 21 moveto 
1 -1 scale
(10) t 
GR
GR
GS
[0.5 0 0 0.5 577 263.5] CT
0.149 GC
/Helvetica 20 F
GS
[1 0 0 1 0 0] CT
-11.5 21 moveto 
1 -1 scale
(15) t 
GR
GR
GS
[0.5 0 0 0.5 324 296] CT
0.149 GC
N
4.359 0.406 M
2.328 0.406 1.422 -1.086 QT
0.516 -2.578 0.516 -4.75 QT
0.516 -6.172 0.766 -7.531 QT
1.016 -8.891 1.539 -10.289 QT
2.063 -11.688 2.727 -12.914 QT
3.391 -14.141 4.219 -15.297 QT
4.375 -15.516 4.641 -15.516 QT
4.875 -15.516 5.016 -15.375 QT
5.156 -15.234 5.156 -15.047 QT
5.156 -14.859 5.047 -14.703 QT
1.766 -10.172 1.766 -6.359 QT
1.766 -4.719 2.523 -3.531 QT
3.281 -2.344 4.859 -2.344 QT
6.203 -2.344 7.359 -3.133 QT
8.516 -3.922 9.359 -5.156 QT
9.359 -5.781 9.578 -7.117 QT
9.797 -8.453 10.258 -9.5 QT
10.719 -10.547 11.375 -10.547 QT
12.203 -10.547 12.203 -9.578 QT
12.203 -9.016 11.961 -8.164 QT
11.719 -7.313 11.43 -6.578 QT
11.141 -5.844 10.719 -4.906 QT
11.141 -2.344 13.297 -2.344 QT
14.531 -2.344 15.789 -3.063 QT
17.047 -3.781 18.016 -4.953 QT
18.984 -6.125 19.539 -7.477 QT
20.094 -8.828 20.094 -10.031 QT
20.094 -11.125 19.75 -11.734 QT
19.406 -12.344 18.844 -13.008 QT
18.281 -13.672 18.281 -14.078 QT
18.281 -14.781 18.883 -15.359 QT
19.484 -15.938 20.156 -15.938 QT
21.047 -15.938 21.414 -15.141 QT
21.781 -14.344 21.781 -13.328 QT
21.781 -11.672 21.125 -9.156 QT
20.469 -6.641 19.625 -4.969 QT
18.453 -2.703 16.703 -1.148 QT
14.953 0.406 12.781 0.406 QT
11.391 0.406 10.539 -0.43 QT
9.688 -1.266 9.438 -2.703 QT
8.438 -1.281 7.156 -0.438 QT
5.875 0.406 4.359 0.406 QT
cp
f
GR
GS
[0.5 0 0 0.5 0 0] CT
0.149 GC
2 setlinecap
1 LJ
N
166 519 M
166 45 L
S
GR
GS
[0.5 0 0 0.5 0 0] CT
0.149 GC
2 setlinecap
1 LJ
N
1154 519 M
1154 45 L
S
GR
GS
[0.5 0 0 0.5 0 0] CT
0.149 GC
2 setlinecap
1 LJ
N
166 434.783 M
175.88 434.783 L
S
GR
GS
[0.5 0 0 0.5 0 0] CT
0.149 GC
2 setlinecap
1 LJ
N
166 225.69 M
175.88 225.69 L
S
GR
GS
[0.5 0 0 0.5 0 0] CT
0.149 GC
2 setlinecap
1 LJ
N
1154 434.783 M
1144.12 434.783 L
S
GR
GS
[0.5 0 0 0.5 0 0] CT
0.149 GC
2 setlinecap
1 LJ
N
1154 225.69 M
1144.12 225.69 L
S
GR
GS
[0.5 0 0 0.5 0 0] CT
0.149 GC
2 setlinecap
1 LJ
N
166 518.421 M
170.94 518.421 L
S
GR
GS
[0.5 0 0 0.5 0 0] CT
0.149 GC
2 setlinecap
1 LJ
N
166 476.602 M
170.94 476.602 L
S
GR
GS
[0.5 0 0 0.5 0 0] CT
0.149 GC
2 setlinecap
1 LJ
N
166 434.783 M
170.94 434.783 L
S
GR
GS
[0.5 0 0 0.5 0 0] CT
0.149 GC
2 setlinecap
1 LJ
N
166 392.964 M
170.94 392.964 L
S
GR
GS
[0.5 0 0 0.5 0 0] CT
0.149 GC
2 setlinecap
1 LJ
N
166 351.146 M
170.94 351.146 L
S
GR
GS
[0.5 0 0 0.5 0 0] CT
0.149 GC
2 setlinecap
1 LJ
N
166 309.327 M
170.94 309.327 L
S
GR
GS
[0.5 0 0 0.5 0 0] CT
0.149 GC
2 setlinecap
1 LJ
N
166 267.508 M
170.94 267.508 L
S
GR
GS
[0.5 0 0 0.5 0 0] CT
0.149 GC
2 setlinecap
1 LJ
N
166 225.69 M
170.94 225.69 L
S
GR
GS
[0.5 0 0 0.5 0 0] CT
0.149 GC
2 setlinecap
1 LJ
N
166 183.871 M
170.94 183.871 L
S
GR
GS
[0.5 0 0 0.5 0 0] CT
0.149 GC
2 setlinecap
1 LJ
N
166 142.052 M
170.94 142.052 L
S
GR
GS
[0.5 0 0 0.5 0 0] CT
0.149 GC
2 setlinecap
1 LJ
N
166 100.233 M
170.94 100.233 L
S
GR
GS
[0.5 0 0 0.5 0 0] CT
0.149 GC
2 setlinecap
1 LJ
N
166 58.415 M
170.94 58.415 L
S
GR
GS
[0.5 0 0 0.5 0 0] CT
0.149 GC
2 setlinecap
1 LJ
N
1154 518.421 M
1149.06 518.421 L
S
GR
GS
[0.5 0 0 0.5 0 0] CT
0.149 GC
2 setlinecap
1 LJ
N
1154 476.602 M
1149.06 476.602 L
S
GR
GS
[0.5 0 0 0.5 0 0] CT
0.149 GC
2 setlinecap
1 LJ
N
1154 434.783 M
1149.06 434.783 L
S
GR
GS
[0.5 0 0 0.5 0 0] CT
0.149 GC
2 setlinecap
1 LJ
N
1154 392.964 M
1149.06 392.964 L
S
GR
GS
[0.5 0 0 0.5 0 0] CT
0.149 GC
2 setlinecap
1 LJ
N
1154 351.146 M
1149.06 351.146 L
S
GR
GS
[0.5 0 0 0.5 0 0] CT
0.149 GC
2 setlinecap
1 LJ
N
1154 309.327 M
1149.06 309.327 L
S
GR
GS
[0.5 0 0 0.5 0 0] CT
0.149 GC
2 setlinecap
1 LJ
N
1154 267.508 M
1149.06 267.508 L
S
GR
GS
[0.5 0 0 0.5 0 0] CT
0.149 GC
2 setlinecap
1 LJ
N
1154 225.69 M
1149.06 225.69 L
S
GR
GS
[0.5 0 0 0.5 0 0] CT
0.149 GC
2 setlinecap
1 LJ
N
1154 183.871 M
1149.06 183.871 L
S
GR
GS
[0.5 0 0 0.5 0 0] CT
0.149 GC
2 setlinecap
1 LJ
N
1154 142.052 M
1149.06 142.052 L
S
GR
GS
[0.5 0 0 0.5 0 0] CT
0.149 GC
2 setlinecap
1 LJ
N
1154 100.233 M
1149.06 100.233 L
S
GR
GS
[0.5 0 0 0.5 0 0] CT
0.149 GC
2 setlinecap
1 LJ
N
1154 58.415 M
1149.06 58.415 L
S
GR
GS
[0.5 0 0 0.5 63 223] CT
0.149 GC
/Helvetica 20 F
GS
[1 0 0 1 0 0] CT
0 0 moveto 
1 -1 scale
(10) t 
GR
GR
GS
[0.5 0 0 0.5 74.5 218] CT
0.149 GC
/Helvetica 16 F
GS
[1 0 0 1 0 0] CT
0 0 moveto 
1 -1 scale
(0) t 
GR
GR
GS
[0.5 0 0 0.5 63 118.5] CT
0.149 GC
/Helvetica 20 F
GS
[1 0 0 1 0 0] CT
0 0 moveto 
1 -1 scale
(10) t 
GR
GR
GS
[0.5 0 0 0.5 74.5 113.5] CT
0.149 GC
/Helvetica 16 F
GS
[1 0 0 1 0 0] CT
0 0 moveto 
1 -1 scale
(5) t 
GR
GR
GS
[0 -0.5 0.5 0 48 170] CT
0.149 GC
N
1 6.766 M
1 6.563 1.031 6.484 QT
4.609 -7.891 L
5.109 -9.828 6.352 -11.68 QT
7.594 -13.531 9.352 -14.719 QT
11.109 -15.906 13.063 -15.906 QT
14.625 -15.906 15.797 -15.094 QT
16.969 -14.281 17.555 -12.953 QT
18.141 -11.625 18.141 -10.031 QT
18.141 -8.297 17.43 -6.438 QT
16.719 -4.578 15.461 -3.031 QT
14.203 -1.484 12.57 -0.539 QT
10.938 0.406 9.141 0.406 QT
8.094 0.406 7.156 -0.219 QT
6.219 -0.844 5.703 -1.859 QT
3.563 6.625 L
3.469 7.141 3.047 7.453 QT
2.625 7.766 2.094 7.766 QT
1.656 7.766 1.328 7.492 QT
1 7.219 1 6.766 QT
cp
9.219 -0.547 M
11.125 -0.547 12.539 -2.508 QT
13.953 -4.469 14.703 -7.109 QT
15.453 -9.75 15.453 -11.578 QT
15.453 -12.953 14.852 -13.969 QT
14.25 -14.984 12.984 -14.984 QT
11.422 -14.984 10.227 -13.797 QT
9.031 -12.609 8.313 -11.008 QT
7.594 -9.406 7.141 -7.672 QT
6.156 -3.641 L
6.375 -2.344 7.18 -1.445 QT
7.984 -0.547 9.219 -0.547 QT
cp
f
GR
GS
[0 -0.5 0.5 0 57 160.5] CT
0.149 GC
N
5.828 0.328 M
4.453 0.328 3.391 -0.328 QT
2.328 -0.984 1.742 -2.086 QT
1.156 -3.188 1.156 -4.594 QT
1.156 -6.563 2.258 -8.484 QT
3.359 -10.406 5.18 -11.609 QT
7 -12.813 8.984 -12.813 QT
10.469 -12.813 11.586 -12.039 QT
12.703 -11.266 13.281 -9.984 QT
13.859 -8.703 13.859 -7.25 QT
13.891 -5.313 L
14.875 -6.688 15.563 -8.164 QT
16.25 -9.641 16.625 -11.234 QT
16.688 -11.406 16.844 -11.406 QT
17.188 -11.406 L
17.453 -11.406 17.453 -11.125 QT
17.453 -11.109 17.438 -11.047 QT
17.094 -9.719 16.586 -8.492 QT
16.078 -7.266 15.391 -6.117 QT
14.703 -4.969 13.891 -4.031 QT
13.891 -0.438 14.734 -0.438 QT
15.266 -0.438 15.609 -0.758 QT
15.953 -1.078 16.219 -1.547 QT
16.484 -2.016 16.547 -2.031 QT
16.906 -2.031 L
17.141 -2.031 17.141 -1.734 QT
17.141 -1.016 16.313 -0.344 QT
15.484 0.328 14.672 0.328 QT
13.625 0.328 12.93 -0.352 QT
12.234 -1.031 11.984 -2.125 QT
10.625 -0.969 9.039 -0.32 QT
7.453 0.328 5.828 0.328 QT
cp
5.891 -0.438 M
8.984 -0.438 11.844 -2.984 QT
11.828 -3.156 11.797 -3.406 QT
11.766 -3.656 11.766 -3.688 QT
11.766 -6.813 L
11.766 -12.063 8.938 -12.063 QT
7.234 -12.063 5.961 -10.609 QT
4.688 -9.156 4.047 -7.141 QT
3.406 -5.125 3.406 -3.453 QT
3.406 -2.188 4.047 -1.313 QT
4.688 -0.438 5.891 -0.438 QT
cp
f
GR
GS
[0 -0.5 0.5 0 48 151] CT
0.149 GC
/Helvetica 36 F
GS
[1 0 0 1 0 0] CT
0 0 moveto 
1 -1 scale
(\() t 
GR
GR
GS
[0 -0.5 0.5 0 48 145] CT
0.149 GC
N
/f1382725292{4.359 0.406 M
2.328 0.406 1.422 -1.086 QT
0.516 -2.578 0.516 -4.75 QT
0.516 -6.172 0.766 -7.531 QT
1.016 -8.891 1.539 -10.289 QT
2.063 -11.688 2.727 -12.914 QT
3.391 -14.141 4.219 -15.297 QT
4.375 -15.516 4.641 -15.516 QT
4.875 -15.516 5.016 -15.375 QT
5.156 -15.234 5.156 -15.047 QT
5.156 -14.859 5.047 -14.703 QT
1.766 -10.172 1.766 -6.359 QT
1.766 -4.719 2.523 -3.531 QT
3.281 -2.344 4.859 -2.344 QT
6.203 -2.344 7.359 -3.133 QT
8.516 -3.922 9.359 -5.156 QT
9.359 -5.781 9.578 -7.117 QT
9.797 -8.453 10.258 -9.5 QT
10.719 -10.547 11.375 -10.547 QT
12.203 -10.547 12.203 -9.578 QT
12.203 -9.016 11.961 -8.164 QT
11.719 -7.313 11.43 -6.578 QT
11.141 -5.844 10.719 -4.906 QT
11.141 -2.344 13.297 -2.344 QT
14.531 -2.344 15.789 -3.063 QT
17.047 -3.781 18.016 -4.953 QT
18.984 -6.125 19.539 -7.477 QT
20.094 -8.828 20.094 -10.031 QT
20.094 -11.125 19.75 -11.734 QT
19.406 -12.344 18.844 -13.008 QT
18.281 -13.672 18.281 -14.078 QT
18.281 -14.781 18.883 -15.359 QT
19.484 -15.938 20.156 -15.938 QT
21.047 -15.938 21.414 -15.141 QT
21.781 -14.344 21.781 -13.328 QT
21.781 -11.672 21.125 -9.156 QT
20.469 -6.641 19.625 -4.969 QT
18.453 -2.703 16.703 -1.148 QT
14.953 0.406 12.781 0.406 QT
11.391 0.406 10.539 -0.43 QT
9.688 -1.266 9.438 -2.703 QT
8.438 -1.281 7.156 -0.438 QT
5.875 0.406 4.359 0.406 QT
cp}def
f1382725292
f
GR
GS
[0 -0.5 0.5 0 48 133.5] CT
0.149 GC
/Helvetica 36 F
GS
[1 0 0 1 0 0] CT
0 0 moveto 
1 -1 scale
(;g\)) t 
GR
GR
GS
[0.5 0 0 0.5 0 0] CT
0.502 GC
[8 2 4 2] 0 setdash
2 LJ
2 LW
N
166 209.407 M
167.647 223.936 L
167.994 519.057 L
S
GR
GS
[0.5 0 0 0.5 0 0] CT
0.502 GC
[8 2 4 2] 0 setdash
2 LJ
2 LW
N
172.471 519.057 M
172.587 436.07 L
174.233 406.925 L
175.88 408.353 L
177.527 452.698 L
179.038 519.057 L
S
GR
GS
[0.5 0 0 0.5 0 0] CT
0.502 GC
[8 2 4 2] 0 setdash
2 LJ
2 LW
N
179.233 519.057 M
180.82 360.902 L
182.467 347.853 L
184.113 346.762 L
185.76 357.866 L
187.407 409.25 L
189.053 377.393 L
190.7 373.818 L
192.347 396.416 L
193.993 402.902 L
195.64 388.461 L
197.287 374.787 L
198.933 384.837 L
200.58 419.469 L
202.227 420.146 L
203.873 424.66 L
205.52 432.68 L
207.167 438.147 L
208.813 406.248 L
210.46 399.305 L
212.107 419.059 L
213.753 424.053 L
215.4 423.496 L
217.047 426.965 L
218.693 400.357 L
220.34 404.591 L
221.987 458.712 L
223.633 457.5 L
225.28 451.477 L
226.927 448.592 L
228.573 445.201 L
230.22 448.458 L
231.867 423.45 L
233.513 426.421 L
235.16 443.792 L
236.807 435.721 L
238.453 455.356 L
240.1 463.016 L
241.747 441.903 L
243.393 444.044 L
245.04 441.599 L
246.687 442.484 L
248.333 439.31 L
249.98 437.7 L
251.627 451.99 L
253.273 416.238 L
254.92 411.404 L
256.567 436.282 L
258.213 450.011 L
259.86 421.58 L
261.507 418.527 L
263.153 444.776 L
264.8 438.323 L
266.447 416.45 L
268.093 401.215 L
269.74 410.613 L
271.387 396.967 L
273.033 399.131 L
274.68 400.701 L
276.327 398.946 L
277.973 415.804 L
279.62 393.973 L
281.267 379.566 L
282.913 376.511 L
284.56 393.869 L
286.207 489.336 L
287.853 385.675 L
289.5 374.959 L
291.147 392.632 L
292.793 419.54 L
294.44 389.271 L
296.087 390.908 L
297.733 241.289 L
299.38 236.219 L
301.027 264.772 L
302.673 316.746 L
304.32 356.438 L
305.967 376.248 L
307.613 376.046 L
309.26 383.568 L
310.907 414.235 L
312.553 446.047 L
314.2 381.515 L
315.847 370.443 L
317.493 365.312 L
319.14 376.835 L
320.787 462.232 L
322.433 399.945 L
324.08 391.293 L
325.727 411.92 L
327.373 409.652 L
329.02 406.934 L
330.667 396.407 L
332.313 403.321 L
333.96 417.41 L
335.607 407.714 L
337.253 412.275 L
338.9 438.376 L
340.547 451.93 L
342.193 414.342 L
343.84 417.706 L
345.487 446.802 L
347.133 431.823 L
348.78 437.251 L
350.427 410.476 L
352.073 405.988 L
353.72 435.219 L
355.367 444.233 L
357.013 457.959 L
358.66 477.583 L
360.307 477.862 L
361.953 470.762 L
363.6 441.429 L
365.247 427.188 L
366.893 439.775 L
368.54 470.661 L
370.187 458.806 L
371.833 460.616 L
373.48 471.522 L
375.127 473.439 L
376.773 444.338 L
378.42 443.901 L
380.067 471.103 L
381.713 460.686 L
383.36 462.52 L
385.007 453.172 L
386.653 448.169 L
388.3 457.54 L
389.947 462.96 L
391.593 465.843 L
393.24 473.804 L
394.887 465.096 L
396.533 459.757 L
398.18 470.44 L
399.827 483.734 L
401.473 474.889 L
403.12 462.536 L
404.767 462.149 L
406.413 470.521 L
408.06 460.592 L
409.707 468.578 L
411.353 463.985 L
413 457.706 L
414.647 470.171 L
416.293 480.522 L
417.94 512.427 L
419.587 510.268 L
421.233 501.716 L
422.88 511.466 L
424.527 510.243 L
425.807 519.057 L
S
GR
GS
[0.5 0 0 0.5 0 0] CT
0.502 GC
[8 2 4 2] 0 setdash
2 LJ
2 LW
N
428.823 519.057 M
429.467 440.834 L
431.113 426.302 L
432.76 435.599 L
434.407 467.553 L
436.053 488.919 L
437.7 502.332 L
439.347 497.624 L
440.993 477.036 L
442.64 484.945 L
443.744 519.057 L
S
GR
GS
[0.5 0 0 0.5 0 0] CT
0.502 GC
[8 2 4 2] 0 setdash
2 LJ
2 LW
N
444.99 519.057 M
445.933 496.541 L
447.58 472.328 L
449.227 456.042 L
450.873 453.444 L
452.52 476.618 L
454.167 491.653 L
455.813 464.011 L
457.46 458.326 L
459.107 472.115 L
460.753 481.437 L
462.4 488.826 L
464.047 474.723 L
465.693 475.852 L
467.34 477.215 L
468.987 463.556 L
470.633 467.094 L
472.28 490.44 L
473.927 488.825 L
475.573 489.147 L
477.22 495.399 L
478.867 488.771 L
480.513 485.201 L
482.16 479.766 L
483.807 470.767 L
485.453 475.395 L
487.1 489.204 L
488.747 482.1 L
490.393 490.473 L
492.04 515.444 L
493.687 498.853 L
495.333 497.596 L
496.98 493.73 L
498.627 494.196 L
500.273 511.315 L
501.92 488.631 L
503.567 474.329 L
505.213 486.289 L
506.86 494.704 L
508.507 471.607 L
510.153 457.323 L
511.8 465.011 L
513.447 502.715 L
515.093 491.671 L
516.74 475.555 L
518.387 458.292 L
520.033 460.743 L
521.68 485.19 L
523.327 491.239 L
524.973 481.322 L
526.62 472.111 L
528.267 470.715 L
529.913 474.74 L
531.56 488.417 L
533.207 485.373 L
534.853 477.573 L
536.5 471.261 L
538.147 482.531 L
539.793 492.277 L
541.44 487.674 L
543.087 482.447 L
544.733 472.421 L
546.38 463.939 L
548.027 468.235 L
549.673 496.229 L
550.656 519.057 L
S
GR
GS
[0.5 0 0 0.5 0 0] CT
0.502 GC
[8 2 4 2] 0 setdash
2 LJ
2 LW
N
552.681 519.057 M
552.967 515.812 L
554.613 494.632 L
556.26 495.964 L
557.907 517.158 L
557.967 519.057 L
S
GR
GS
[0.5 0 0 0.5 0 0] CT
0.502 GC
[8 2 4 2] 0 setdash
2 LJ
2 LW
N
560.536 519.057 M
561.2 485.114 L
562.847 438.606 L
564.493 440.516 L
566.14 470.542 L
567.787 494.253 L
569.433 497.696 L
571.08 498.867 L
572.727 500.054 L
574.373 503.315 L
574.957 519.057 L
S
GR
GS
[0.5 0 0 0.5 0 0] CT
0.502 GC
[8 2 4 2] 0 setdash
2 LJ
2 LW
N
577.788 519.057 M
579.313 495.696 L
580.96 490.042 L
582.607 453.654 L
584.253 452.226 L
585.9 483.308 L
587.499 519.057 L
S
GR
GS
[0.5 0 0 0.5 0 0] CT
0.502 GC
[8 2 4 2] 0 setdash
2 LJ
2 LW
N
587.586 519.057 M
589.193 475.019 L
590.84 472.685 L
592.487 478.183 L
594.133 486.801 L
595.78 517.772 L
597.427 501.282 L
599.073 502.563 L
600.72 498.381 L
602.367 493.516 L
604.013 503.1 L
605.66 494.288 L
607.307 485.49 L
608.953 490.598 L
610.6 492.236 L
612.247 502.388 L
613.893 491.684 L
615.54 468.99 L
617.187 474.218 L
618.418 519.057 L
S
GR
GS
[0.5 0 0 0.5 0 0] CT
0.502 GC
[8 2 4 2] 0 setdash
2 LJ
2 LW
N
619.392 519.057 M
620.48 489.64 L
622.127 481.692 L
623.773 492.915 L
625.42 509.27 L
627.067 511.282 L
628.713 488.752 L
630.36 485.92 L
632.007 500.417 L
633.653 516.617 L
635.3 515.96 L
636.947 503.671 L
638.593 504.105 L
640.24 500.116 L
641.887 493.454 L
643.533 499.951 L
645.18 497.971 L
646.827 498.702 L
648.473 497.872 L
650.12 479.929 L
651.767 483.223 L
653.413 505.377 L
655.06 502.079 L
656.707 494.678 L
658.353 495.934 L
660 499.54 L
661.647 494.144 L
663.293 489.615 L
664.94 499.317 L
666.587 516.18 L
668.233 493.835 L
669.88 494.738 L
671.094 519.057 L
S
GR
GS
[0.5 0 0 0.5 0 0] CT
0.502 GC
[8 2 4 2] 0 setdash
2 LJ
2 LW
N
672.188 519.057 M
673.173 506.145 L
674.82 500.396 L
676.467 488.374 L
678.113 486.457 L
679.76 485.993 L
681.407 491.045 L
682.564 519.057 L
S
GR
GS
[0.5 0 0 0.5 0 0] CT
0.502 GC
[8 2 4 2] 0 setdash
2 LJ
2 LW
N
686.181 519.057 M
686.347 511.478 L
687.993 506.705 L
689.633 519.057 L
S
GR
GS
[0.5 0 0 0.5 0 0] CT
0.502 GC
[8 2 4 2] 0 setdash
2 LJ
2 LW
N
694.122 519.057 M
694.58 455.706 L
696.227 451.25 L
697.873 475.554 L
699.52 480.828 L
700.545 519.057 L
S
GR
GS
[0.5 0 0 0.5 0 0] CT
0.502 GC
[8 2 4 2] 0 setdash
2 LJ
2 LW
N
704.151 519.057 M
704.46 517.113 L
706.107 509.043 L
707.753 511.849 L
708.797 519.057 L
S
GR
GS
[0.5 0 0 0.5 0 0] CT
0.502 GC
[8 2 4 2] 0 setdash
2 LJ
2 LW
N
714.265 519.057 M
714.34 517.365 L
715.987 484.169 L
717.633 480.735 L
719.28 500.274 L
720.927 479.341 L
722.573 479.152 L
724.22 495.215 L
725.867 498.811 L
726.496 519.057 L
S
GR
GS
[0.5 0 0 0.5 0 0] CT
0.502 GC
[8 2 4 2] 0 setdash
2 LJ
2 LW
N
730.711 519.057 M
730.807 517.577 L
732.453 511.609 L
734.1 495.494 L
735.747 487.345 L
737.393 498.484 L
739.04 495.78 L
740.687 495.536 L
741.926 519.057 L
S
GR
GS
[0.5 0 0 0.5 0 0] CT
0.502 GC
[8 2 4 2] 0 setdash
2 LJ
2 LW
N
743.362 519.057 M
743.98 514.413 L
745.081 519.057 L
S
GR
GS
[0.5 0 0 0.5 0 0] CT
0.502 GC
[8 2 4 2] 0 setdash
2 LJ
2 LW
N
745.768 519.057 M
747.273 494.597 L
748.92 488.085 L
750.567 506.554 L
752.213 508 L
753.86 493.808 L
755.507 490.943 L
757.153 505.986 L
758.519 519.057 L
S
GR
GS
[0.5 0 0 0.5 0 0] CT
0.502 GC
[8 2 4 2] 0 setdash
2 LJ
2 LW
N
759.516 519.057 M
760.447 515.566 L
762.093 507.659 L
763.74 507.692 L
765.387 514.366 L
766.021 519.057 L
S
GR
GS
[0.5 0 0 0.5 0 0] CT
0.502 GC
[8 2 4 2] 0 setdash
2 LJ
2 LW
N
769.422 519.057 M
770.327 508.46 L
771.973 494.066 L
773.62 491.354 L
775.267 497.89 L
776.913 510.947 L
778.56 512.828 L
780.207 507.152 L
781.853 506.763 L
783.5 490 L
785.147 488.328 L
786.793 510.677 L
787.538 519.057 L
S
GR
GS
[0.5 0 0 0.5 0 0] CT
0.502 GC
[8 2 4 2] 0 setdash
2 LJ
2 LW
N
789.705 519.057 M
790.087 515.991 L
791.733 486.943 L
793.38 489.56 L
795.027 509.313 L
796.673 501.305 L
798.32 500.304 L
799.967 502.788 L
801.613 499.382 L
803.26 512.506 L
803.988 519.057 L
S
GR
GS
[0.5 0 0 0.5 0 0] CT
0.502 GC
[8 2 4 2] 0 setdash
2 LJ
2 LW
N
806.352 519.057 M
806.553 517.906 L
807.093 519.057 L
S
GR
GS
[0.5 0 0 0.5 0 0] CT
0.502 GC
[8 2 4 2] 0 setdash
2 LJ
2 LW
N
808.375 519.057 M
809.847 499.257 L
811.493 498.259 L
813.14 517.45 L
814.787 514.897 L
815.348 519.057 L
S
GR
GS
[0.5 0 0 0.5 0 0] CT
0.502 GC
[8 2 4 2] 0 setdash
2 LJ
2 LW
N
824.986 519.057 M
826.313 477.731 L
827.96 454.851 L
829.607 463.145 L
831.253 479.75 L
832.9 480.646 L
834.547 514.822 L
835.075 519.057 L
S
GR
GS
[0.5 0 0 0.5 0 0] CT
0.502 GC
[8 2 4 2] 0 setdash
2 LJ
2 LW
N
840.801 519.057 M
841.133 517.086 L
841.534 519.057 L
S
GR
GS
[0.5 0 0 0.5 0 0] CT
0.502 GC
[8 2 4 2] 0 setdash
2 LJ
2 LW
N
847.107 519.057 M
847.72 508.291 L
849.367 495.624 L
851.013 499.837 L
852.66 515.213 L
854.307 491.141 L
855.953 493.049 L
857.6 505.062 L
859.247 508.74 L
859.525 519.057 L
S
GR
GS
[0.5 0 0 0.5 0 0] CT
0.502 GC
[8 2 4 2] 0 setdash
2 LJ
2 LW
N
864.405 519.057 M
865.833 510.037 L
867.48 505.006 L
869.127 502.865 L
870.773 502.172 L
872.42 505.336 L
873.867 519.057 L
S
GR
GS
[0.5 0 0 0.5 0 0] CT
0.502 GC
[8 2 4 2] 0 setdash
2 LJ
2 LW
N
879.38 519.057 M
880.653 495.06 L
882.3 497.935 L
883.947 515.475 L
885.593 506.951 L
887.24 509.37 L
888.887 495.182 L
890.533 501.361 L
892.18 518.25 L
893.827 496.252 L
895.473 502.274 L
896.345 519.057 L
S
GR
GS
[0.5 0 0 0.5 0 0] CT
0.502 GC
[8 2 4 2] 0 setdash
2 LJ
2 LW
N
901.38 519.057 M
902.06 514.273 L
902.679 519.057 L
S
GR
GS
[0.5 0 0 0.5 0 0] CT
0.502 GC
[8 2 4 2] 0 setdash
2 LJ
2 LW
N
904.81 519.057 M
905.353 515.143 L
907 497.565 L
908.647 496.868 L
910.293 509.229 L
911.94 517.774 L
912.179 519.057 L
S
GR
GS
[0.5 0 0 0.5 0 0] CT
0.502 GC
[8 2 4 2] 0 setdash
2 LJ
2 LW
N
914.222 519.057 M
915.233 507.041 L
916.88 505.1 L
918.34 519.057 L
S
GR
GS
[0.5 0 0 0.5 0 0] CT
0.502 GC
[8 2 4 2] 0 setdash
2 LJ
2 LW
N
919.649 519.057 M
920.173 518.222 L
921.82 518.086 L
923.467 517.24 L
923.681 519.057 L
S
GR
GS
[0.5 0 0 0.5 0 0] CT
0.502 GC
[8 2 4 2] 0 setdash
2 LJ
2 LW
N
926.759 519.057 M
926.76 519.052 L
928.407 505.711 L
930.053 505.751 L
930.929 519.057 L
S
GR
GS
[0.5 0 0 0.5 0 0] CT
0.502 GC
[8 2 4 2] 0 setdash
2 LJ
2 LW
N
932.569 519.057 M
933.347 508.582 L
934.993 509.632 L
935.872 519.057 L
S
GR
GS
[0.5 0 0 0.5 0 0] CT
0.502 GC
[8 2 4 2] 0 setdash
2 LJ
2 LW
N
942.322 519.057 M
943.227 498.953 L
944.873 498.917 L
946.52 514.059 L
948.167 515.832 L
948.377 519.057 L
S
GR
GS
[0.5 0 0 0.5 0 0] CT
0.502 GC
[8 2 4 2] 0 setdash
2 LJ
2 LW
N
958.633 519.057 M
959.693 461.139 L
961.34 459.831 L
962.987 513.291 L
964.633 500.393 L
966.28 503.679 L
967.09 519.057 L
S
GR
GS
[0.5 0 0 0.5 0 0] CT
0.502 GC
[8 2 4 2] 0 setdash
2 LJ
2 LW
N
972.561 519.057 M
972.867 515.455 L
973.742 519.057 L
S
GR
GS
[0.5 0 0 0.5 0 0] CT
0.502 GC
[8 2 4 2] 0 setdash
2 LJ
2 LW
N
980.712 519.057 M
981.1 506.878 L
982.747 495.787 L
984.393 506.335 L
986.04 516.401 L
987.687 516.338 L
989.333 515.09 L
990.98 500.179 L
992.627 508.491 L
993.243 519.057 L
S
GR
GS
[0.5 0 0 0.5 0 0] CT
0.502 GC
[8 2 4 2] 0 setdash
2 LJ
2 LW
N
1002.959 519.057 M
1004.153 509.382 L
1005.8 517.068 L
1005.913 519.057 L
S
GR
GS
[0.5 0 0 0.5 0 0] CT
0.502 GC
[8 2 4 2] 0 setdash
2 LJ
2 LW
N
1011.842 519.057 M
1012.387 511.45 L
1014.033 503.029 L
1015.274 519.057 L
S
GR
GS
[0.5 0 0 0.5 0 0] CT
0.502 GC
[8 2 4 2] 0 setdash
2 LJ
2 LW
N
1016.917 519.057 M
1017.327 517.317 L
1018.973 505.879 L
1020.62 505.219 L
1022.267 501.737 L
1023.913 514.115 L
1024.379 519.057 L
S
GR
GS
[0.5 0 0 0.5 0 0] CT
0.502 GC
[8 2 4 2] 0 setdash
2 LJ
2 LW
N
1026.939 519.057 M
1027.207 516.62 L
1028.133 519.057 L
S
GR
GS
[0.5 0 0 0.5 0 0] CT
0.502 GC
[8 2 4 2] 0 setdash
2 LJ
2 LW
N
1037.682 519.057 M
1038.733 502.238 L
1040.38 496.298 L
1042.027 511.189 L
1043.214 519.057 L
S
GR
GS
[0.5 0 0 0.5 0 0] CT
0.502 GC
[8 2 4 2] 0 setdash
2 LJ
2 LW
N
1045.785 519.057 M
1046.967 512.983 L
1048.613 496.308 L
1050.26 503.221 L
1051.244 519.057 L
S
GR
GS
[0.5 0 0 0.5 0 0] CT
0.502 GC
[8 2 4 2] 0 setdash
2 LJ
2 LW
N
1052.562 519.057 M
1053.553 502.913 L
1055.2 503.154 L
1055.894 519.057 L
S
GR
GS
[0.5 0 0 0.5 0 0] CT
0.502 GC
[8 2 4 2] 0 setdash
2 LJ
2 LW
N
1061.547 519.057 M
1061.787 518.127 L
1063.433 517.279 L
1065.08 505.667 L
1066.727 501.817 L
1068.26 519.057 L
S
GR
GS
[0.5 0 0 0.5 0 0] CT
0.502 GC
[8 2 4 2] 0 setdash
2 LJ
2 LW
N
1074.657 519.057 M
1074.96 515.986 L
1076.607 498.997 L
1078.253 501.686 L
1079.9 508.486 L
1080.874 519.057 L
S
GR
GS
[0.5 0 0 0.5 0 0] CT
0.502 GC
[8 2 4 2] 0 setdash
2 LJ
2 LW
N
1090.093 519.057 M
1091.427 480.562 L
1093.073 467.382 L
1094.72 482.937 L
1096.008 519.057 L
S
GR
GS
[0.5 0 0 0.5 0 0] CT
0.502 GC
[8 2 4 2] 0 setdash
2 LJ
2 LW
N
1097.351 519.057 M
1098.013 512.289 L
1099.66 518.788 L
1099.72 519.057 L
S
GR
GS
[0.5 0 0 0.5 0 0] CT
0.502 GC
[8 2 4 2] 0 setdash
2 LJ
2 LW
N
1113.005 519.057 M
1114.48 510.008 L
1116.127 514.534 L
1117.773 514.536 L
1119.42 502.767 L
1121.067 499.494 L
1122.713 503.11 L
1124.36 509.76 L
1125.034 519.057 L
S
GR
GS
[0.5 0 0 0.5 0 0] CT
0.502 GC
[8 2 4 2] 0 setdash
2 LJ
2 LW
N
1132.514 519.057 M
1132.593 517.71 L
1134.24 513.67 L
1135.887 512.529 L
1137.533 515.858 L
1137.69 519.057 L
S
GR
GS
[0.5 0 0 0.5 0 0] CT
0.502 GC
[8 2 4 2] 0 setdash
2 LJ
2 LW
N
1145.706 519.057 M
1145.767 518.609 L
1146.075 519.057 L
S
GR
GS
[0.5 0 0 0.5 0 0] CT
0.502 GC
[8 2 4 2] 0 setdash
2 LJ
2 LW
N
1151.435 519.057 M
1152.353 516.902 L
1153.432 519.057 L
S
GR
GS
[0.5 0 0 0.5 0 0] CT
[8 2 4 2] 0 setdash
2 LJ
2 LW
N
166 128.373 M
167.647 142.903 L
168.08 519.057 L
S
GR
GS
[0.5 0 0 0.5 0 0] CT
[8 2 4 2] 0 setdash
2 LJ
2 LW
N
171.032 519.057 M
172.587 503.244 L
174.233 497.929 L
175.88 410.69 L
177.527 399.323 L
179.173 379.351 L
180.82 371.802 L
182.467 378.371 L
184.113 383.718 L
185.76 399.06 L
187.407 395.62 L
189.053 388.256 L
190.7 388.482 L
192.347 389.929 L
193.993 393.107 L
195.64 401.431 L
197.287 405.912 L
198.933 393.912 L
200.58 401.92 L
202.227 395.977 L
203.873 392.578 L
205.52 414.566 L
207.167 428.614 L
208.813 398.204 L
210.46 396.301 L
212.107 429.442 L
213.753 433.188 L
215.4 443.917 L
217.047 410.809 L
218.693 397.142 L
220.34 410.088 L
221.987 427.53 L
223.633 425.453 L
225.28 430.375 L
226.927 438.481 L
228.573 449.51 L
230.22 408.957 L
231.867 394.525 L
233.513 408.916 L
235.16 454.246 L
236.807 442.856 L
238.453 437.195 L
240.1 424.277 L
241.747 421.642 L
243.393 409.708 L
245.04 401.638 L
246.687 414.952 L
248.333 424.863 L
249.98 436.492 L
251.627 417.336 L
253.273 397.467 L
254.92 404.294 L
256.567 450.73 L
258.213 411.154 L
259.86 401.478 L
261.507 413.874 L
263.153 406.98 L
264.8 402.324 L
266.447 404.462 L
268.093 404.215 L
269.74 389.862 L
271.387 381.443 L
273.033 382.369 L
274.68 379.063 L
276.327 386.392 L
277.973 394.091 L
279.62 375.41 L
281.267 364.926 L
282.913 365.382 L
284.56 350.194 L
286.207 338.988 L
287.853 341.554 L
289.5 323.656 L
291.147 299.166 L
292.793 271.188 L
294.44 217.239 L
296.087 170.832 L
297.733 155.912 L
299.38 166.407 L
301.027 234.537 L
302.673 291.164 L
304.32 314.06 L
305.967 341.036 L
307.613 363.7 L
309.26 364.278 L
310.907 376.409 L
312.553 365.437 L
314.2 378.356 L
315.847 397.937 L
317.493 393.854 L
319.14 393.201 L
320.787 400.753 L
322.433 405.471 L
324.08 404.263 L
325.727 416.913 L
327.373 427.744 L
329.02 407.158 L
330.667 401.863 L
332.313 413.879 L
333.96 415.305 L
335.607 412.294 L
337.253 417.819 L
338.9 419.014 L
340.547 413.209 L
342.193 410.62 L
343.84 422.078 L
345.487 446.345 L
347.133 443.036 L
348.78 419.051 L
350.427 411.705 L
352.073 422.234 L
353.72 442.585 L
355.367 438.801 L
357.013 441.783 L
358.66 455.333 L
360.307 449.69 L
361.953 432.132 L
363.6 418.007 L
365.247 423.42 L
366.893 453.718 L
368.54 461.977 L
370.187 440.372 L
371.833 433.725 L
373.48 430.846 L
375.127 435.826 L
376.773 438.601 L
378.42 434.893 L
380.067 445.74 L
381.713 454.027 L
383.36 441.953 L
385.007 437.42 L
386.653 434.972 L
388.3 445.751 L
389.947 454.561 L
391.593 452.874 L
393.24 460.611 L
394.887 458.793 L
396.533 456.138 L
398.18 460.867 L
399.827 459.939 L
401.473 455.918 L
403.12 454.419 L
404.767 457.78 L
406.413 463.743 L
408.06 465.262 L
409.707 456.515 L
411.353 449.736 L
413 456.204 L
414.647 467.618 L
416.293 460.829 L
417.94 463.45 L
419.587 480.441 L
421.233 480.661 L
422.88 470.623 L
424.527 463.536 L
426.173 438.795 L
427.82 427.776 L
429.467 419.949 L
431.113 422.678 L
432.76 441.934 L
434.407 468.049 L
436.053 480.492 L
437.7 486.882 L
439.347 487.185 L
440.993 473.474 L
442.64 454.618 L
444.287 457.855 L
445.933 469.506 L
447.58 461.705 L
449.227 459.111 L
450.873 468.201 L
452.52 469.383 L
454.167 466.632 L
455.813 461.04 L
457.46 457.837 L
459.107 473.168 L
460.753 483.504 L
462.4 471.547 L
464.047 465.747 L
465.693 472.161 L
467.34 478.594 L
468.987 465.06 L
470.633 461.705 L
472.28 462.048 L
473.927 454.627 L
475.573 456.016 L
477.22 471.367 L
478.867 475.317 L
480.513 476.383 L
482.16 466.582 L
483.807 464.283 L
485.453 472.571 L
487.1 472.306 L
488.747 478.741 L
490.393 485.765 L
492.04 477.098 L
493.687 464.043 L
495.333 458.734 L
496.98 463.254 L
498.627 475.737 L
500.273 486.546 L
501.92 476.777 L
503.567 476.463 L
505.213 471.176 L
506.86 466.419 L
508.507 464.611 L
510.153 467.927 L
511.8 479.864 L
513.447 475.785 L
515.093 471.501 L
516.74 475.104 L
518.387 469.085 L
520.033 470.578 L
521.68 480.959 L
523.327 476.618 L
524.973 474.089 L
526.62 472.03 L
528.267 468.759 L
529.913 468.335 L
531.56 470.406 L
533.207 476.346 L
534.853 475.806 L
536.5 469.476 L
538.147 470.814 L
539.793 466.171 L
541.44 462.011 L
543.087 459.688 L
544.733 458.761 L
546.38 458.259 L
548.027 454.371 L
549.673 451.486 L
551.32 446.497 L
552.967 433.736 L
554.613 425.039 L
556.26 411.205 L
557.907 404.868 L
559.553 415.443 L
561.2 433.139 L
562.847 411.909 L
564.493 407.97 L
566.14 425.654 L
567.787 443.122 L
569.433 453.532 L
571.08 460.807 L
572.727 464.905 L
574.373 474.022 L
576.02 476.962 L
577.667 480.973 L
579.313 482.459 L
580.96 453.555 L
582.607 456.196 L
584.253 485.801 L
585.9 487.735 L
587.547 491.713 L
589.193 479.829 L
590.84 482.556 L
592.487 489.037 L
594.133 486.604 L
595.78 488.211 L
597.427 491.254 L
599.073 492.214 L
600.72 482.805 L
602.367 482.537 L
604.013 480.861 L
605.66 483.132 L
607.307 476.186 L
608.953 474.649 L
610.6 481.023 L
612.247 487.592 L
613.893 490.006 L
615.54 487.386 L
617.187 489.152 L
618.833 491.527 L
620.48 500.107 L
622.127 495.405 L
623.773 489.749 L
625.42 484.018 L
627.067 481.088 L
628.713 484.249 L
630.36 486.202 L
632.007 490.188 L
633.653 489.588 L
635.3 490.817 L
636.947 489.466 L
638.593 490.808 L
640.24 491.141 L
641.887 491.4 L
643.533 491.117 L
645.18 493.628 L
646.827 494.077 L
648.473 497.421 L
650.12 489.639 L
651.767 483.195 L
653.413 491.489 L
655.06 497.939 L
656.707 496.478 L
658.353 494.782 L
660 490.419 L
661.647 484.169 L
663.293 485.685 L
664.94 489.908 L
666.587 491.497 L
668.233 487.307 L
669.88 485.862 L
671.527 492.495 L
673.173 489.066 L
674.82 485.513 L
676.467 481.499 L
678.113 482.32 L
679.76 484.332 L
681.407 478.567 L
683.053 472.24 L
684.7 472.492 L
686.347 467.878 L
687.993 458.053 L
689.64 457.076 L
691.287 456.127 L
692.933 449.528 L
694.58 446.927 L
696.227 451.245 L
697.873 460.293 L
699.52 468.92 L
701.167 479.255 L
702.813 484.669 L
704.46 491.797 L
706.107 486.342 L
707.753 482.433 L
709.4 487.009 L
711.047 490.056 L
712.693 488.134 L
714.34 486.5 L
715.987 486.31 L
717.633 489.844 L
719.28 469.723 L
720.927 470.857 L
722.573 502.26 L
724.22 507.326 L
725.867 506.084 L
727.513 503.025 L
729.16 503.881 L
730.807 501.701 L
732.453 495.437 L
734.1 494.628 L
735.747 495.129 L
737.393 500.127 L
739.04 496.054 L
740.687 487.685 L
742.333 493.503 L
743.98 508.279 L
745.627 507.529 L
747.273 500.895 L
748.92 506.936 L
750.567 508.863 L
752.213 510.934 L
753.86 512.54 L
755.507 509.375 L
757.153 503.483 L
758.8 499.561 L
760.447 500.995 L
762.093 500.037 L
763.74 501.116 L
765.387 505.113 L
767.033 505.554 L
768.68 510.099 L
770.327 509.945 L
771.973 507.711 L
773.62 504.468 L
775.267 504.877 L
776.913 510.876 L
778.56 508.289 L
780.207 508.478 L
781.853 509.66 L
783.5 497.187 L
785.147 496.007 L
786.793 507.89 L
788.44 508.692 L
790.087 504.368 L
791.733 504.808 L
793.38 502.956 L
795.027 498.838 L
796.673 504.762 L
798.32 512.247 L
799.967 504.184 L
801.613 500.917 L
803.26 503.072 L
804.907 501.541 L
806.553 494.652 L
808.2 488.212 L
809.847 479.741 L
811.493 472.649 L
813.14 468.249 L
814.787 464.034 L
816.433 452.875 L
818.08 447.445 L
819.727 443.913 L
821.373 447.078 L
823.02 457.979 L
824.667 462.997 L
826.313 457.542 L
827.96 442.509 L
829.607 438.258 L
831.253 447.882 L
832.9 457.738 L
834.547 457.78 L
836.193 464.004 L
837.84 473.869 L
839.487 483.282 L
841.133 484.667 L
842.78 484.839 L
844.427 488.683 L
846.073 493.917 L
847.72 501.187 L
849.367 505.705 L
851.013 506.446 L
852.66 508.324 L
854.307 506.88 L
855.953 509.756 L
857.6 468.499 L
859.247 465.95 L
860.893 512.794 L
862.54 511.072 L
864.187 508.17 L
865.833 506.881 L
867.48 512.277 L
868.721 519.057 L
S
GR
GS
[0.5 0 0 0.5 0 0] CT
[8 2 4 2] 0 setdash
2 LJ
2 LW
N
869.726 519.057 M
870.773 515.19 L
872.42 500.588 L
874.067 500.613 L
875.713 515.528 L
877.36 509.575 L
879.007 508.144 L
880.653 514.796 L
882.3 510.93 L
883.947 508.938 L
885.593 511.143 L
887.24 511.658 L
888.887 508.676 L
890.533 505.594 L
892.18 503.734 L
893.827 503.065 L
895.473 500.667 L
897.12 503.707 L
898.767 505.623 L
900.413 503.182 L
902.06 505.271 L
903.707 501.509 L
905.353 501.616 L
907 508.082 L
908.647 509.896 L
910.293 507.772 L
911.94 505.369 L
913.587 506.551 L
915.233 500.016 L
916.88 496.204 L
918.527 500.643 L
920.173 505.476 L
921.82 506.306 L
923.467 507.124 L
925.113 505.881 L
926.76 503.548 L
928.407 506.39 L
930.053 509.067 L
931.7 505.789 L
933.347 505.461 L
934.993 503.647 L
936.64 504.711 L
938.287 499.861 L
939.933 492.219 L
941.58 485.358 L
943.227 482.347 L
944.873 481.356 L
946.52 471.677 L
948.167 465.431 L
949.813 461.827 L
951.46 463.119 L
953.107 468.173 L
954.753 468.375 L
956.4 469.749 L
958.047 468.69 L
959.693 465.341 L
961.34 460.162 L
962.987 457.031 L
964.633 461.26 L
966.28 472.074 L
967.927 475.975 L
969.573 471.875 L
971.22 476.294 L
972.867 494.147 L
974.513 497.019 L
976.16 490.763 L
977.807 489.426 L
979.453 491.967 L
981.1 499.176 L
982.747 497.571 L
984.393 495.898 L
986.04 498.866 L
987.687 498.394 L
989.333 493.343 L
990.98 492.652 L
992.627 498.19 L
994.273 495.424 L
995.92 478.151 L
997.567 475.119 L
999.213 499.451 L
1000.86 508.951 L
1002.507 506.529 L
1004.153 503.272 L
1005.8 504.331 L
1007.447 505.932 L
1009.093 509.227 L
1010.74 509.076 L
1012.387 510.931 L
1014.033 511.32 L
1015.68 510.6 L
1017.327 513.059 L
1018.973 515.668 L
1020.62 512.507 L
1022.267 510.637 L
1023.913 508.356 L
1025.56 507.345 L
1027.207 507.974 L
1028.853 509.517 L
1030.5 512.497 L
1032.147 513.561 L
1033.793 510.836 L
1035.44 510.025 L
1037.087 509.633 L
1038.733 512.349 L
1040.38 512.14 L
1042.027 511.964 L
1043.673 509.945 L
1045.32 510.919 L
1046.967 505.522 L
1048.613 506.245 L
1050.26 506.542 L
1051.907 509.077 L
1053.553 502.905 L
1055.2 504.945 L
1056.847 505.535 L
1058.493 506.064 L
1060.14 498.656 L
1061.787 499.778 L
1063.433 506.344 L
1065.08 507.171 L
1066.727 503.225 L
1068.373 503.504 L
1070.02 510.442 L
1071.667 505.666 L
1073.313 503.445 L
1074.96 499.558 L
1076.607 490.952 L
1078.253 479.961 L
1079.9 473.433 L
1081.547 462.433 L
1083.193 465.105 L
1084.84 465.956 L
1086.487 462.352 L
1088.133 461.255 L
1089.78 462.733 L
1091.427 460.192 L
1093.073 449.739 L
1094.72 449.76 L
1096.367 454.388 L
1098.013 463.792 L
1099.66 471.985 L
1101.307 472.277 L
1102.953 479.695 L
1104.6 486.787 L
1106.247 493.577 L
1107.893 490.695 L
1109.54 495.126 L
1111.187 492.045 L
1112.833 492.391 L
1114.48 499.228 L
1116.127 501.145 L
1117.773 509.872 L
1119.42 508.786 L
1121.067 509.341 L
1122.713 511.514 L
1124.36 510.079 L
1126.007 510.498 L
1127.653 514.729 L
1129.3 514.991 L
1130.947 516.242 L
1132.153 519.057 L
S
GR
GS
[0.5 0 0 0.5 0 0] CT
[8 2 4 2] 0 setdash
2 LJ
2 LW
N
1132.678 519.057 M
1134.24 500.092 L
1135.887 492.834 L
1137.533 507.197 L
1139.149 519.057 L
S
GR
GS
[0.5 0 0 0.5 0 0] CT
1 LJ
3 LW
N
166 45 M
167.647 59.529 L
169.293 519 L
170.94 499.018 L
172.587 443.034 L
174.233 415.216 L
175.88 400.016 L
177.527 388.183 L
179.173 385.49 L
180.82 385.555 L
182.467 387.149 L
184.113 381.419 L
185.76 381 L
187.407 384.845 L
189.053 383.071 L
190.7 383.791 L
192.347 385.237 L
193.993 385.252 L
195.64 388.861 L
197.287 396.183 L
198.933 390.869 L
200.58 392.802 L
202.227 395.17 L
203.873 399.669 L
205.52 408.776 L
207.167 409.192 L
208.813 388.269 L
210.46 390.109 L
212.107 422.185 L
213.753 419.437 L
215.4 422.534 L
217.047 410.07 L
218.693 399.66 L
220.34 408.003 L
221.987 421.231 L
223.633 418.889 L
225.28 418.896 L
226.927 434.55 L
228.573 449.185 L
230.22 408.645 L
231.867 396.787 L
233.513 413.3 L
235.16 411.153 L
236.807 406.536 L
238.453 433.097 L
240.1 424.967 L
241.747 405.032 L
243.393 389.706 L
245.04 395.162 L
246.687 391.75 L
248.333 379.146 L
249.98 393.416 L
251.627 396.018 L
253.273 383.08 L
254.92 390.707 L
256.567 401.453 L
258.213 407.853 L
259.86 405.166 L
261.507 408.627 L
263.153 391.464 L
264.8 389.976 L
266.447 403.329 L
268.093 354.371 L
269.74 319.887 L
271.387 310.735 L
273.033 312.115 L
274.68 314.074 L
276.327 316.924 L
277.973 320.63 L
279.62 323.01 L
281.267 325.199 L
282.913 296.589 L
284.56 266.626 L
286.207 258.808 L
287.853 260.794 L
289.5 235.049 L
291.147 210.134 L
292.793 181.009 L
294.44 126.927 L
296.087 85.722 L
297.733 72.643 L
299.38 84.726 L
301.027 160.413 L
302.673 211.275 L
304.32 233.567 L
305.967 281.272 L
307.613 345.148 L
309.26 348.508 L
310.907 355.621 L
312.553 359.998 L
314.2 361.599 L
315.847 359.526 L
317.493 348.254 L
319.14 342.8 L
320.787 352.056 L
322.433 361.552 L
324.08 366.907 L
325.727 376.251 L
327.373 377.093 L
329.02 376.502 L
330.667 378.579 L
332.313 382.911 L
333.96 385.687 L
335.607 382.61 L
337.253 383.698 L
338.9 385.62 L
340.547 379.289 L
342.193 380.182 L
343.84 386.622 L
345.487 392.354 L
347.133 391.867 L
348.78 393.935 L
350.427 395.985 L
352.073 399.443 L
353.72 406.969 L
355.367 404.071 L
357.013 403.766 L
358.66 411.055 L
360.307 413.75 L
361.953 412.257 L
363.6 409.208 L
365.247 412.6 L
366.893 418.158 L
368.54 419.858 L
370.187 420.878 L
371.833 419.723 L
373.48 421.217 L
375.127 424.604 L
376.773 424.796 L
378.42 423.189 L
380.067 425.571 L
381.713 427.383 L
383.36 426.297 L
385.007 426.199 L
386.653 428.436 L
388.3 443.261 L
389.947 441.627 L
391.593 437.654 L
393.24 449.024 L
394.887 449.957 L
396.533 441 L
398.18 440.402 L
399.827 446.1 L
401.473 437.239 L
403.12 420.328 L
404.767 417.153 L
406.413 420.945 L
408.06 422.564 L
409.707 429.479 L
411.353 437.2 L
413 434.49 L
414.647 419.324 L
416.293 418.626 L
417.94 420.071 L
419.587 414.478 L
421.233 412.295 L
422.88 407.278 L
424.527 398.271 L
426.173 382.44 L
427.82 362.656 L
429.467 353.038 L
431.113 357.454 L
432.76 375.419 L
434.407 396.822 L
436.053 412.847 L
437.7 419.214 L
439.347 421.803 L
440.993 383.409 L
442.64 381.919 L
444.287 441.071 L
445.933 441.055 L
447.58 448.067 L
449.227 445.144 L
450.873 444.623 L
452.52 446.427 L
454.167 447.476 L
455.813 444.143 L
457.46 443.697 L
459.107 448.781 L
460.753 447.261 L
462.4 442.221 L
464.047 442.673 L
465.693 445.765 L
467.34 447.632 L
468.987 446.662 L
470.633 445.132 L
472.28 445.132 L
473.927 442.137 L
475.573 437.427 L
477.22 427.765 L
478.867 423.378 L
480.513 423.269 L
482.16 423.026 L
483.807 423.474 L
485.453 424.006 L
487.1 424.212 L
488.747 424.694 L
490.393 424.943 L
492.04 424.843 L
493.687 424.788 L
495.333 424.044 L
496.98 423.58 L
498.627 425.273 L
500.273 426.572 L
501.92 425.311 L
503.567 424.994 L
505.213 424.359 L
506.86 424.975 L
508.507 426.433 L
510.153 426.31 L
511.8 427.752 L
513.447 427.379 L
515.093 427.419 L
516.74 427.762 L
518.387 427.684 L
520.033 421.17 L
521.68 411.358 L
523.327 408.669 L
524.973 409.251 L
526.62 410.2 L
528.267 411.209 L
529.913 411.638 L
531.56 411.73 L
533.207 412.131 L
534.853 412.998 L
536.5 413.581 L
538.147 393.962 L
539.793 383.239 L
541.44 384.335 L
543.087 387.459 L
544.733 379.789 L
546.38 374.371 L
548.027 371.679 L
549.673 364.14 L
551.32 358.648 L
552.967 346.929 L
554.613 333.771 L
556.26 321.958 L
557.907 321.457 L
559.553 336.159 L
561.2 350.43 L
562.847 329.044 L
564.493 328.654 L
566.14 349.298 L
567.787 364.271 L
569.433 376.648 L
571.08 380.326 L
572.727 389.883 L
574.373 408.2 L
576.02 408.423 L
577.667 408.672 L
579.313 372.356 L
580.96 374.505 L
582.607 428.473 L
584.253 429.285 L
585.9 430.369 L
587.547 430.81 L
589.193 431.102 L
590.84 431.702 L
592.487 432.53 L
594.133 433.018 L
595.78 433.336 L
597.427 433.821 L
599.073 433.679 L
600.72 433.927 L
602.367 435.05 L
604.013 435.469 L
605.66 435.282 L
607.307 435.859 L
608.953 437.396 L
610.6 438.267 L
612.247 438.647 L
613.893 439.214 L
615.54 439.629 L
617.187 440.04 L
618.833 441.012 L
620.48 441.802 L
622.127 442.255 L
623.773 442.669 L
625.42 443.244 L
627.067 443.439 L
628.713 443.259 L
630.36 444.37 L
632.007 445.815 L
633.653 446.173 L
635.3 446.717 L
636.947 447.087 L
638.593 445.285 L
640.24 442.605 L
641.887 441.542 L
643.533 441.609 L
645.18 442.123 L
646.827 442.097 L
648.473 442.244 L
650.12 441.994 L
651.767 441.84 L
653.413 442.971 L
655.06 443.68 L
656.707 443.41 L
658.353 443.529 L
660 444.396 L
661.647 437.735 L
663.293 424.658 L
664.94 419.664 L
666.587 419.688 L
668.233 419.805 L
669.88 418.576 L
671.527 412.767 L
673.173 410.22 L
674.82 411.87 L
676.467 406.964 L
678.113 402.867 L
679.76 404.131 L
681.407 400.393 L
683.053 395.445 L
684.7 392.066 L
686.347 387.47 L
687.993 384.292 L
689.64 379.366 L
691.287 374.668 L
692.933 371.196 L
694.58 369.203 L
696.227 373.027 L
697.873 380.658 L
699.52 391.521 L
701.167 401.258 L
702.813 407.743 L
704.46 406.193 L
706.107 404.538 L
707.753 408.04 L
709.4 413.225 L
711.047 412.614 L
712.693 411.6 L
714.34 411.107 L
715.987 405.352 L
717.633 386.321 L
719.28 394.175 L
720.927 471.061 L
722.573 470.54 L
724.22 472.578 L
725.867 475.213 L
727.513 475.362 L
729.16 475.134 L
730.807 476.355 L
732.453 478.318 L
734.1 478.702 L
735.747 479.048 L
737.393 478.905 L
739.04 476.843 L
740.687 478.555 L
742.333 483.189 L
743.98 485.485 L
745.627 486.875 L
747.273 486.156 L
748.92 486.615 L
750.567 489.088 L
752.213 489.356 L
753.86 489.249 L
755.507 490.065 L
757.153 482.579 L
758.8 476.333 L
760.447 474.86 L
762.093 474.185 L
763.74 477.063 L
765.387 481.938 L
767.033 486.356 L
768.68 488.489 L
770.327 487.702 L
771.973 490.539 L
773.62 489.927 L
775.267 489.653 L
776.913 493.36 L
778.56 494.375 L
780.207 499.552 L
781.853 498.78 L
783.5 497.078 L
785.147 498.027 L
786.793 490.65 L
788.44 489.776 L
790.087 498.325 L
791.733 489.797 L
793.38 481.194 L
795.027 476.044 L
796.673 453.344 L
798.32 437.635 L
799.967 432.512 L
801.613 430.386 L
803.26 425.26 L
804.907 414.142 L
806.553 408.448 L
808.2 407.103 L
809.847 398.526 L
811.493 388.571 L
813.14 382.139 L
814.787 375.167 L
816.433 365.541 L
818.08 359.561 L
819.727 361.085 L
821.373 366.908 L
823.02 375.064 L
824.667 384.391 L
826.313 372.873 L
827.96 358.572 L
829.607 358.536 L
831.253 368.986 L
832.9 374.214 L
834.547 377.288 L
836.193 387.654 L
837.84 401.095 L
839.487 403.394 L
841.133 405.426 L
842.78 410.341 L
844.427 419.162 L
846.073 426.101 L
847.72 431.409 L
849.367 437.156 L
851.013 442.81 L
852.66 447.113 L
854.307 398.163 L
855.953 381.382 L
857.6 393.516 L
859.247 495.392 L
860.893 493.504 L
862.54 494.008 L
864.187 494.679 L
865.833 492.133 L
867.48 492.721 L
869.127 493.907 L
870.773 491.411 L
872.42 490.863 L
874.067 483.563 L
875.713 453.354 L
877.36 442.308 L
879.007 441.219 L
880.653 440.871 L
882.3 440.561 L
883.947 440.345 L
885.593 440.07 L
887.24 439.755 L
888.887 439.529 L
890.533 439.084 L
892.18 438.537 L
893.827 438.179 L
895.473 438.018 L
897.12 437.944 L
898.767 437.823 L
900.413 437.689 L
902.06 437.526 L
903.707 437.356 L
905.353 437.186 L
907 437.032 L
908.647 436.931 L
910.293 435.424 L
911.94 432.518 L
913.587 431.425 L
915.233 431.519 L
916.88 431.721 L
918.527 432.051 L
920.173 432.431 L
921.82 432.801 L
923.467 433.199 L
925.113 433.564 L
926.76 433.805 L
928.407 433.906 L
930.053 433.912 L
931.7 431.762 L
933.347 428.059 L
934.993 426.061 L
936.64 424.683 L
938.287 418.899 L
939.933 411.316 L
941.58 404.84 L
943.227 399.821 L
944.873 393.83 L
946.52 387.683 L
948.167 383.577 L
949.813 383.057 L
951.46 383.279 L
953.107 384.109 L
954.753 388.282 L
956.4 391.82 L
958.047 387.888 L
959.693 378.764 L
961.34 372.746 L
962.987 374.197 L
964.633 382.499 L
966.28 388.189 L
967.927 388.921 L
969.573 391.303 L
971.22 404.855 L
972.867 412.981 L
974.513 411.738 L
976.16 409.914 L
977.807 409.881 L
979.453 415.282 L
981.1 419.326 L
982.747 418.217 L
984.393 417.215 L
986.04 416.369 L
987.687 415.732 L
989.333 415.315 L
990.98 415.117 L
992.627 396.383 L
994.273 391.491 L
995.92 412.01 L
997.567 433.025 L
999.213 433.304 L
1000.86 433.571 L
1002.507 433.838 L
1004.153 434.072 L
1005.8 434.383 L
1007.447 434.733 L
1009.093 435.063 L
1010.74 435.365 L
1012.387 435.654 L
1014.033 435.951 L
1015.68 436.293 L
1017.327 436.625 L
1018.973 436.94 L
1020.62 437.268 L
1022.267 437.637 L
1023.913 438.002 L
1025.56 438.29 L
1027.207 438.656 L
1028.853 439.087 L
1030.5 439.482 L
1032.147 439.871 L
1033.793 440.13 L
1035.44 439.592 L
1037.087 438.871 L
1038.733 438.57 L
1040.38 438.249 L
1042.027 437.926 L
1043.673 437.551 L
1045.32 437.12 L
1046.967 436.608 L
1048.613 435.284 L
1050.26 430.09 L
1051.907 426.628 L
1053.553 426.485 L
1055.2 426.489 L
1056.847 426.605 L
1058.493 426.22 L
1060.14 425.636 L
1061.787 425.896 L
1063.433 426.671 L
1065.08 427.363 L
1066.727 427.658 L
1068.373 427.778 L
1070.02 428.16 L
1071.667 426.909 L
1073.313 420.631 L
1074.96 410.412 L
1076.607 400.566 L
1078.253 389.361 L
1079.9 383.198 L
1081.547 380.934 L
1083.193 379.949 L
1084.84 379.661 L
1086.487 379.634 L
1088.133 379.927 L
1089.78 380.025 L
1091.427 373.11 L
1093.073 365.98 L
1094.72 366.595 L
1096.367 377.009 L
1098.013 390.383 L
1099.66 387.328 L
1101.307 393.976 L
1102.953 405.338 L
1104.6 408.007 L
1106.247 409.755 L
1107.893 410.657 L
1109.54 411.751 L
1111.187 412.769 L
1112.833 414.154 L
1114.48 421.451 L
1116.127 431.543 L
1117.773 433.043 L
1119.42 434.178 L
1121.067 435.578 L
1122.713 437.226 L
1124.36 439.093 L
1126.007 441.205 L
1127.653 443.601 L
1129.3 446.098 L
1130.947 415.556 L
1132.593 413.344 L
1134.24 461.4 L
1135.887 471.264 L
1137.533 472.104 L
1139.18 473.166 L
1140.827 474.314 L
1142.473 475.283 L
1144.12 475.862 L
1145.767 476.877 L
1147.413 478.252 L
1149.06 479.181 L
1150.707 479.871 L
1152.353 481.062 L
1154 482.584 L
S
GR
GS
[0.5 0 0 0.5 0 0] CT
1 GC
N
1138 137 M
1138 61 L
848 61 L
848 137 L
cp
f
GR
GS
[0.5 0 0 0.5 459 41.5] CT
N
/f-990293328{2.797 -0.266 M
2.797 -0.391 2.828 -0.469 QT
4.719 -6.641 L
3.094 -6.641 L
2.438 -6.641 1.867 -6.227 QT
1.297 -5.813 0.922 -5.188 QT
0.875 -5.109 0.813 -5.109 QT
0.594 -5.109 L
0.438 -5.109 0.438 -5.297 QT
0.438 -5.328 0.469 -5.391 QT
1.063 -6.406 1.734 -7.086 QT
2.406 -7.766 3.25 -7.766 QT
8.766 -7.766 L
8.953 -7.766 9.086 -7.633 QT
9.219 -7.5 9.219 -7.297 QT
9.219 -7.047 9.031 -6.844 QT
8.844 -6.641 8.563 -6.641 QT
5.313 -6.641 L
4.109 -0.438 L
4.031 -0.141 3.836 0.047 QT
3.641 0.234 3.344 0.234 QT
3.125 0.234 2.961 0.094 QT
2.797 -0.047 2.797 -0.266 QT
cp}def
f-990293328
f
GR
GS
[0.5 0 0 0.5 463 41.5] CT
/Helvetica 18 F
GS
[1 0 0 1 0 0] CT
0 0 moveto 
1 -1 scale
( = 0.125, ) t 
GR
GR
GS
[0.5 0 0 0.5 501 41.5] CT
N
/f-1732591168{0.969 0 M
0.828 0 0.828 -0.141 QT
0.828 -0.156 0.836 -0.164 QT
0.844 -0.172 0.844 -0.203 QT
7.047 -12.688 L
7.125 -12.891 7.359 -12.891 QT
7.609 -12.891 L
7.859 -12.891 7.938 -12.688 QT
14.141 -0.203 L
14.141 -0.188 14.148 -0.172 QT
14.156 -0.156 14.156 -0.141 QT
14.156 0 14 0 QT
0.969 0 L
cp
2.156 -1.438 M
11.641 -1.438 L
6.906 -11 L
2.156 -1.438 L
cp}def
f-1732591168
f
GR
GS
[0.5 0 0 0.5 508.5 41.5] CT
/Helvetica 18 F
GS
[1 0 0 1 0 0] CT
0 0 moveto 
1 -1 scale
(x = 0.025) t 
GR
GR
GS
[0.5 0 0 0.5 0 0] CT
0.502 GC
[8 2 4 2] 0 setdash
2 LJ
2 LW
N
853.99 75.405 M
913.886 75.405 L
S
GR
GS
[0.5 0 0 0.5 459 53.5] CT
N
f-990293328
f
GR
GS
[0.5 0 0 0.5 463 53.5] CT
/Helvetica 18 F
GS
[1 0 0 1 0 0] CT
0 0 moveto 
1 -1 scale
( = 0.0125, ) t 
GR
GR
GS
[0.5 0 0 0.5 506 53.5] CT
N
f-1732591168
f
GR
GS
[0.5 0 0 0.5 513.5 53.5] CT
/Helvetica 18 F
GS
[1 0 0 1 0 0] CT
0 0 moveto 
1 -1 scale
(x = 0.0025) t 
GR
GR
GS
[0.5 0 0 0.5 0 0] CT
[8 2 4 2] 0 setdash
2 LJ
2 LW
N
853.99 99 M
913.886 99 L
S
GR
GS
[0.5 0 0 0.5 459 65.5] CT
N
f-990293328
f
GR
GS
[0.5 0 0 0.5 463 65.5] CT
/Helvetica 18 F
GS
[1 0 0 1 0 0] CT
0 0 moveto 
1 -1 scale
( = 0.00125, ) t 
GR
GR
GS
[0.5 0 0 0.5 511 65.5] CT
N
f-1732591168
f
GR
GS
[0.5 0 0 0.5 518.5 65.5] CT
/Helvetica 18 F
GS
[1 0 0 1 0 0] CT
0 0 moveto 
1 -1 scale
(x = 0.00025) t 
GR
GR
GS
[0.5 0 0 0.5 0 0] CT
1 LJ
3 LW
N
853.99 122.595 M
913.886 122.595 L
S
GR
GS
[0.5 0 0 0.5 0 0] CT
0.149 GC
10.0 ML
N
848 137 M
848 61 L
1138 61 L
1138 137 L
cp
S
GR
%%Trailer
%%Pages: 1
%%EOF
