%YAML 1.1
%TAG !u! tag:unity3d.com,2011:
--- !u!29 &1
OcclusionCullingSettings:
  m_ObjectHideFlags: 0
  serializedVersion: 2
  m_OcclusionBakeSettings:
    smallestOccluder: 5
    smallestHole: 0.25
    backfaceThreshold: 100
  m_SceneGUID: 00000000000000000000000000000000
  m_OcclusionCullingData: {fileID: 0}
--- !u!104 &2
RenderSettings:
  m_ObjectHideFlags: 0
  serializedVersion: 9
  m_Fog: 0
  m_FogColor: {r: 0.5, g: 0.5, b: 0.5, a: 1}
  m_FogMode: 3
  m_FogDensity: 0.01
  m_LinearFogStart: 0
  m_LinearFogEnd: 300
  m_AmbientSkyColor: {r: 0.212, g: 0.227, b: 0.259, a: 1}
  m_AmbientEquatorColor: {r: 0.114, g: 0.125, b: 0.133, a: 1}
  m_AmbientGroundColor: {r: 0.047, g: 0.043, b: 0.035, a: 1}
  m_AmbientIntensity: 1
  m_AmbientMode: 0
  m_SubtractiveShadowColor: {r: 0.42, g: 0.478, b: 0.627, a: 1}
  m_SkyboxMaterial: {fileID: 2100000, guid: 67950864b84c5db4f9eee7ca51c85571, type: 2}
  m_HaloStrength: 0.5
  m_FlareStrength: 1
  m_FlareFadeSpeed: 3
  m_HaloTexture: {fileID: 0}
  m_SpotCookie: {fileID: 10001, guid: 0000000000000000e000000000000000, type: 0}
  m_DefaultReflectionMode: 0
  m_DefaultReflectionResolution: 128
  m_ReflectionBounces: 1
  m_ReflectionIntensity: 1
  m_CustomReflection: {fileID: 0}
  m_Sun: {fileID: 0}
  m_IndirectSpecularColor: {r: 0, g: 0, b: 0, a: 1}
  m_UseRadianceAmbientProbe: 0
--- !u!157 &3
LightmapSettings:
  m_ObjectHideFlags: 0
  serializedVersion: 11
  m_GIWorkflowMode: 1
  m_GISettings:
    serializedVersion: 2
    m_BounceScale: 1
    m_IndirectOutputScale: 1
    m_AlbedoBoost: 1
    m_EnvironmentLightingMode: 0
    m_EnableBakedLightmaps: 1
    m_EnableRealtimeLightmaps: 0
  m_LightmapEditorSettings:
    serializedVersion: 12
    m_Resolution: 2
    m_BakeResolution: 40
    m_AtlasSize: 1024
    m_AO: 0
    m_AOMaxDistance: 1
    m_CompAOExponent: 1
    m_CompAOExponentDirect: 0
    m_ExtractAmbientOcclusion: 0
    m_Padding: 2
    m_LightmapParameters: {fileID: 0}
    m_LightmapsBakeMode: 1
    m_TextureCompression: 1
    m_FinalGather: 0
    m_FinalGatherFiltering: 1
    m_FinalGatherRayCount: 256
    m_ReflectionCompression: 2
    m_MixedBakeMode: 2
    m_BakeBackend: 1
    m_PVRSampling: 1
    m_PVRDirectSampleCount: 32
    m_PVRSampleCount: 512
    m_PVRBounces: 2
    m_PVREnvironmentSampleCount: 256
    m_PVREnvironmentReferencePointCount: 2048
    m_PVRFilteringMode: 1
    m_PVRDenoiserTypeDirect: 1
    m_PVRDenoiserTypeIndirect: 1
    m_PVRDenoiserTypeAO: 1
    m_PVRFilterTypeDirect: 0
    m_PVRFilterTypeIndirect: 0
    m_PVRFilterTypeAO: 0
    m_PVREnvironmentMIS: 1
    m_PVRCulling: 1
    m_PVRFilteringGaussRadiusDirect: 1
    m_PVRFilteringGaussRadiusIndirect: 5
    m_PVRFilteringGaussRadiusAO: 2
    m_PVRFilteringAtrousPositionSigmaDirect: 0.5
    m_PVRFilteringAtrousPositionSigmaIndirect: 2
    m_PVRFilteringAtrousPositionSigmaAO: 1
    m_ExportTrainingData: 0
    m_TrainingDataDestination: TrainingData
    m_LightProbeSampleCountMultiplier: 4
  m_LightingDataAsset: {fileID: 0}
  m_UseShadowmask: 1
--- !u!196 &4
NavMeshSettings:
  serializedVersion: 2
  m_ObjectHideFlags: 0
  m_BuildSettings:
    serializedVersion: 2
    agentTypeID: 0
    agentRadius: 0.5
    agentHeight: 2
    agentSlope: 45
    agentClimb: 0.4
    ledgeDropHeight: 0
    maxJumpAcrossDistance: 0
    minRegionArea: 2
    manualCellSize: 0
    cellSize: 0.16666667
    manualTileSize: 0
    tileSize: 256
    accuratePlacement: 0
    debug:
      m_Flags: 0
  m_NavMeshData: {fileID: 0}
--- !u!1 &90304977
GameObject:
  m_ObjectHideFlags: 0
  m_CorrespondingSourceObject: {fileID: 0}
  m_PrefabInstance: {fileID: 0}
  m_PrefabAsset: {fileID: 0}
  serializedVersion: 6
  m_Component:
  - component: {fileID: 90304978}
  - component: {fileID: 90304980}
  - component: {fileID: 90304979}
  m_Layer: 5
  m_Name: Background
  m_TagString: Untagged
  m_Icon: {fileID: 0}
  m_NavMeshLayer: 0
  m_StaticEditorFlags: 0
  m_IsActive: 0
--- !u!224 &90304978
RectTransform:
  m_ObjectHideFlags: 0
  m_CorrespondingSourceObject: {fileID: 0}
  m_PrefabInstance: {fileID: 0}
  m_PrefabAsset: {fileID: 0}
  m_GameObject: {fileID: 90304977}
  m_LocalRotation: {x: 0, y: 0, z: 0, w: 1}
  m_LocalPosition: {x: 0, y: 0, z: 0}
  m_LocalScale: {x: 1, y: 1, z: 1}
  m_Children: []
  m_Father: {fileID: 1365891577}
  m_RootOrder: 0
  m_LocalEulerAnglesHint: {x: 0, y: 0, z: 0}
  m_AnchorMin: {x: 0, y: 1}
  m_AnchorMax: {x: 0, y: 1}
  m_AnchoredPosition: {x: 431.5, y: -328.6}
  m_SizeDelta: {x: 863.0869, y: 657.15955}
  m_Pivot: {x: 0.5, y: 0.5}
--- !u!114 &90304979
MonoBehaviour:
  m_ObjectHideFlags: 0
  m_CorrespondingSourceObject: {fileID: 0}
  m_PrefabInstance: {fileID: 0}
  m_PrefabAsset: {fileID: 0}
  m_GameObject: {fileID: 90304977}
  m_Enabled: 1
  m_EditorHideFlags: 0
  m_Script: {fileID: 11500000, guid: fe87c0e1cc204ed48ad3b37840f39efc, type: 3}
  m_Name: 
  m_EditorClassIdentifier: 
  m_Material: {fileID: 0}
  m_Color: {r: 1, g: 1, b: 1, a: 1}
  m_RaycastTarget: 1
  m_Maskable: 1
  m_OnCullStateChanged:
    m_PersistentCalls:
      m_Calls: []
  m_Sprite: {fileID: 21300000, guid: 85e56e05455d217409adf713b39432b8, type: 3}
  m_Type: 0
  m_PreserveAspect: 0
  m_FillCenter: 1
  m_FillMethod: 4
  m_FillAmount: 1
  m_FillClockwise: 1
  m_FillOrigin: 0
  m_UseSpriteMesh: 0
  m_PixelsPerUnitMultiplier: 1
--- !u!222 &90304980
CanvasRenderer:
  m_ObjectHideFlags: 0
  m_CorrespondingSourceObject: {fileID: 0}
  m_PrefabInstance: {fileID: 0}
  m_PrefabAsset: {fileID: 0}
  m_GameObject: {fileID: 90304977}
  m_CullTransparentMesh: 0
--- !u!224 &235818604 stripped
RectTransform:
  m_CorrespondingSourceObject: {fileID: 3538650825715037495, guid: b3575fb2f23ef9647b805f4f05da0aff,
    type: 3}
  m_PrefabInstance: {fileID: 3538650825615047515}
  m_PrefabAsset: {fileID: 0}
--- !u!1001 &300282328
PrefabInstance:
  m_ObjectHideFlags: 0
  serializedVersion: 2
  m_Modification:
    m_TransformParent: {fileID: 0}
    m_Modifications:
    - target: {fileID: 3042399875149857767, guid: 53ff7a5512d759348a9a0bdf4d95cf73,
        type: 3}
      propertyPath: m_Name
      value: SceneLoader
      objectReference: {fileID: 0}
    - target: {fileID: 3042399875149857767, guid: 53ff7a5512d759348a9a0bdf4d95cf73,
        type: 3}
      propertyPath: m_IsActive
      value: 1
      objectReference: {fileID: 0}
    - target: {fileID: 7251758569568044990, guid: 53ff7a5512d759348a9a0bdf4d95cf73,
        type: 3}
      propertyPath: m_RootOrder
      value: 0
      objectReference: {fileID: 0}
    - target: {fileID: 7251758569568044990, guid: 53ff7a5512d759348a9a0bdf4d95cf73,
        type: 3}
      propertyPath: m_LocalPosition.x
      value: 22.01
      objectReference: {fileID: 0}
    - target: {fileID: 7251758569568044990, guid: 53ff7a5512d759348a9a0bdf4d95cf73,
        type: 3}
      propertyPath: m_LocalPosition.y
      value: 0
      objectReference: {fileID: 0}
    - target: {fileID: 7251758569568044990, guid: 53ff7a5512d759348a9a0bdf4d95cf73,
        type: 3}
      propertyPath: m_LocalPosition.z
      value: -5.5
      objectReference: {fileID: 0}
    - target: {fileID: 7251758569568044990, guid: 53ff7a5512d759348a9a0bdf4d95cf73,
        type: 3}
      propertyPath: m_LocalRotation.w
      value: 1
      objectReference: {fileID: 0}
    - target: {fileID: 7251758569568044990, guid: 53ff7a5512d759348a9a0bdf4d95cf73,
        type: 3}
      propertyPath: m_LocalRotation.x
      value: 0
      objectReference: {fileID: 0}
    - target: {fileID: 7251758569568044990, guid: 53ff7a5512d759348a9a0bdf4d95cf73,
        type: 3}
      propertyPath: m_LocalRotation.y
      value: 0
      objectReference: {fileID: 0}
    - target: {fileID: 7251758569568044990, guid: 53ff7a5512d759348a9a0bdf4d95cf73,
        type: 3}
      propertyPath: m_LocalRotation.z
      value: 0
      objectReference: {fileID: 0}
    - target: {fileID: 7251758569568044990, guid: 53ff7a5512d759348a9a0bdf4d95cf73,
        type: 3}
      propertyPath: m_LocalEulerAnglesHint.x
      value: 0
      objectReference: {fileID: 0}
    - target: {fileID: 7251758569568044990, guid: 53ff7a5512d759348a9a0bdf4d95cf73,
        type: 3}
      propertyPath: m_LocalEulerAnglesHint.y
      value: 0
      objectReference: {fileID: 0}
    - target: {fileID: 7251758569568044990, guid: 53ff7a5512d759348a9a0bdf4d95cf73,
        type: 3}
      propertyPath: m_LocalEulerAnglesHint.z
      value: 0
      objectReference: {fileID: 0}
    m_RemovedComponents: []
  m_SourcePrefab: {fileID: 100100000, guid: 53ff7a5512d759348a9a0bdf4d95cf73, type: 3}
--- !u!1001 &378074484
PrefabInstance:
  m_ObjectHideFlags: 0
  serializedVersion: 2
  m_Modification:
    m_TransformParent: {fileID: 1410992992}
    m_Modifications:
    - target: {fileID: 833856525646720688, guid: 38040cf165ff1994c9ea2c018b6538e5,
        type: 3}
      propertyPath: m_OnClick.m_PersistentCalls.m_Calls.Array.size
      value: 1
      objectReference: {fileID: 0}
    - target: {fileID: 833856525646720688, guid: 38040cf165ff1994c9ea2c018b6538e5,
        type: 3}
      propertyPath: m_OnClick.m_PersistentCalls.m_Calls.Array.data[0].m_Mode
      value: 1
      objectReference: {fileID: 0}
    - target: {fileID: 833856525646720688, guid: 38040cf165ff1994c9ea2c018b6538e5,
        type: 3}
      propertyPath: m_OnClick.m_PersistentCalls.m_Calls.Array.data[0].m_Target
      value: 
      objectReference: {fileID: 1365891578}
    - target: {fileID: 833856525646720688, guid: 38040cf165ff1994c9ea2c018b6538e5,
        type: 3}
      propertyPath: m_OnClick.m_PersistentCalls.m_Calls.Array.data[0].m_CallState
      value: 2
      objectReference: {fileID: 0}
    - target: {fileID: 833856525646720688, guid: 38040cf165ff1994c9ea2c018b6538e5,
        type: 3}
      propertyPath: m_OnClick.m_PersistentCalls.m_Calls.Array.data[0].m_MethodName
      value: OnExitBtnClick
      objectReference: {fileID: 0}
    - target: {fileID: 833856525646720688, guid: 38040cf165ff1994c9ea2c018b6538e5,
        type: 3}
      propertyPath: m_OnClick.m_PersistentCalls.m_Calls.Array.data[0].m_Arguments.m_ObjectArgumentAssemblyTypeName
      value: UnityEngine.Object, UnityEngine
      objectReference: {fileID: 0}
    - target: {fileID: 833856525646720689, guid: 38040cf165ff1994c9ea2c018b6538e5,
        type: 3}
      propertyPath: m_Pivot.x
      value: 0.5
      objectReference: {fileID: 0}
    - target: {fileID: 833856525646720689, guid: 38040cf165ff1994c9ea2c018b6538e5,
        type: 3}
      propertyPath: m_Pivot.y
      value: 0.5
      objectReference: {fileID: 0}
    - target: {fileID: 833856525646720689, guid: 38040cf165ff1994c9ea2c018b6538e5,
        type: 3}
      propertyPath: m_RootOrder
      value: 2
      objectReference: {fileID: 0}
    - target: {fileID: 833856525646720689, guid: 38040cf165ff1994c9ea2c018b6538e5,
        type: 3}
      propertyPath: m_AnchorMax.x
      value: 0.5
      objectReference: {fileID: 0}
    - target: {fileID: 833856525646720689, guid: 38040cf165ff1994c9ea2c018b6538e5,
        type: 3}
      propertyPath: m_AnchorMax.y
      value: 0.5
      objectReference: {fileID: 0}
    - target: {fileID: 833856525646720689, guid: 38040cf165ff1994c9ea2c018b6538e5,
        type: 3}
      propertyPath: m_AnchorMin.x
      value: 0.5
      objectReference: {fileID: 0}
    - target: {fileID: 833856525646720689, guid: 38040cf165ff1994c9ea2c018b6538e5,
        type: 3}
      propertyPath: m_AnchorMin.y
      value: 0.5
      objectReference: {fileID: 0}
    - target: {fileID: 833856525646720689, guid: 38040cf165ff1994c9ea2c018b6538e5,
        type: 3}
      propertyPath: m_SizeDelta.x
      value: 183.9025
      objectReference: {fileID: 0}
    - target: {fileID: 833856525646720689, guid: 38040cf165ff1994c9ea2c018b6538e5,
        type: 3}
      propertyPath: m_SizeDelta.y
      value: 39.385025
      objectReference: {fileID: 0}
    - target: {fileID: 833856525646720689, guid: 38040cf165ff1994c9ea2c018b6538e5,
        type: 3}
      propertyPath: m_LocalPosition.x
      value: 0
      objectReference: {fileID: 0}
    - target: {fileID: 833856525646720689, guid: 38040cf165ff1994c9ea2c018b6538e5,
        type: 3}
      propertyPath: m_LocalPosition.y
      value: 0
      objectReference: {fileID: 0}
    - target: {fileID: 833856525646720689, guid: 38040cf165ff1994c9ea2c018b6538e5,
        type: 3}
      propertyPath: m_LocalPosition.z
      value: 0
      objectReference: {fileID: 0}
    - target: {fileID: 833856525646720689, guid: 38040cf165ff1994c9ea2c018b6538e5,
        type: 3}
      propertyPath: m_LocalRotation.w
      value: 1
      objectReference: {fileID: 0}
    - target: {fileID: 833856525646720689, guid: 38040cf165ff1994c9ea2c018b6538e5,
        type: 3}
      propertyPath: m_LocalRotation.x
      value: 0
      objectReference: {fileID: 0}
    - target: {fileID: 833856525646720689, guid: 38040cf165ff1994c9ea2c018b6538e5,
        type: 3}
      propertyPath: m_LocalRotation.y
      value: 0
      objectReference: {fileID: 0}
    - target: {fileID: 833856525646720689, guid: 38040cf165ff1994c9ea2c018b6538e5,
        type: 3}
      propertyPath: m_LocalRotation.z
      value: 0
      objectReference: {fileID: 0}
    - target: {fileID: 833856525646720689, guid: 38040cf165ff1994c9ea2c018b6538e5,
        type: 3}
      propertyPath: m_AnchoredPosition.x
      value: 0
      objectReference: {fileID: 0}
    - target: {fileID: 833856525646720689, guid: 38040cf165ff1994c9ea2c018b6538e5,
        type: 3}
      propertyPath: m_AnchoredPosition.y
      value: -96
      objectReference: {fileID: 0}
    - target: {fileID: 833856525646720689, guid: 38040cf165ff1994c9ea2c018b6538e5,
        type: 3}
      propertyPath: m_LocalEulerAnglesHint.x
      value: 0
      objectReference: {fileID: 0}
    - target: {fileID: 833856525646720689, guid: 38040cf165ff1994c9ea2c018b6538e5,
        type: 3}
      propertyPath: m_LocalEulerAnglesHint.y
      value: 0
      objectReference: {fileID: 0}
    - target: {fileID: 833856525646720689, guid: 38040cf165ff1994c9ea2c018b6538e5,
        type: 3}
      propertyPath: m_LocalEulerAnglesHint.z
      value: 0
      objectReference: {fileID: 0}
    - target: {fileID: 833856525646720690, guid: 38040cf165ff1994c9ea2c018b6538e5,
        type: 3}
      propertyPath: m_Name
      value: ExitBtn
      objectReference: {fileID: 0}
    - target: {fileID: 833856527130056876, guid: 38040cf165ff1994c9ea2c018b6538e5,
        type: 3}
      propertyPath: m_Text
      value: Exit
      objectReference: {fileID: 0}
    - target: {fileID: 833856527130056876, guid: 38040cf165ff1994c9ea2c018b6538e5,
        type: 3}
      propertyPath: m_Color.b
      value: 0.9716981
      objectReference: {fileID: 0}
    - target: {fileID: 833856527130056876, guid: 38040cf165ff1994c9ea2c018b6538e5,
        type: 3}
      propertyPath: m_Color.g
      value: 0.9716981
      objectReference: {fileID: 0}
    - target: {fileID: 833856527130056876, guid: 38040cf165ff1994c9ea2c018b6538e5,
        type: 3}
      propertyPath: m_Color.r
      value: 0.9716981
      objectReference: {fileID: 0}
    m_RemovedComponents: []
  m_SourcePrefab: {fileID: 100100000, guid: 38040cf165ff1994c9ea2c018b6538e5, type: 3}
--- !u!1 &480382278
GameObject:
  m_ObjectHideFlags: 0
  m_CorrespondingSourceObject: {fileID: 0}
  m_PrefabInstance: {fileID: 0}
  m_PrefabAsset: {fileID: 0}
  serializedVersion: 6
  m_Component:
  - component: {fileID: 480382281}
  - component: {fileID: 480382280}
  - component: {fileID: 480382279}
  m_Layer: 0
  m_Name: Main Camera
  m_TagString: MainCamera
  m_Icon: {fileID: 0}
  m_NavMeshLayer: 0
  m_StaticEditorFlags: 0
  m_IsActive: 1
--- !u!81 &480382279
AudioListener:
  m_ObjectHideFlags: 0
  m_CorrespondingSourceObject: {fileID: 0}
  m_PrefabInstance: {fileID: 0}
  m_PrefabAsset: {fileID: 0}
  m_GameObject: {fileID: 480382278}
  m_Enabled: 1
--- !u!20 &480382280
Camera:
  m_ObjectHideFlags: 0
  m_CorrespondingSourceObject: {fileID: 0}
  m_PrefabInstance: {fileID: 0}
  m_PrefabAsset: {fileID: 0}
  m_GameObject: {fileID: 480382278}
  m_Enabled: 1
  serializedVersion: 2
  m_ClearFlags: 1
  m_BackGroundColor: {r: 0.19215687, g: 0.3019608, b: 0.4745098, a: 0}
  m_projectionMatrixMode: 1
  m_GateFitMode: 2
  m_FOVAxisMode: 0
  m_SensorSize: {x: 36, y: 24}
  m_LensShift: {x: 0, y: 0}
  m_FocalLength: 50
  m_NormalizedViewPortRect:
    serializedVersion: 2
    x: 0
    y: 0
    width: 1
    height: 1
  near clip plane: 0.3
  far clip plane: 1000
  field of view: 60
  orthographic: 0
  orthographic size: 5
  m_Depth: 1
  m_CullingMask:
    serializedVersion: 2
    m_Bits: 4294967295
  m_RenderingPath: -1
  m_TargetTexture: {fileID: 0}
  m_TargetDisplay: 0
  m_TargetEye: 3
  m_HDR: 1
  m_AllowMSAA: 1
  m_AllowDynamicResolution: 0
  m_ForceIntoRT: 0
  m_OcclusionCulling: 1
  m_StereoConvergence: 10
  m_StereoSeparation: 0.022
--- !u!4 &480382281
Transform:
  m_ObjectHideFlags: 0
  m_CorrespondingSourceObject: {fileID: 0}
  m_PrefabInstance: {fileID: 0}
  m_PrefabAsset: {fileID: 0}
  m_GameObject: {fileID: 480382278}
  m_LocalRotation: {x: -0.27650365, y: -0.44869047, z: -0.14825992, w: 0.8368044}
  m_LocalPosition: {x: 0, y: 0, z: 0}
  m_LocalScale: {x: 1, y: 1, z: 1}
  m_Children: []
  m_Father: {fileID: 0}
  m_RootOrder: 1
  m_LocalEulerAnglesHint: {x: -36.57, y: -56.4, z: 0}
--- !u!1001 &536533499
PrefabInstance:
  m_ObjectHideFlags: 0
  serializedVersion: 2
  m_Modification:
    m_TransformParent: {fileID: 1410992992}
    m_Modifications:
    - target: {fileID: 833856525646720688, guid: 38040cf165ff1994c9ea2c018b6538e5,
        type: 3}
      propertyPath: m_OnClick.m_PersistentCalls.m_Calls.Array.size
      value: 1
      objectReference: {fileID: 0}
    - target: {fileID: 833856525646720688, guid: 38040cf165ff1994c9ea2c018b6538e5,
        type: 3}
      propertyPath: m_OnClick.m_PersistentCalls.m_Calls.Array.data[0].m_Mode
      value: 1
      objectReference: {fileID: 0}
    - target: {fileID: 833856525646720688, guid: 38040cf165ff1994c9ea2c018b6538e5,
        type: 3}
      propertyPath: m_OnClick.m_PersistentCalls.m_Calls.Array.data[0].m_Target
      value: 
      objectReference: {fileID: 1365891578}
    - target: {fileID: 833856525646720688, guid: 38040cf165ff1994c9ea2c018b6538e5,
        type: 3}
      propertyPath: m_OnClick.m_PersistentCalls.m_Calls.Array.data[0].m_CallState
      value: 2
      objectReference: {fileID: 0}
    - target: {fileID: 833856525646720688, guid: 38040cf165ff1994c9ea2c018b6538e5,
        type: 3}
      propertyPath: m_OnClick.m_PersistentCalls.m_Calls.Array.data[0].m_MethodName
      value: OnHighscoresBtnClick
      objectReference: {fileID: 0}
    - target: {fileID: 833856525646720688, guid: 38040cf165ff1994c9ea2c018b6538e5,
        type: 3}
      propertyPath: m_OnClick.m_PersistentCalls.m_Calls.Array.data[0].m_Arguments.m_ObjectArgumentAssemblyTypeName
      value: UnityEngine.Object, UnityEngine
      objectReference: {fileID: 0}
    - target: {fileID: 833856525646720689, guid: 38040cf165ff1994c9ea2c018b6538e5,
        type: 3}
      propertyPath: m_Pivot.x
      value: 0.5
      objectReference: {fileID: 0}
    - target: {fileID: 833856525646720689, guid: 38040cf165ff1994c9ea2c018b6538e5,
        type: 3}
      propertyPath: m_Pivot.y
      value: 0.5
      objectReference: {fileID: 0}
    - target: {fileID: 833856525646720689, guid: 38040cf165ff1994c9ea2c018b6538e5,
        type: 3}
      propertyPath: m_RootOrder
      value: 1
      objectReference: {fileID: 0}
    - target: {fileID: 833856525646720689, guid: 38040cf165ff1994c9ea2c018b6538e5,
        type: 3}
      propertyPath: m_AnchorMax.x
      value: 0.5
      objectReference: {fileID: 0}
    - target: {fileID: 833856525646720689, guid: 38040cf165ff1994c9ea2c018b6538e5,
        type: 3}
      propertyPath: m_AnchorMax.y
      value: 0.5
      objectReference: {fileID: 0}
    - target: {fileID: 833856525646720689, guid: 38040cf165ff1994c9ea2c018b6538e5,
        type: 3}
      propertyPath: m_AnchorMin.x
      value: 0.5
      objectReference: {fileID: 0}
    - target: {fileID: 833856525646720689, guid: 38040cf165ff1994c9ea2c018b6538e5,
        type: 3}
      propertyPath: m_AnchorMin.y
      value: 0.5
      objectReference: {fileID: 0}
    - target: {fileID: 833856525646720689, guid: 38040cf165ff1994c9ea2c018b6538e5,
        type: 3}
      propertyPath: m_SizeDelta.x
      value: 183.9025
      objectReference: {fileID: 0}
    - target: {fileID: 833856525646720689, guid: 38040cf165ff1994c9ea2c018b6538e5,
        type: 3}
      propertyPath: m_SizeDelta.y
      value: 39.385025
      objectReference: {fileID: 0}
    - target: {fileID: 833856525646720689, guid: 38040cf165ff1994c9ea2c018b6538e5,
        type: 3}
      propertyPath: m_LocalPosition.x
      value: 0
      objectReference: {fileID: 0}
    - target: {fileID: 833856525646720689, guid: 38040cf165ff1994c9ea2c018b6538e5,
        type: 3}
      propertyPath: m_LocalPosition.y
      value: 0
      objectReference: {fileID: 0}
    - target: {fileID: 833856525646720689, guid: 38040cf165ff1994c9ea2c018b6538e5,
        type: 3}
      propertyPath: m_LocalPosition.z
      value: 0
      objectReference: {fileID: 0}
    - target: {fileID: 833856525646720689, guid: 38040cf165ff1994c9ea2c018b6538e5,
        type: 3}
      propertyPath: m_LocalRotation.w
      value: 1
      objectReference: {fileID: 0}
    - target: {fileID: 833856525646720689, guid: 38040cf165ff1994c9ea2c018b6538e5,
        type: 3}
      propertyPath: m_LocalRotation.x
      value: 0
      objectReference: {fileID: 0}
    - target: {fileID: 833856525646720689, guid: 38040cf165ff1994c9ea2c018b6538e5,
        type: 3}
      propertyPath: m_LocalRotation.y
      value: 0
      objectReference: {fileID: 0}
    - target: {fileID: 833856525646720689, guid: 38040cf165ff1994c9ea2c018b6538e5,
        type: 3}
      propertyPath: m_LocalRotation.z
      value: 0
      objectReference: {fileID: 0}
    - target: {fileID: 833856525646720689, guid: 38040cf165ff1994c9ea2c018b6538e5,
        type: 3}
      propertyPath: m_AnchoredPosition.x
      value: 0
      objectReference: {fileID: 0}
    - target: {fileID: 833856525646720689, guid: 38040cf165ff1994c9ea2c018b6538e5,
        type: 3}
      propertyPath: m_AnchoredPosition.y
      value: -31
      objectReference: {fileID: 0}
    - target: {fileID: 833856525646720689, guid: 38040cf165ff1994c9ea2c018b6538e5,
        type: 3}
      propertyPath: m_LocalEulerAnglesHint.x
      value: 0
      objectReference: {fileID: 0}
    - target: {fileID: 833856525646720689, guid: 38040cf165ff1994c9ea2c018b6538e5,
        type: 3}
      propertyPath: m_LocalEulerAnglesHint.y
      value: 0
      objectReference: {fileID: 0}
    - target: {fileID: 833856525646720689, guid: 38040cf165ff1994c9ea2c018b6538e5,
        type: 3}
      propertyPath: m_LocalEulerAnglesHint.z
      value: 0
      objectReference: {fileID: 0}
    - target: {fileID: 833856525646720690, guid: 38040cf165ff1994c9ea2c018b6538e5,
        type: 3}
      propertyPath: m_Name
      value: HighscoresBtn
      objectReference: {fileID: 0}
    - target: {fileID: 833856527130056876, guid: 38040cf165ff1994c9ea2c018b6538e5,
        type: 3}
      propertyPath: m_Text
      value: Highscores
      objectReference: {fileID: 0}
    - target: {fileID: 833856527130056876, guid: 38040cf165ff1994c9ea2c018b6538e5,
        type: 3}
      propertyPath: m_Color.b
      value: 0.9716981
      objectReference: {fileID: 0}
    - target: {fileID: 833856527130056876, guid: 38040cf165ff1994c9ea2c018b6538e5,
        type: 3}
      propertyPath: m_Color.g
      value: 0.9716981
      objectReference: {fileID: 0}
    - target: {fileID: 833856527130056876, guid: 38040cf165ff1994c9ea2c018b6538e5,
        type: 3}
      propertyPath: m_Color.r
      value: 0.9716981
      objectReference: {fileID: 0}
    m_RemovedComponents: []
  m_SourcePrefab: {fileID: 100100000, guid: 38040cf165ff1994c9ea2c018b6538e5, type: 3}
--- !u!224 &536533500 stripped
RectTransform:
  m_CorrespondingSourceObject: {fileID: 833856525646720689, guid: 38040cf165ff1994c9ea2c018b6538e5,
    type: 3}
  m_PrefabInstance: {fileID: 536533499}
  m_PrefabAsset: {fileID: 0}
--- !u!224 &957931035 stripped
RectTransform:
  m_CorrespondingSourceObject: {fileID: 833856525646720689, guid: 38040cf165ff1994c9ea2c018b6538e5,
    type: 3}
  m_PrefabInstance: {fileID: 2036036528}
  m_PrefabAsset: {fileID: 0}
--- !u!1 &1316635970
GameObject:
  m_ObjectHideFlags: 0
  m_CorrespondingSourceObject: {fileID: 0}
  m_PrefabInstance: {fileID: 0}
  m_PrefabAsset: {fileID: 0}
  serializedVersion: 6
  m_Component:
  - component: {fileID: 1316635972}
  - component: {fileID: 1316635971}
  m_Layer: 0
  m_Name: Directional Light
  m_TagString: Untagged
  m_Icon: {fileID: 0}
  m_NavMeshLayer: 0
  m_StaticEditorFlags: 0
  m_IsActive: 1
--- !u!108 &1316635971
Light:
  m_ObjectHideFlags: 0
  m_CorrespondingSourceObject: {fileID: 0}
  m_PrefabInstance: {fileID: 0}
  m_PrefabAsset: {fileID: 0}
  m_GameObject: {fileID: 1316635970}
  m_Enabled: 1
  serializedVersion: 10
  m_Type: 1
  m_Shape: 0
  m_Color: {r: 1, g: 0.95686275, b: 0.8392157, a: 1}
  m_Intensity: 1
  m_Range: 10
  m_SpotAngle: 30
  m_InnerSpotAngle: 21.80208
  m_CookieSize: 10
  m_Shadows:
    m_Type: 2
    m_Resolution: -1
    m_CustomResolution: -1
    m_Strength: 1
    m_Bias: 0.05
    m_NormalBias: 0.4
    m_NearPlane: 0.2
    m_CullingMatrixOverride:
      e00: 1
      e01: 0
      e02: 0
      e03: 0
      e10: 0
      e11: 1
      e12: 0
      e13: 0
      e20: 0
      e21: 0
      e22: 1
      e23: 0
      e30: 0
      e31: 0
      e32: 0
      e33: 1
    m_UseCullingMatrixOverride: 0
  m_Cookie: {fileID: 0}
  m_DrawHalo: 0
  m_Flare: {fileID: 0}
  m_RenderMode: 0
  m_CullingMask:
    serializedVersion: 2
    m_Bits: 4294967295
  m_RenderingLayerMask: 1
  m_Lightmapping: 4
  m_LightShadowCasterMode: 0
  m_AreaSize: {x: 1, y: 1}
  m_BounceIntensity: 1
  m_ColorTemperature: 6570
  m_UseColorTemperature: 0
  m_BoundingSphereOverride: {x: 0, y: 0, z: 0, w: 0}
  m_UseBoundingSphereOverride: 0
  m_ShadowRadius: 0
  m_ShadowAngle: 0
--- !u!4 &1316635972
Transform:
  m_ObjectHideFlags: 0
  m_CorrespondingSourceObject: {fileID: 0}
  m_PrefabInstance: {fileID: 0}
  m_PrefabAsset: {fileID: 0}
  m_GameObject: {fileID: 1316635970}
  m_LocalRotation: {x: 0.40821788, y: -0.23456968, z: 0.10938163, w: 0.8754261}
  m_LocalPosition: {x: 0, y: 17.62, z: 0}
  m_LocalScale: {x: 1, y: 1, z: 1}
  m_Children: []
  m_Father: {fileID: 0}
  m_RootOrder: 2
  m_LocalEulerAnglesHint: {x: 50, y: -30, z: 0}
--- !u!1 &1365891573
GameObject:
  m_ObjectHideFlags: 0
  m_CorrespondingSourceObject: {fileID: 0}
  m_PrefabInstance: {fileID: 0}
  m_PrefabAsset: {fileID: 0}
  serializedVersion: 6
  m_Component:
  - component: {fileID: 1365891577}
  - component: {fileID: 1365891578}
  - component: {fileID: 1365891576}
  - component: {fileID: 1365891575}
  - component: {fileID: 1365891574}
  m_Layer: 5
  m_Name: MenuCanvas
  m_TagString: Untagged
  m_Icon: {fileID: 0}
  m_NavMeshLayer: 0
  m_StaticEditorFlags: 0
  m_IsActive: 1
--- !u!114 &1365891574
MonoBehaviour:
  m_ObjectHideFlags: 0
  m_CorrespondingSourceObject: {fileID: 0}
  m_PrefabInstance: {fileID: 0}
  m_PrefabAsset: {fileID: 0}
  m_GameObject: {fileID: 1365891573}
  m_Enabled: 1
  m_EditorHideFlags: 0
  m_Script: {fileID: 11500000, guid: dc42784cf147c0c48a680349fa168899, type: 3}
  m_Name: 
  m_EditorClassIdentifier: 
  m_IgnoreReversedGraphics: 1
  m_BlockingObjects: 0
  m_BlockingMask:
    serializedVersion: 2
    m_Bits: 4294967295
--- !u!114 &1365891575
MonoBehaviour:
  m_ObjectHideFlags: 0
  m_CorrespondingSourceObject: {fileID: 0}
  m_PrefabInstance: {fileID: 0}
  m_PrefabAsset: {fileID: 0}
  m_GameObject: {fileID: 1365891573}
  m_Enabled: 1
  m_EditorHideFlags: 0
  m_Script: {fileID: 11500000, guid: 0cd44c1031e13a943bb63640046fad76, type: 3}
  m_Name: 
  m_EditorClassIdentifier: 
  m_UiScaleMode: 1
  m_ReferencePixelsPerUnit: 100
  m_ScaleFactor: 1
  m_ReferenceResolution: {x: 1024, y: 768}
  m_ScreenMatchMode: 0
  m_MatchWidthOrHeight: 0
  m_PhysicalUnit: 3
  m_FallbackScreenDPI: 96
  m_DefaultSpriteDPI: 96
  m_DynamicPixelsPerUnit: 1
--- !u!223 &1365891576
Canvas:
  m_ObjectHideFlags: 0
  m_CorrespondingSourceObject: {fileID: 0}
  m_PrefabInstance: {fileID: 0}
  m_PrefabAsset: {fileID: 0}
  m_GameObject: {fileID: 1365891573}
  m_Enabled: 1
  serializedVersion: 3
  m_RenderMode: 1
  m_Camera: {fileID: 480382280}
  m_PlaneDistance: 100
  m_PixelPerfect: 0
  m_ReceivesEvents: 1
  m_OverrideSorting: 0
  m_OverridePixelPerfect: 0
  m_SortingBucketNormalizedSize: 0
  m_AdditionalShaderChannelsFlag: 0
  m_SortingLayerID: 0
  m_SortingOrder: 0
  m_TargetDisplay: 0
--- !u!224 &1365891577
RectTransform:
  m_ObjectHideFlags: 0
  m_CorrespondingSourceObject: {fileID: 0}
  m_PrefabInstance: {fileID: 0}
  m_PrefabAsset: {fileID: 0}
  m_GameObject: {fileID: 1365891573}
  m_LocalRotation: {x: 0, y: 0, z: 0, w: 1}
  m_LocalPosition: {x: 0, y: 0, z: 0}
  m_LocalScale: {x: 0, y: 0, z: 0}
  m_Children:
  - {fileID: 90304978}
  - {fileID: 1410992992}
  - {fileID: 235818604}
  m_Father: {fileID: 0}
  m_RootOrder: 3
  m_LocalEulerAnglesHint: {x: 0, y: 0, z: 0}
  m_AnchorMin: {x: 0, y: 0}
  m_AnchorMax: {x: 0, y: 0}
  m_AnchoredPosition: {x: 0, y: 0}
  m_SizeDelta: {x: 0, y: 0}
  m_Pivot: {x: 0, y: 0}
--- !u!114 &1365891578
MonoBehaviour:
  m_ObjectHideFlags: 0
  m_CorrespondingSourceObject: {fileID: 0}
  m_PrefabInstance: {fileID: 0}
  m_PrefabAsset: {fileID: 0}
  m_GameObject: {fileID: 1365891573}
  m_Enabled: 1
  m_EditorHideFlags: 0
  m_Script: {fileID: 11500000, guid: acc95e4bf1c2c2247bf37316869bb06b, type: 3}
  m_Name: 
  m_EditorClassIdentifier: 
--- !u!1001 &1405211313
PrefabInstance:
  m_ObjectHideFlags: 0
  serializedVersion: 2
  m_Modification:
    m_TransformParent: {fileID: 0}
    m_Modifications:
    - target: {fileID: 7473935422806460460, guid: 3e1485b8bb16ef642aefdd700c8854ef,
        type: 3}
      propertyPath: m_RootOrder
      value: 5
      objectReference: {fileID: 0}
    - target: {fileID: 7473935422806460460, guid: 3e1485b8bb16ef642aefdd700c8854ef,
        type: 3}
      propertyPath: m_LocalPosition.x
      value: 0
      objectReference: {fileID: 0}
    - target: {fileID: 7473935422806460460, guid: 3e1485b8bb16ef642aefdd700c8854ef,
        type: 3}
      propertyPath: m_LocalPosition.y
      value: 0
      objectReference: {fileID: 0}
    - target: {fileID: 7473935422806460460, guid: 3e1485b8bb16ef642aefdd700c8854ef,
        type: 3}
      propertyPath: m_LocalPosition.z
      value: 0
      objectReference: {fileID: 0}
    - target: {fileID: 7473935422806460460, guid: 3e1485b8bb16ef642aefdd700c8854ef,
        type: 3}
      propertyPath: m_LocalRotation.w
      value: 1
      objectReference: {fileID: 0}
    - target: {fileID: 7473935422806460460, guid: 3e1485b8bb16ef642aefdd700c8854ef,
        type: 3}
      propertyPath: m_LocalRotation.x
      value: 0
      objectReference: {fileID: 0}
    - target: {fileID: 7473935422806460460, guid: 3e1485b8bb16ef642aefdd700c8854ef,
        type: 3}
      propertyPath: m_LocalRotation.y
      value: 0
      objectReference: {fileID: 0}
    - target: {fileID: 7473935422806460460, guid: 3e1485b8bb16ef642aefdd700c8854ef,
        type: 3}
      propertyPath: m_LocalRotation.z
      value: 0
      objectReference: {fileID: 0}
    - target: {fileID: 7473935422806460460, guid: 3e1485b8bb16ef642aefdd700c8854ef,
        type: 3}
      propertyPath: m_LocalEulerAnglesHint.x
      value: 0
      objectReference: {fileID: 0}
    - target: {fileID: 7473935422806460460, guid: 3e1485b8bb16ef642aefdd700c8854ef,
        type: 3}
      propertyPath: m_LocalEulerAnglesHint.y
      value: 0
      objectReference: {fileID: 0}
    - target: {fileID: 7473935422806460460, guid: 3e1485b8bb16ef642aefdd700c8854ef,
        type: 3}
      propertyPath: m_LocalEulerAnglesHint.z
      value: 0
      objectReference: {fileID: 0}
    - target: {fileID: 7592749846005288422, guid: 3e1485b8bb16ef642aefdd700c8854ef,
        type: 3}
      propertyPath: m_Name
      value: SoundManager
      objectReference: {fileID: 0}
    m_RemovedComponents: []
  m_SourcePrefab: {fileID: 100100000, guid: 3e1485b8bb16ef642aefdd700c8854ef, type: 3}
--- !u!1 &1410992991
GameObject:
  m_ObjectHideFlags: 0
  m_CorrespondingSourceObject: {fileID: 0}
  m_PrefabInstance: {fileID: 0}
  m_PrefabAsset: {fileID: 0}
  serializedVersion: 6
  m_Component:
  - component: {fileID: 1410992992}
  m_Layer: 5
  m_Name: Buttons
  m_TagString: Untagged
  m_Icon: {fileID: 0}
  m_NavMeshLayer: 0
  m_StaticEditorFlags: 0
  m_IsActive: 1
--- !u!224 &1410992992
RectTransform:
  m_ObjectHideFlags: 0
  m_CorrespondingSourceObject: {fileID: 0}
  m_PrefabInstance: {fileID: 0}
  m_PrefabAsset: {fileID: 0}
  m_GameObject: {fileID: 1410992991}
  m_LocalRotation: {x: 0, y: 0, z: 0, w: 1}
  m_LocalPosition: {x: 0, y: 0, z: 0}
  m_LocalScale: {x: 1, y: 1, z: 1}
  m_Children:
  - {fileID: 957931035}
  - {fileID: 536533500}
  - {fileID: 2025031383}
  m_Father: {fileID: 1365891577}
  m_RootOrder: 1
  m_LocalEulerAnglesHint: {x: 0, y: 0, z: 0}
  m_AnchorMin: {x: 0, y: 0}
  m_AnchorMax: {x: 1, y: 1}
  m_AnchoredPosition: {x: 0, y: 0}
  m_SizeDelta: {x: 0, y: 0}
  m_Pivot: {x: 0.5, y: 0.5}
--- !u!1 &1920161602
GameObject:
  m_ObjectHideFlags: 0
  m_CorrespondingSourceObject: {fileID: 0}
  m_PrefabInstance: {fileID: 0}
  m_PrefabAsset: {fileID: 0}
  serializedVersion: 6
  m_Component:
  - component: {fileID: 1920161605}
  - component: {fileID: 1920161604}
  - component: {fileID: 1920161603}
  m_Layer: 0
  m_Name: EventSystem
  m_TagString: Untagged
  m_Icon: {fileID: 0}
  m_NavMeshLayer: 0
  m_StaticEditorFlags: 0
  m_IsActive: 1
--- !u!114 &1920161603
MonoBehaviour:
  m_ObjectHideFlags: 0
  m_CorrespondingSourceObject: {fileID: 0}
  m_PrefabInstance: {fileID: 0}
  m_PrefabAsset: {fileID: 0}
  m_GameObject: {fileID: 1920161602}
  m_Enabled: 1
  m_EditorHideFlags: 0
  m_Script: {fileID: 11500000, guid: 4f231c4fb786f3946a6b90b886c48677, type: 3}
  m_Name: 
  m_EditorClassIdentifier: 
  m_HorizontalAxis: Horizontal
  m_VerticalAxis: Vertical
  m_SubmitButton: Submit
  m_CancelButton: Cancel
  m_InputActionsPerSecond: 10
  m_RepeatDelay: 0.5
  m_ForceModuleActive: 0
--- !u!114 &1920161604
MonoBehaviour:
  m_ObjectHideFlags: 0
  m_CorrespondingSourceObject: {fileID: 0}
  m_PrefabInstance: {fileID: 0}
  m_PrefabAsset: {fileID: 0}
  m_GameObject: {fileID: 1920161602}
  m_Enabled: 1
  m_EditorHideFlags: 0
  m_Script: {fileID: 11500000, guid: 76c392e42b5098c458856cdf6ecaaaa1, type: 3}
  m_Name: 
  m_EditorClassIdentifier: 
  m_FirstSelected: {fileID: 0}
  m_sendNavigationEvents: 1
  m_DragThreshold: 10
--- !u!4 &1920161605
Transform:
  m_ObjectHideFlags: 0
  m_CorrespondingSourceObject: {fileID: 0}
  m_PrefabInstance: {fileID: 0}
  m_PrefabAsset: {fileID: 0}
  m_GameObject: {fileID: 1920161602}
  m_LocalRotation: {x: 0, y: 0, z: 0, w: 1}
  m_LocalPosition: {x: 0, y: 0, z: 0}
  m_LocalScale: {x: 1, y: 1, z: 1}
  m_Children: []
  m_Father: {fileID: 0}
  m_RootOrder: 4
  m_LocalEulerAnglesHint: {x: 0, y: 0, z: 0}
--- !u!224 &2025031383 stripped
RectTransform:
  m_CorrespondingSourceObject: {fileID: 833856525646720689, guid: 38040cf165ff1994c9ea2c018b6538e5,
    type: 3}
  m_PrefabInstance: {fileID: 378074484}
  m_PrefabAsset: {fileID: 0}
--- !u!1001 &2036036528
PrefabInstance:
  m_ObjectHideFlags: 0
  serializedVersion: 2
  m_Modification:
    m_TransformParent: {fileID: 1410992992}
    m_Modifications:
    - target: {fileID: 833856525646720688, guid: 38040cf165ff1994c9ea2c018b6538e5,
        type: 3}
      propertyPath: m_OnClick.m_PersistentCalls.m_Calls.Array.size
      value: 1
      objectReference: {fileID: 0}
    - target: {fileID: 833856525646720688, guid: 38040cf165ff1994c9ea2c018b6538e5,
        type: 3}
      propertyPath: m_OnClick.m_PersistentCalls.m_Calls.Array.data[0].m_Mode
      value: 1
      objectReference: {fileID: 0}
    - target: {fileID: 833856525646720688, guid: 38040cf165ff1994c9ea2c018b6538e5,
        type: 3}
      propertyPath: m_OnClick.m_PersistentCalls.m_Calls.Array.data[0].m_Target
      value: 
      objectReference: {fileID: 1365891578}
    - target: {fileID: 833856525646720688, guid: 38040cf165ff1994c9ea2c018b6538e5,
        type: 3}
      propertyPath: m_OnClick.m_PersistentCalls.m_Calls.Array.data[0].m_CallState
      value: 2
      objectReference: {fileID: 0}
    - target: {fileID: 833856525646720688, guid: 38040cf165ff1994c9ea2c018b6538e5,
        type: 3}
      propertyPath: m_OnClick.m_PersistentCalls.m_Calls.Array.data[0].m_MethodName
      value: OnStartBtnClick
      objectReference: {fileID: 0}
    - target: {fileID: 833856525646720688, guid: 38040cf165ff1994c9ea2c018b6538e5,
        type: 3}
      propertyPath: m_OnClick.m_PersistentCalls.m_Calls.Array.data[0].m_Arguments.m_ObjectArgumentAssemblyTypeName
      value: UnityEngine.Object, UnityEngine
      objectReference: {fileID: 0}
    - target: {fileID: 833856525646720689, guid: 38040cf165ff1994c9ea2c018b6538e5,
        type: 3}
      propertyPath: m_Pivot.x
      value: 0.5
      objectReference: {fileID: 0}
    - target: {fileID: 833856525646720689, guid: 38040cf165ff1994c9ea2c018b6538e5,
        type: 3}
      propertyPath: m_Pivot.y
      value: 0.5
      objectReference: {fileID: 0}
    - target: {fileID: 833856525646720689, guid: 38040cf165ff1994c9ea2c018b6538e5,
        type: 3}
      propertyPath: m_RootOrder
      value: 0
      objectReference: {fileID: 0}
    - target: {fileID: 833856525646720689, guid: 38040cf165ff1994c9ea2c018b6538e5,
        type: 3}
      propertyPath: m_AnchorMax.x
      value: 0.5
      objectReference: {fileID: 0}
    - target: {fileID: 833856525646720689, guid: 38040cf165ff1994c9ea2c018b6538e5,
        type: 3}
      propertyPath: m_AnchorMax.y
      value: 0.5
      objectReference: {fileID: 0}
    - target: {fileID: 833856525646720689, guid: 38040cf165ff1994c9ea2c018b6538e5,
        type: 3}
      propertyPath: m_AnchorMin.x
      value: 0.5
      objectReference: {fileID: 0}
    - target: {fileID: 833856525646720689, guid: 38040cf165ff1994c9ea2c018b6538e5,
        type: 3}
      propertyPath: m_AnchorMin.y
      value: 0.5
      objectReference: {fileID: 0}
    - target: {fileID: 833856525646720689, guid: 38040cf165ff1994c9ea2c018b6538e5,
        type: 3}
      propertyPath: m_SizeDelta.x
      value: 183.9025
      objectReference: {fileID: 0}
    - target: {fileID: 833856525646720689, guid: 38040cf165ff1994c9ea2c018b6538e5,
        type: 3}
      propertyPath: m_SizeDelta.y
      value: 39.385025
      objectReference: {fileID: 0}
    - target: {fileID: 833856525646720689, guid: 38040cf165ff1994c9ea2c018b6538e5,
        type: 3}
      propertyPath: m_LocalPosition.x
      value: 0
      objectReference: {fileID: 0}
    - target: {fileID: 833856525646720689, guid: 38040cf165ff1994c9ea2c018b6538e5,
        type: 3}
      propertyPath: m_LocalPosition.y
      value: 0
      objectReference: {fileID: 0}
    - target: {fileID: 833856525646720689, guid: 38040cf165ff1994c9ea2c018b6538e5,
        type: 3}
      propertyPath: m_LocalPosition.z
      value: 0
      objectReference: {fileID: 0}
    - target: {fileID: 833856525646720689, guid: 38040cf165ff1994c9ea2c018b6538e5,
        type: 3}
      propertyPath: m_LocalRotation.w
      value: 1
      objectReference: {fileID: 0}
    - target: {fileID: 833856525646720689, guid: 38040cf165ff1994c9ea2c018b6538e5,
        type: 3}
      propertyPath: m_LocalRotation.x
      value: 0
      objectReference: {fileID: 0}
    - target: {fileID: 833856525646720689, guid: 38040cf165ff1994c9ea2c018b6538e5,
        type: 3}
      propertyPath: m_LocalRotation.y
      value: 0
      objectReference: {fileID: 0}
    - target: {fileID: 833856525646720689, guid: 38040cf165ff1994c9ea2c018b6538e5,
        type: 3}
      propertyPath: m_LocalRotation.z
      value: 0
      objectReference: {fileID: 0}
    - target: {fileID: 833856525646720689, guid: 38040cf165ff1994c9ea2c018b6538e5,
        type: 3}
      propertyPath: m_AnchoredPosition.x
      value: 0
      objectReference: {fileID: 0}
    - target: {fileID: 833856525646720689, guid: 38040cf165ff1994c9ea2c018b6538e5,
        type: 3}
      propertyPath: m_AnchoredPosition.y
      value: 30.307
      objectReference: {fileID: 0}
    - target: {fileID: 833856525646720689, guid: 38040cf165ff1994c9ea2c018b6538e5,
        type: 3}
      propertyPath: m_LocalEulerAnglesHint.x
      value: 0
      objectReference: {fileID: 0}
    - target: {fileID: 833856525646720689, guid: 38040cf165ff1994c9ea2c018b6538e5,
        type: 3}
      propertyPath: m_LocalEulerAnglesHint.y
      value: 0
      objectReference: {fileID: 0}
    - target: {fileID: 833856525646720689, guid: 38040cf165ff1994c9ea2c018b6538e5,
        type: 3}
      propertyPath: m_LocalEulerAnglesHint.z
      value: 0
      objectReference: {fileID: 0}
    - target: {fileID: 833856525646720690, guid: 38040cf165ff1994c9ea2c018b6538e5,
        type: 3}
      propertyPath: m_Name
      value: StartBtn
      objectReference: {fileID: 0}
    - target: {fileID: 833856527130056876, guid: 38040cf165ff1994c9ea2c018b6538e5,
        type: 3}
      propertyPath: m_Text
      value: Start
      objectReference: {fileID: 0}
    - target: {fileID: 833856527130056876, guid: 38040cf165ff1994c9ea2c018b6538e5,
        type: 3}
      propertyPath: m_Color.b
      value: 0.9716981
      objectReference: {fileID: 0}
    - target: {fileID: 833856527130056876, guid: 38040cf165ff1994c9ea2c018b6538e5,
        type: 3}
      propertyPath: m_Color.g
      value: 0.9716981
      objectReference: {fileID: 0}
    - target: {fileID: 833856527130056876, guid: 38040cf165ff1994c9ea2c018b6538e5,
        type: 3}
      propertyPath: m_Color.r
      value: 0.9716981
      objectReference: {fileID: 0}
    m_RemovedComponents: []
  m_SourcePrefab: {fileID: 100100000, guid: 38040cf165ff1994c9ea2c018b6538e5, type: 3}
--- !u!1001 &3538650825615047515
PrefabInstance:
  m_ObjectHideFlags: 0
  serializedVersion: 2
  m_Modification:
    m_TransformParent: {fileID: 1365891577}
    m_Modifications:
    - target: {fileID: 3538650825715037491, guid: b3575fb2f23ef9647b805f4f05da0aff,
        type: 3}
      propertyPath: m_Name
      value: MuteButton
      objectReference: {fileID: 0}
    - target: {fileID: 3538650825715037495, guid: b3575fb2f23ef9647b805f4f05da0aff,
        type: 3}
      propertyPath: m_Pivot.x
      value: 0.5
      objectReference: {fileID: 0}
    - target: {fileID: 3538650825715037495, guid: b3575fb2f23ef9647b805f4f05da0aff,
        type: 3}
      propertyPath: m_Pivot.y
      value: 0.5
      objectReference: {fileID: 0}
    - target: {fileID: 3538650825715037495, guid: b3575fb2f23ef9647b805f4f05da0aff,
        type: 3}
      propertyPath: m_RootOrder
      value: 2
      objectReference: {fileID: 0}
    - target: {fileID: 3538650825715037495, guid: b3575fb2f23ef9647b805f4f05da0aff,
        type: 3}
      propertyPath: m_AnchorMax.x
      value: 0
      objectReference: {fileID: 0}
    - target: {fileID: 3538650825715037495, guid: b3575fb2f23ef9647b805f4f05da0aff,
        type: 3}
      propertyPath: m_AnchorMax.y
      value: 1
      objectReference: {fileID: 0}
    - target: {fileID: 3538650825715037495, guid: b3575fb2f23ef9647b805f4f05da0aff,
        type: 3}
      propertyPath: m_AnchorMin.x
      value: 0
      objectReference: {fileID: 0}
    - target: {fileID: 3538650825715037495, guid: b3575fb2f23ef9647b805f4f05da0aff,
        type: 3}
      propertyPath: m_AnchorMin.y
      value: 1
      objectReference: {fileID: 0}
    - target: {fileID: 3538650825715037495, guid: b3575fb2f23ef9647b805f4f05da0aff,
        type: 3}
      propertyPath: m_SizeDelta.x
      value: 39.862534
      objectReference: {fileID: 0}
    - target: {fileID: 3538650825715037495, guid: b3575fb2f23ef9647b805f4f05da0aff,
        type: 3}
      propertyPath: m_SizeDelta.y
      value: 39.862534
      objectReference: {fileID: 0}
    - target: {fileID: 3538650825715037495, guid: b3575fb2f23ef9647b805f4f05da0aff,
        type: 3}
      propertyPath: m_LocalPosition.x
      value: 0
      objectReference: {fileID: 0}
    - target: {fileID: 3538650825715037495, guid: b3575fb2f23ef9647b805f4f05da0aff,
        type: 3}
      propertyPath: m_LocalPosition.y
      value: 0
      objectReference: {fileID: 0}
    - target: {fileID: 3538650825715037495, guid: b3575fb2f23ef9647b805f4f05da0aff,
        type: 3}
      propertyPath: m_LocalPosition.z
      value: 0
      objectReference: {fileID: 0}
    - target: {fileID: 3538650825715037495, guid: b3575fb2f23ef9647b805f4f05da0aff,
        type: 3}
      propertyPath: m_LocalRotation.w
      value: 1
      objectReference: {fileID: 0}
    - target: {fileID: 3538650825715037495, guid: b3575fb2f23ef9647b805f4f05da0aff,
        type: 3}
      propertyPath: m_LocalRotation.x
      value: 0
      objectReference: {fileID: 0}
    - target: {fileID: 3538650825715037495, guid: b3575fb2f23ef9647b805f4f05da0aff,
        type: 3}
      propertyPath: m_LocalRotation.y
      value: 0
      objectReference: {fileID: 0}
    - target: {fileID: 3538650825715037495, guid: b3575fb2f23ef9647b805f4f05da0aff,
        type: 3}
      propertyPath: m_LocalRotation.z
      value: 0
      objectReference: {fileID: 0}
    - target: {fileID: 3538650825715037495, guid: b3575fb2f23ef9647b805f4f05da0aff,
        type: 3}
      propertyPath: m_AnchoredPosition.x
      value: 42
      objectReference: {fileID: 0}
    - target: {fileID: 3538650825715037495, guid: b3575fb2f23ef9647b805f4f05da0aff,
        type: 3}
      propertyPath: m_AnchoredPosition.y
      value: -38
      objectReference: {fileID: 0}
    - target: {fileID: 3538650825715037495, guid: b3575fb2f23ef9647b805f4f05da0aff,
        type: 3}
      propertyPath: m_LocalEulerAnglesHint.x
      value: 0
      objectReference: {fileID: 0}
    - target: {fileID: 3538650825715037495, guid: b3575fb2f23ef9647b805f4f05da0aff,
        type: 3}
      propertyPath: m_LocalEulerAnglesHint.y
      value: 0
      objectReference: {fileID: 0}
    - target: {fileID: 3538650825715037495, guid: b3575fb2f23ef9647b805f4f05da0aff,
        type: 3}
      propertyPath: m_LocalEulerAnglesHint.z
      value: 0
      objectReference: {fileID: 0}
    m_RemovedComponents: []
  m_SourcePrefab: {fileID: 100100000, guid: b3575fb2f23ef9647b805f4f05da0aff, type: 3}
--- !u!1001 &6377036577214507540
PrefabInstance:
  m_ObjectHideFlags: 0
  serializedVersion: 2
  m_Modification:
    m_TransformParent: {fileID: 0}
    m_Modifications:
    - target: {fileID: 6377036576732868491, guid: 2ceb2dced721e9841b68a77f3aad7691,
        type: 3}
      propertyPath: m_Name
      value: BgmPlayer
      objectReference: {fileID: 0}
    - target: {fileID: 6377036576732868532, guid: 2ceb2dced721e9841b68a77f3aad7691,
        type: 3}
      propertyPath: m_RootOrder
      value: 6
      objectReference: {fileID: 0}
    - target: {fileID: 6377036576732868532, guid: 2ceb2dced721e9841b68a77f3aad7691,
        type: 3}
      propertyPath: m_LocalPosition.x
      value: 0
      objectReference: {fileID: 0}
    - target: {fileID: 6377036576732868532, guid: 2ceb2dced721e9841b68a77f3aad7691,
        type: 3}
      propertyPath: m_LocalPosition.y
      value: 0
      objectReference: {fileID: 0}
    - target: {fileID: 6377036576732868532, guid: 2ceb2dced721e9841b68a77f3aad7691,
        type: 3}
      propertyPath: m_LocalPosition.z
      value: 0
      objectReference: {fileID: 0}
    - target: {fileID: 6377036576732868532, guid: 2ceb2dced721e9841b68a77f3aad7691,
        type: 3}
      propertyPath: m_LocalRotation.w
      value: 1
      objectReference: {fileID: 0}
    - target: {fileID: 6377036576732868532, guid: 2ceb2dced721e9841b68a77f3aad7691,
        type: 3}
      propertyPath: m_LocalRotation.x
      value: 0
      objectReference: {fileID: 0}
    - target: {fileID: 6377036576732868532, guid: 2ceb2dced721e9841b68a77f3aad7691,
        type: 3}
      propertyPath: m_LocalRotation.y
      value: 0
      objectReference: {fileID: 0}
    - target: {fileID: 6377036576732868532, guid: 2ceb2dced721e9841b68a77f3aad7691,
        type: 3}
      propertyPath: m_LocalRotation.z
      value: 0
      objectReference: {fileID: 0}
    - target: {fileID: 6377036576732868532, guid: 2ceb2dced721e9841b68a77f3aad7691,
        type: 3}
      propertyPath: m_LocalEulerAnglesHint.x
      value: 0
      objectReference: {fileID: 0}
    - target: {fileID: 6377036576732868532, guid: 2ceb2dced721e9841b68a77f3aad7691,
        type: 3}
      propertyPath: m_LocalEulerAnglesHint.y
      value: 0
      objectReference: {fileID: 0}
    - target: {fileID: 6377036576732868532, guid: 2ceb2dced721e9841b68a77f3aad7691,
        type: 3}
      propertyPath: m_LocalEulerAnglesHint.z
      value: 0
      objectReference: {fileID: 0}
    - target: {fileID: 6377036576732868533, guid: 2ceb2dced721e9841b68a77f3aad7691,
        type: 3}
      propertyPath: startBgmAction.m_PersistentCalls.m_Calls.Array.data[0].m_Target
      value: 
      objectReference: {fileID: 6377036576732868533, guid: 2ceb2dced721e9841b68a77f3aad7691,
        type: 3}
    - target: {fileID: 6377036576732868533, guid: 2ceb2dced721e9841b68a77f3aad7691,
        type: 3}
      propertyPath: startBgmAction.m_PersistentCalls.m_Calls.Array.data[0].m_MethodName
      value: StartMenuBgm
      objectReference: {fileID: 0}
    m_RemovedComponents: []
  m_SourcePrefab: {fileID: 100100000, guid: 2ceb2dced721e9841b68a77f3aad7691, type: 3}
