%YAML 1.1
%TAG !u! tag:unity3d.com,2011:
--- !u!114 &11400000
MonoBehaviour:
  m_ObjectHideFlags: 0
  m_CorrespondingSourceObject: {fileID: 0}
  m_PrefabInstance: {fileID: 0}
  m_PrefabAsset: {fileID: 0}
  m_GameObject: {fileID: 0}
  m_Enabled: 1
  m_EditorHideFlags: 0
  m_Script: {fileID: 11500000, guid: 04a2327fbb788064f9fde0eb3a3d942a, type: 3}
  m_Name: PlayerMovementData
  m_EditorClassIdentifier: 
  moveSpeed: 8
  strafingSpeed: 5
  turnSpeed: 700
  jumpForce: 10
  rotationSmoothTime: 0.1
