Key,Value
root_dir,Assets/Data\data_2025_0115_160625.csv
program_name,ratvr
project,Autobiographical memory
rig,Rig2
experimenter,Shoya Sugimoto
experimant_name,Training
discription,1st traing
subject,3
body_weight,3
temperture,3
humidity,3
