Time,X,Y,Z,SIGNAL,REWARD,BUTTON
3.980374,0,1,0,False,False,False
3.975,0,1,4.356553E-23,True,False,False
3.98,0,1,8.720034E-23,False,False,False
3.985,0,1,1.308352E-22,True,False,False
3.99,0,1,1.7447E-22,False,False,False
3.995,0,1,2.181053E-22,True,False,False
4,0,1,2.617406E-22,False,False,False
4.005,0,1,3.053759E-22,True,False,False
4.01,0,1,3.490112E-22,False,False,False
4.015,0,1,3.926466E-22,True,False,False
4.02,0,1,4.362819E-22,False,False,False
4.025,0,1,4.799172E-22,True,False,False
4.03,0,1,5.235526E-22,False,False,False
4.035,0,1,5.671879E-22,True,False,False
4.04,0,1,6.108233E-22,False,False,False
4.045,0,1,6.544586E-22,True,False,False
4.05,0,1,6.980939E-22,False,False,False
4.055,0,1,7.417293E-22,True,False,False
4.06,0,1,7.853646E-22,False,False,False
4.065,0,1,8.29E-22,True,False,False
4.07,0,1,8.726353E-22,False,False,False
4.075,0,1,9.162705E-22,True,False,False
4.08,0,1,9.599058E-22,False,False,False
4.085,0,1,1.003541E-21,True,False,False
4.09,0,1,1.047176E-21,False,False,False
4.095,0,1,1.090812E-21,True,False,False
4.1,0,1,1.134447E-21,False,False,False
4.105,0,1,1.178082E-21,True,False,False
4.11,0,1,1.221718E-21,False,False,False
4.115,0,1,1.265353E-21,True,False,False
4.12,0,1,1.308988E-21,False,False,False
4.125,0,1,1.352623E-21,True,False,False
4.13,0,1,1.396259E-21,False,False,False
4.135,0,1,1.439894E-21,True,False,False
4.14,0,1,1.483529E-21,False,False,False
4.145,0,1,1.527165E-21,True,False,False
4.15,0,1,1.5708E-21,False,False,False
4.155,0,1,1.614435E-21,True,False,False
4.16,0,1,1.658071E-21,False,False,False
4.165,0,1,1.701706E-21,True,False,False
4.17,0,1,1.745341E-21,False,False,False
4.175,0,1,1.788977E-21,True,False,False
4.18,0,1,1.832612E-21,False,False,False
4.185,0,1,1.876247E-21,True,False,False
4.19,0,1,1.919883E-21,False,False,False
4.195,0,1,1.963518E-21,True,False,False
4.2,0,1,2.007154E-21,False,False,False
4.205,0,1,2.050789E-21,True,False,False
4.21,0,1,2.094424E-21,False,False,False
4.215,0,1,2.13806E-21,True,False,False
4.22,0,1,2.181695E-21,False,False,False
4.225,0,1,2.225331E-21,True,False,False
4.23,0,1,2.268966E-21,False,False,False
4.235,0,1,2.312601E-21,True,False,False
4.24,0,1,2.356237E-21,False,False,False
4.245,0,1,2.399872E-21,True,False,False
4.25,0,1,2.443507E-21,False,False,False
4.255,0,1,2.487143E-21,True,False,False
4.26,0,1,2.530778E-21,False,False,False
4.265,0,1,2.574414E-21,True,False,False
4.27,0,1,2.618049E-21,False,False,False
4.275,0,1,2.661684E-21,True,False,False
4.28,0,1,2.70532E-21,False,False,False
4.285,0,1,2.748955E-21,True,False,False
4.29,0,1,2.792591E-21,False,False,False
4.295,0,1,2.836226E-21,True,False,False
4.3,0,1,2.879861E-21,False,False,False
4.305,0,1,2.923497E-21,True,False,False
4.31,0,1,2.967132E-21,False,False,False
4.315,0,1,3.010768E-21,True,False,False
4.32,0,1,3.054403E-21,False,False,False
4.325,0,1,3.098038E-21,True,False,False
4.33,0,1,3.141674E-21,False,False,False
4.335,0,1,3.185309E-21,True,False,False
4.34,0,1,3.228945E-21,False,False,False
4.345,0,1,3.27258E-21,True,False,False
4.35,0,1,3.316215E-21,False,False,False
4.355,0,1,3.359851E-21,True,False,False
4.36,0,1,3.403486E-21,False,False,False
4.365,0,1,3.447121E-21,True,False,False
4.37,0,1,3.490757E-21,False,False,False
4.375,0,1,3.534392E-21,True,False,False
4.38,0,1,3.534392E-21,False,False,False
4.385,0,1,3.534392E-21,True,False,False
4.39,0,1,3.534392E-21,False,False,False
4.395,0,1,3.534392E-21,True,False,False
4.4,0,1,3.534392E-21,False,False,False
4.405,0,1,3.534392E-21,True,False,False
4.41,0,1,3.534392E-21,False,False,False
4.415,0,1,3.534392E-21,True,False,False
4.42,0,1,3.534392E-21,False,False,False
4.425,0,1,3.534392E-21,True,False,False
4.43,0,1,3.534392E-21,False,False,False
4.435,0,1,3.534392E-21,True,False,False
4.44,0,1,3.534392E-21,False,False,False
4.445,0,1,3.534392E-21,True,False,False
4.45,0,1,3.534392E-21,False,False,False
4.455,0,1,3.534392E-21,True,False,False
4.46,0,1,3.534392E-21,False,False,False
4.465,0,1,3.534392E-21,True,False,False
4.47,0,1,3.534392E-21,False,False,False
4.475,0,1,3.534392E-21,True,False,False
4.48,0,1,3.534392E-21,False,False,False
4.485,0,1,3.534392E-21,True,False,False
4.49,0,1,3.534392E-21,False,False,False
4.495,0,1,3.534392E-21,True,False,False
4.5,0,1,3.534392E-21,False,False,False
4.505,0,1,3.534392E-21,True,False,False
4.51,0,1,3.534392E-21,False,False,False
4.515,0,1,3.534392E-21,True,False,False
4.52,0,1,3.534392E-21,False,False,False
4.525,0,1,3.534392E-21,True,False,False
4.53,0,1,3.534392E-21,False,False,False
4.535,0,1,3.534392E-21,True,False,False
4.54,0,1,3.534392E-21,False,False,False
4.545,0,1,3.534392E-21,True,False,False
4.55,0,1,3.534392E-21,False,False,False
4.555,0,1,3.534392E-21,True,False,False
4.56,0,1,3.534392E-21,False,False,False
4.565,0,1,3.534392E-21,True,False,False
4.57,0,1,3.534392E-21,False,False,False
4.575,0,1,3.534392E-21,True,False,False
4.58,0,1,3.534392E-21,False,False,False
4.585,0,1,3.534392E-21,True,False,False
4.59,0,1,3.534392E-21,False,False,False
4.595,0,1,3.534392E-21,True,False,False
4.6,0,1,3.534392E-21,False,False,False
4.605,0,1,3.534392E-21,True,False,False
4.61,0,1,3.534392E-21,False,False,False
4.615,0,1,3.534392E-21,True,False,False
4.62,0,1,3.534392E-21,False,False,False
4.625,0,1,3.534392E-21,True,False,False
4.63,0,1,3.534392E-21,False,False,False
4.635,0,1,3.534392E-21,True,False,False
4.64,0,1,3.534392E-21,False,False,False
4.645,0,1,3.534392E-21,True,False,False
4.65,0,1,3.534392E-21,False,False,False
4.655,0,1,3.534392E-21,True,False,False
4.66,0,1,3.534392E-21,False,False,False
4.665,0,1,3.534392E-21,True,False,False
4.67,0,1,3.534392E-21,False,False,False
4.675,0,1,3.534392E-21,True,False,False
4.68,0,1,3.534392E-21,False,False,False
4.685,0,1,3.534392E-21,True,False,False
4.69,0,1,3.534392E-21,False,False,False
4.695,0,1,3.534392E-21,True,False,False
4.7,0,1,3.534392E-21,False,False,False
4.705,0,1,3.534392E-21,True,False,False
4.71,0,1,3.534392E-21,False,False,False
4.715,0,1,3.534392E-21,True,False,False
4.72,0,1,3.534392E-21,False,False,False
4.725,0,1,3.534392E-21,True,False,False
4.73,0,1,3.534392E-21,False,False,False
4.735,0,1,3.534392E-21,True,False,False
4.74,0,1,3.534392E-21,False,False,False
4.745,0,1,3.534392E-21,True,False,False
4.75,0,1,3.534392E-21,False,False,False
4.755,0,1,3.534392E-21,True,False,False
4.76,0,1,3.534392E-21,False,False,False
4.765,0,1,3.534392E-21,True,False,False
4.77,0,1,3.534392E-21,False,False,False
4.775,0,1,3.534392E-21,True,False,False
4.78,0,1,3.534392E-21,False,False,False
4.785,0,1,3.534392E-21,True,False,False
4.79,0,1,3.534392E-21,False,False,False
4.795,0,1,3.534392E-21,True,False,False
4.8,0,1,3.534392E-21,False,False,False
4.805,0,1,3.534392E-21,True,False,False
4.81,0,1,3.534392E-21,False,False,False
4.815,0,1,3.534392E-21,True,False,False
4.82,0,1,3.534392E-21,False,False,False
4.825,0,1,3.534392E-21,True,False,False
4.83,0,1,3.534392E-21,False,False,False
4.835,0,1,3.534392E-21,True,False,False
4.84,0,1,3.534392E-21,False,False,False
4.845,0,1,3.534392E-21,True,False,False
4.85,0,1,3.534392E-21,False,False,False
4.855,0,1,3.534392E-21,True,False,False
4.86,0,1,3.534392E-21,False,False,False
4.865,0,1,3.534392E-21,True,False,False
4.87,0,1,3.534392E-21,False,False,False
4.875,0,1,3.534392E-21,True,False,False
4.88,0,1,3.534392E-21,False,False,False
4.885,0,1,-0.00034375,True,False,False
4.89,-0.00032555,1,-0.00034375,False,False,False
4.895,-0.00032555,1,-0.00034375,True,False,False
4.9,-0.0009641,1,-0.0003438226,False,False,False
4.905,-0.001776463,1,-0.000750346,True,False,False
4.91,-0.001776463,1,-0.000750346,False,False,False
4.915,-0.002459613,1,-0.0007507696,True,False,False
4.92,-0.003656645,1,-0.001150923,False,False,False
4.925,-0.003656645,1,-0.001150923,True,False,False
4.93,-0.004598494,1,-0.001152125,False,False,False
4.935,-0.005634363,1,-0.001499263,True,False,False
4.94,-0.006163362,1,-0.001500304,False,False,False
4.945,-0.006163362,1,-0.001500304,True,False,False
4.95,-0.008412457,1,-0.001505144,False,False,False
4.955,-0.008412457,1,-0.001505144,True,False,False
4.96,-0.01044335,1,-0.00184976,False,False,False
4.965,-0.01239259,1,-0.001856867,True,False,False
4.97,-0.01239259,1,-0.001856867,False,False,False
4.975,-0.01642955,1,-0.001874333,True,False,False
4.98,-0.02057511,1,-0.001898111,False,False,False
4.985,-0.02057511,1,-0.001898111,True,False,False
4.99,-0.02456171,1,-0.001620239,False,False,False
4.995,-0.02958997,1,-0.00166335,True,False,False
5,-0.02958997,1,-0.00166335,False,False,False
5.005,-0.03087562,1,-0.001356013,True,False,False
5.01,-0.03680366,1,-0.001049603,False,False,False
5.015,-0.03680366,1,-0.001049603,True,False,False
5.02,-0.04242679,1,-0.0007912566,False,False,False
5.025,-0.04711129,1,-0.0005006063,True,False,False
5.03,-0.04711129,1,-0.0005006063,False,False,False
5.035,-0.05386342,1,-0.0002741983,True,False,False
5.04,-0.05831954,1,-0.0003579606,False,False,False
5.045,-0.05831954,1,-0.0003579606,True,False,False
5.05,-0.08547232,1,-0.0009106148,False,False,False
5.055,-0.08791528,1,-0.0009835119,True,False,False
5.06,-0.08791528,1,-0.0009835119,False,False,False
5.065,-0.09321453,1,-0.001500507,True,False,False
5.07,-0.0991961,1,-0.002095268,False,False,False
5.075,-0.0991961,1,-0.002095268,True,False,False
5.08,-0.1042568,1,-0.002949307,False,False,False
5.085,-0.1120336,1,-0.003942838,True,False,False
5.09,-0.1120336,1,-0.003942838,False,False,False
5.095,-0.1158879,1,-0.004741343,True,False,False
5.1,-0.1239484,1,-0.006227979,False,False,False
5.105,-0.1239484,1,-0.006227979,True,False,False
5.11,-0.1257843,1,-0.006307562,False,False,False
5.115,-0.1293515,1,-0.007064564,True,False,False
5.12,-0.1293515,1,-0.007064564,False,False,False
5.125,-0.133303,1,-0.00764112,True,False,False
5.13,-0.1367858,1,-0.008508222,False,False,False
5.135,-0.1394945,1,-0.009324821,True,False,False
5.14,-0.1394945,1,-0.009324821,False,False,False
5.145,-0.140885,1,-0.009392716,True,False,False
5.15,-0.140885,1,-0.009392716,False,False,False
5.155,-0.1431179,1,-0.01015153,True,False,False
5.16,-0.1438147,1,-0.01018644,False,False,False
5.165,-0.1438147,1,-0.01018644,True,False,False
5.17,-0.1454902,1,-0.01061019,False,False,False
5.175,-0.1461612,1,-0.01064438,True,False,False
5.18,-0.1461612,1,-0.01064438,False,False,False
5.185,-0.1475529,1,-0.01106897,True,False,False
5.19,-0.1479222,1,-0.01108806,False,False,False
5.195,-0.1479222,1,-0.01108806,True,False,False
5.2,-0.1485566,1,-0.01144746,False,False,False
5.205,-0.1488766,1,-0.01146411,True,False,False
5.21,-0.1488766,1,-0.01146411,False,False,False
5.215,-0.1488573,1,-0.01183533,True,False,False
5.22,-0.1497179,1,-0.01188021,False,False,False
5.225,-0.1497179,1,-0.01188021,True,False,False
5.23,-0.1500481,1,-0.01224704,False,False,False
5.235,-0.1503747,1,-0.01260986,True,False,False
5.24,-0.1507205,1,-0.01262808,False,False,False
5.245,-0.1507205,1,-0.01262808,True,False,False
5.25,-0.1512434,1,-0.01320934,False,False,False
5.255,-0.1512434,1,-0.01320934,True,False,False
5.26,-0.1515547,1,-0.01355548,False,False,False
5.265,-0.1518727,1,-0.0139092,True,False,False
5.27,-0.1518727,1,-0.0139092,False,False,False
5.275,-0.1521696,1,-0.013925,True,False,False
5.28,-0.1525156,1,-0.01431003,False,False,False
5.285,-0.1525011,1,-0.01458159,True,False,False
5.29,-0.1525011,1,-0.01458159,False,False,False
5.295,-0.1528613,1,-0.01460085,True,False,False
5.3,-0.1528613,1,-0.01460085,False,False,False
5.305,-0.1528613,1,-0.01460085,True,False,False
5.31,-0.1528613,1,-0.01460085,False,False,False
5.315,-0.1528613,1,-0.01460085,True,False,False
5.32,-0.1528613,1,-0.01460085,False,False,False
5.325,-0.1528613,1,-0.01460085,True,False,False
5.33,-0.1528613,1,-0.01460085,False,False,False
5.335,-0.1528613,1,-0.01460085,True,False,False
5.34,-0.1528613,1,-0.01460085,False,False,False
5.345,-0.1528613,1,-0.01460085,True,False,False
5.35,-0.1528613,1,-0.01460085,False,False,False
5.355,-0.1528613,1,-0.01460085,True,False,False
5.36,-0.1528613,1,-0.01460085,False,False,False
5.365,-0.1528406,1,-0.01498552,True,False,False
5.37,-0.1525148,1,-0.01496806,False,False,False
5.375,-0.1525148,1,-0.01496806,True,False,False
5.38,-0.1521692,1,-0.01494958,False,False,False
5.385,-0.1518146,1,-0.01493065,True,False,False
5.39,-0.1518146,1,-0.01493065,False,False,False
5.395,-0.1514263,1,-0.01490998,True,False,False
5.4,-0.1508045,1,-0.01487696,False,False,False
5.405,-0.1508045,1,-0.01487696,True,False,False
5.41,-0.1508045,1,-0.01487696,False,False,False
5.415,-0.1505283,1,-0.01486236,True,False,False
5.42,-0.1505283,1,-0.01486236,False,False,False
5.425,-0.1501427,1,-0.014842,True,False,False
5.43,-0.1501427,1,-0.014842,False,False,False
5.435,-0.1501427,1,-0.014842,True,False,False
5.44,-0.1501427,1,-0.014842,False,False,False
5.445,-0.1501427,1,-0.014842,True,False,False
5.45,-0.1501427,1,-0.014842,False,False,False
5.455,-0.1497765,1,-0.01482272,True,False,False
5.46,-0.149789,1,-0.0145844,False,False,False
5.465,-0.149789,1,-0.0145844,True,False,False
5.47,-0.1494289,1,-0.01456548,False,False,False
5.475,-0.1494289,1,-0.01456548,True,False,False
5.48,-0.1491375,1,-0.01455021,False,False,False
5.485,-0.1491375,1,-0.01455021,True,False,False
5.49,-0.1491375,1,-0.01455021,False,False,False
5.495,-0.1491375,1,-0.01455021,True,False,False
5.5,-0.1491375,1,-0.01455021,False,False,False
5.505,-0.1491558,1,-0.01419989,True,False,False
5.51,-0.1491558,1,-0.01419989,False,False,False
5.515,-0.1487634,1,-0.01417937,True,False,False
5.52,-0.1487634,1,-0.01417937,False,False,False
5.525,-0.1487634,1,-0.01417937,True,False,False
5.53,-0.1487634,1,-0.01417937,False,False,False
5.535,-0.1487634,1,-0.01417937,True,False,False
5.54,-0.1487634,1,-0.01417937,False,False,False
5.545,-0.1487634,1,-0.01417937,True,False,False
5.55,-0.1487634,1,-0.01417937,False,False,False
5.555,-0.1487634,1,-0.01417937,True,False,False
5.56,-0.1487634,1,-0.01417937,False,False,False
5.565,-0.1487634,1,-0.01417937,True,False,False
5.57,-0.1487634,1,-0.01417937,False,False,False
5.575,-0.1487634,1,-0.01417937,True,False,False
5.58,-0.1487634,1,-0.01417937,False,False,False
5.585,-0.1487634,1,-0.01417937,True,False,False
5.59,-0.1487634,1,-0.01417937,False,False,False
5.595,-0.1487634,1,-0.01417937,True,False,False
5.6,-0.1487634,1,-0.01417937,False,False,False
5.605,-0.1487634,1,-0.01417937,True,False,False
5.61,-0.1487634,1,-0.01417937,False,False,False
5.615,-0.1487634,1,-0.01417937,True,False,False
5.62,-0.1487634,1,-0.01417937,False,False,False
5.625,-0.1487634,1,-0.01417937,True,False,False
5.63,-0.1487634,1,-0.01417937,False,False,False
5.635,-0.1487634,1,-0.01417937,True,False,False
5.64,-0.1487634,1,-0.01417937,False,False,False
5.645,-0.1487634,1,-0.01417937,True,False,False
5.65,-0.1487634,1,-0.01417937,False,False,False
5.655,-0.1487634,1,-0.01417937,True,False,False
5.66,-0.1487634,1,-0.01417937,False,False,False
5.665,-0.1487634,1,-0.01417937,True,False,False
5.67,-0.1487634,1,-0.01417937,False,False,False
5.675,-0.1487634,1,-0.01417937,True,False,False
5.68,-0.1487634,1,-0.01417937,False,False,False
5.685,-0.1487634,1,-0.01417937,True,False,False
5.69,-0.1487634,1,-0.01417937,False,False,False
5.695,-0.1487634,1,-0.01417937,True,False,False
5.7,-0.1487634,1,-0.01417937,False,False,False
5.705,-0.1487634,1,-0.01417937,True,False,False
5.71,-0.148317,1,-0.01415609,False,False,False
5.715,-0.148317,1,-0.01415609,True,False,False
5.72,-0.148317,1,-0.01415609,False,False,False
5.725,-0.148317,1,-0.01415609,True,False,False
5.73,-0.1479572,1,-0.01413738,False,False,False
5.735,-0.1479572,1,-0.01413738,True,False,False
5.74,-0.1479572,1,-0.01413738,False,False,False
5.745,-0.1479572,1,-0.01413738,True,False,False
5.75,-0.1479572,1,-0.01413738,False,False,False
5.755,-0.1479415,1,-0.01444087,True,False,False
5.76,-0.1475374,1,-0.01441991,False,False,False
5.765,-0.1475374,1,-0.01441991,True,False,False
5.77,-0.1475374,1,-0.01441991,False,False,False
5.775,-0.1475374,1,-0.01441991,True,False,False
5.78,-0.1475374,1,-0.01441991,False,False,False
5.785,-0.1475374,1,-0.01441991,True,False,False
5.79,-0.1468545,1,-0.01438458,False,False,False
5.795,-0.1468545,1,-0.01438458,True,False,False
5.8,-0.1468303,1,-0.01485556,False,False,False
5.805,-0.1468303,1,-0.01485556,True,False,False
5.81,-0.1468303,1,-0.01485556,False,False,False
5.815,-0.1468303,1,-0.01485556,True,False,False
5.82,-0.1464382,1,-0.01483537,False,False,False
5.825,-0.1464382,1,-0.01483537,True,False,False
5.83,-0.1464382,1,-0.01483537,False,False,False
5.835,-0.1464382,1,-0.01483537,True,False,False
5.84,-0.1461807,1,-0.01482214,False,False,False
5.845,-0.1461807,1,-0.01482214,True,False,False
5.85,-0.1461807,1,-0.01482214,False,False,False
5.855,-0.1461807,1,-0.01482214,True,False,False
5.86,-0.1461807,1,-0.01482214,False,False,False
5.865,-0.1461807,1,-0.01482214,True,False,False
5.87,-0.1461807,1,-0.01482214,False,False,False
5.875,-0.1461807,1,-0.01482214,True,False,False
5.88,-0.1461807,1,-0.01482214,False,False,False
5.885,-0.1461807,1,-0.01482214,True,False,False
5.89,-0.1461807,1,-0.01482214,False,False,False
5.895,-0.1461807,1,-0.01482214,True,False,False
5.9,-0.1461807,1,-0.01482214,False,False,False
5.905,-0.1461807,1,-0.01482214,True,False,False
5.91,-0.1461807,1,-0.01482214,False,False,False
5.915,-0.1461807,1,-0.01482214,True,False,False
5.92,-0.1464469,1,-0.01511719,False,False,False
5.925,-0.1467952,1,-0.01550313,True,False,False
5.93,-0.1479794,1,-0.01649039,False,False,False
5.935,-0.1479794,1,-0.01649039,True,False,False
5.94,-0.1500624,1,-0.01789201,False,False,False
5.945,-0.1500624,1,-0.01789201,True,False,False
5.95,-0.1515957,1,-0.01876238,False,False,False
5.955,-0.1532466,1,-0.01970072,True,False,False
5.96,-0.1532466,1,-0.01970072,False,False,False
5.965,-0.1546449,1,-0.02049652,True,False,False
5.97,-0.1563253,1,-0.02127693,False,False,False
5.975,-0.1563253,1,-0.02127693,True,False,False
5.98,-0.1570716,1,-0.02170278,False,False,False
5.985,-0.158469,1,-0.02213523,True,False,False
5.99,-0.1595805,1,-0.02277057,False,False,False
5.995,-0.1595805,1,-0.02277057,True,False,False
6,-0.16271,1,-0.02456109,False,False,False
6.005,-0.16271,1,-0.02456109,True,False,False
6.01,-0.1649268,1,-0.02559845,False,False,False
6.015,-0.1670433,1,-0.02681479,True,False,False
6.02,-0.1670433,1,-0.02681479,False,False,False
6.025,-0.1696546,1,-0.02785919,True,False,False
6.03,-0.1696546,1,-0.02785919,False,False,False
6.035,-0.1719724,1,-0.02961264,True,False,False
6.04,-0.1747454,1,-0.03072743,False,False,False
6.045,-0.1770214,1,-0.03125228,True,False,False
6.05,-0.1770214,1,-0.03125228,False,False,False
6.055,-0.1790119,1,-0.03219617,True,False,False
6.06,-0.1820393,1,-0.03289913,False,False,False
6.065,-0.1820393,1,-0.03289913,True,False,False
6.07,-0.1841316,1,-0.03303338,False,False,False
6.075,-0.187223,1,-0.03368164,True,False,False
6.08,-0.187223,1,-0.03368164,False,False,False
6.085,-0.1880489,1,-0.03373614,True,False,False
6.09,-0.1896403,1,-0.03384162,False,False,False
6.095,-0.1896403,1,-0.03384162,True,False,False
6.1,-0.1915122,1,-0.03396675,False,False,False
6.105,-0.192566,1,-0.03369277,True,False,False
6.11,-0.192566,1,-0.03369277,False,False,False
6.115,-0.193718,1,-0.03377095,True,False,False
6.12,-0.1951103,1,-0.03341011,False,False,False
6.125,-0.1951103,1,-0.03341011,True,False,False
6.13,-0.1962346,1,-0.03311929,False,False,False
6.135,-0.1983662,1,-0.03291376,True,False,False
6.14,-0.1983662,1,-0.03291376,False,False,False
6.145,-0.1990877,1,-0.03296418,True,False,False
6.15,-0.2001603,1,-0.03251872,False,False,False
6.155,-0.2001603,1,-0.03251872,True,False,False
6.16,-0.2020217,1,-0.03264993,False,False,False
6.165,-0.2038097,1,-0.03242277,True,False,False
6.17,-0.2038097,1,-0.03242277,False,False,False
6.175,-0.2056924,1,-0.03255789,True,False,False
6.18,-0.2077018,1,-0.03270343,False,False,False
6.185,-0.2077018,1,-0.03270343,True,False,False
6.19,-0.2101746,1,-0.03247494,False,False,False
6.195,-0.2101746,1,-0.03247494,True,False,False
6.2,-0.2155218,1,-0.0328706,False,False,False
6.205,-0.2177915,1,-0.03304282,True,False,False
6.21,-0.21897,1,-0.0327479,False,False,False
6.215,-0.21897,1,-0.0327479,True,False,False
6.22,-0.2221029,1,-0.03298939,False,False,False
6.225,-0.2256317,1,-0.0328742,True,False,False
6.23,-0.2256317,1,-0.0328742,False,False,False
6.235,-0.2271244,1,-0.03262452,True,False,False
6.24,-0.2318367,1,-0.03300118,False,False,False
6.245,-0.2318367,1,-0.03300118,True,False,False
6.25,-0.233808,1,-0.03316203,False,False,False
6.255,-0.2395384,1,-0.03299836,True,False,False
6.26,-0.2395384,1,-0.03299836,False,False,False
6.265,-0.2411134,1,-0.03313112,True,False,False
6.27,-0.2448554,1,-0.03344863,False,False,False
6.275,-0.2448554,1,-0.03344863,True,False,False
6.28,-0.2466926,1,-0.03360693,False,False,False
6.285,-0.2501372,1,-0.03390598,True,False,False
6.29,-0.2501372,1,-0.03390598,False,False,False
6.295,-0.2516023,1,-0.03403495,True,False,False
6.3,-0.2539287,1,-0.03424095,False,False,False
6.305,-0.2539287,1,-0.03424095,True,False,False
6.31,-0.2575419,1,-0.03456387,False,False,False
6.315,-0.2594855,1,-0.03474005,True,False,False
6.32,-0.2594855,1,-0.03474005,False,False,False
6.325,-0.2629722,1,-0.03505851,True,False,False
6.33,-0.2648189,1,-0.03522946,False,False,False
6.335,-0.2648189,1,-0.03522946,True,False,False
6.34,-0.2682326,1,-0.03554768,False,False,False
6.345,-0.2703694,1,-0.03574945,True,False,False
6.35,-0.2703694,1,-0.03574945,False,False,False
6.355,-0.2717205,1,-0.03587805,True,False,False
6.36,-0.2730832,1,-0.03600842,False,False,False
6.365,-0.2730832,1,-0.03600842,True,False,False
6.37,-0.2757285,1,-0.03664945,False,False,False
6.375,-0.2769176,1,-0.03717839,True,False,False
6.38,-0.2769176,1,-0.03717839,False,False,False
6.385,-0.2780216,1,-0.03728606,True,False,False
6.39,-0.2797872,1,-0.03839605,False,False,False
6.395,-0.2797872,1,-0.03839605,True,False,False
6.4,-0.2805115,1,-0.03846746,False,False,False
6.405,-0.2812667,1,-0.03894322,True,False,False
6.41,-0.2812667,1,-0.03894322,False,False,False
6.415,-0.2816032,1,-0.03935373,True,False,False
6.42,-0.2823575,1,-0.03982932,False,False,False
6.425,-0.2823575,1,-0.03982932,True,False,False
6.43,-0.2834776,1,-0.04074852,False,False,False
6.435,-0.2838566,1,-0.04121177,True,False,False
6.44,-0.2838566,1,-0.04121177,False,False,False
6.445,-0.2845277,1,-0.04127895,True,False,False
6.45,-0.2852567,1,-0.04217059,False,False,False
6.455,-0.2855865,1,-0.04220377,True,False,False
6.46,-0.2855865,1,-0.04220377,False,False,False
6.465,-0.285931,1,-0.04262542,True,False,False
6.47,-0.285931,1,-0.04262542,False,False,False
6.475,-0.2862137,1,-0.04265394,True,False,False
6.48,-0.2861849,1,-0.04293892,False,False,False
6.485,-0.2861849,1,-0.04293892,True,False,False
6.49,-0.2861849,1,-0.04293892,False,False,False
6.495,-0.2861849,1,-0.04293892,True,False,False
6.5,-0.2861849,1,-0.04293892,False,False,False
6.505,-0.2861849,1,-0.04293892,True,False,False
6.51,-0.2861849,1,-0.04293892,False,False,False
6.515,-0.2861849,1,-0.04293892,True,False,False
6.52,-0.2861849,1,-0.04293892,False,False,False
6.525,-0.2865441,1,-0.04297518,True,False,False
6.53,-0.2865441,1,-0.04297518,False,False,False
6.535,-0.2865441,1,-0.04297518,True,False,False
6.54,-0.2865441,1,-0.04297518,False,False,False
6.545,-0.2865441,1,-0.04297518,True,False,False
6.55,-0.286508,1,-0.04333211,False,False,False
6.555,-0.286508,1,-0.04333211,True,False,False
6.56,-0.286508,1,-0.04333211,False,False,False
6.565,-0.286508,1,-0.04333211,True,False,False
6.57,-0.286508,1,-0.04333211,False,False,False
6.575,-0.286508,1,-0.04333211,True,False,False
6.58,-0.286508,1,-0.04333211,False,False,False
6.585,-0.286508,1,-0.04333211,True,False,False
6.59,-0.286508,1,-0.04333211,False,False,False
6.595,-0.286508,1,-0.04333211,True,False,False
6.6,-0.2864729,1,-0.04367835,False,False,False
6.605,-0.2864729,1,-0.04367835,True,False,False
6.61,-0.2864729,1,-0.04367835,False,False,False
6.615,-0.2864431,1,-0.04397397,True,False,False
6.62,-0.2864431,1,-0.04397397,False,False,False
6.625,-0.2864431,1,-0.04397397,True,False,False
6.63,-0.2864431,1,-0.04397397,False,False,False
6.635,-0.2864431,1,-0.04397397,True,False,False
6.64,-0.2864431,1,-0.04397397,False,False,False
6.645,-0.2864431,1,-0.04397397,True,False,False
6.65,-0.2864431,1,-0.04397397,False,False,False
6.655,-0.2864036,1,-0.04436463,True,False,False
6.66,-0.2864036,1,-0.04436463,False,False,False
6.665,-0.2864036,1,-0.04436463,True,False,False
6.67,-0.2864036,1,-0.04436463,False,False,False
6.675,-0.2864036,1,-0.04436463,True,False,False
6.68,-0.2864036,1,-0.04436463,False,False,False
6.685,-0.2864036,1,-0.04436463,True,False,False
6.69,-0.2864036,1,-0.04436463,False,False,False
6.695,-0.2864036,1,-0.04436463,True,False,False
6.7,-0.2864036,1,-0.04436463,False,False,False
6.705,-0.2864036,1,-0.04436463,True,False,False
6.71,-0.2864036,1,-0.04436463,False,False,False
6.715,-0.2864036,1,-0.04436463,True,False,False
6.72,-0.2864036,1,-0.04436463,False,False,False
6.725,-0.2864036,1,-0.04436463,True,False,False
6.73,-0.2864036,1,-0.04436463,False,False,False
6.735,-0.2864036,1,-0.04436463,True,False,False
6.74,-0.2864036,1,-0.04436463,False,False,False
6.745,-0.2864036,1,-0.04436463,True,False,False
6.75,-0.2864036,1,-0.04436463,False,False,False
6.755,-0.2864036,1,-0.04436463,True,False,False
6.76,-0.2864036,1,-0.04436463,False,False,False
6.765,-0.2864036,1,-0.04436463,True,False,False
6.77,-0.2864036,1,-0.04436463,False,False,False
6.775,-0.2864036,1,-0.04436463,True,False,False
6.78,-0.2864036,1,-0.04436463,False,False,False
6.785,-0.2864036,1,-0.04436463,True,False,False
6.79,-0.2864036,1,-0.04436463,False,False,False
6.795,-0.2864036,1,-0.04436463,True,False,False
6.8,-0.2864036,1,-0.04436463,False,False,False
6.805,-0.2864036,1,-0.04436463,True,False,False
6.81,-0.2864036,1,-0.04436463,False,False,False
6.815,-0.2864036,1,-0.04436463,True,False,False
6.82,-0.2864036,1,-0.04436463,False,False,False
6.825,-0.2864036,1,-0.04436463,True,False,False
6.83,-0.2864036,1,-0.04436463,False,False,False
6.835,-0.2864036,1,-0.04436463,True,False,False
6.84,-0.2864036,1,-0.04436463,False,False,False
6.845,-0.2864036,1,-0.04436463,True,False,False
6.85,-0.2864036,1,-0.04436463,False,False,False
6.855,-0.2864036,1,-0.04436463,True,False,False
6.86,-0.2864036,1,-0.04436463,False,False,False
6.865,-0.2864036,1,-0.04436463,True,False,False
6.87,-0.2864036,1,-0.04436463,False,False,False
6.875,-0.2864036,1,-0.04436463,True,False,False
6.88,-0.2864036,1,-0.04436463,False,False,False
6.885,-0.2864036,1,-0.04436463,True,False,False
6.89,-0.2864036,1,-0.04436463,False,False,False
6.895,-0.2864036,1,-0.04436463,True,False,False
6.9,-0.2864036,1,-0.04436463,False,False,False
6.905,-0.2864036,1,-0.04436463,True,False,False
6.91,-0.2864036,1,-0.04436463,False,False,False
6.915,-0.2864036,1,-0.04436463,True,False,False
6.92,-0.2864036,1,-0.04436463,False,False,False
6.925,-0.2864036,1,-0.04436463,True,False,False
6.93,-0.2864036,1,-0.04436463,False,False,False
6.935,-0.2864036,1,-0.04436463,True,False,False
6.94,-0.2864036,1,-0.04436463,False,False,False
6.945,-0.2864036,1,-0.04436463,True,False,False
6.95,-0.2864036,1,-0.04436463,False,False,False
6.955,-0.2864036,1,-0.04436463,True,False,False
6.96,-0.2864036,1,-0.04436463,False,False,False
6.965,-0.2864036,1,-0.04436463,True,False,False
6.97,-0.2864036,1,-0.04436463,False,False,False
6.975,-0.2864036,1,-0.04436463,True,False,False
6.98,-0.2864036,1,-0.04436463,False,False,False
6.985,-0.2864036,1,-0.04436463,True,False,False
6.99,-0.2864036,1,-0.04436463,False,False,False
6.995,-0.2864036,1,-0.04436463,True,False,False
7,-0.2864036,1,-0.04436463,False,False,False
7.005,-0.2864036,1,-0.04436463,True,False,False
7.01,-0.2864036,1,-0.04436463,False,False,False
7.015,-0.2864036,1,-0.04436463,True,False,False
7.02,-0.2864036,1,-0.04436463,False,False,False
7.025,-0.2864036,1,-0.04436463,True,False,False
7.03,-0.2864036,1,-0.04436463,False,False,False
7.035,-0.2864036,1,-0.04436463,True,False,False
7.04,-0.2864036,1,-0.04436463,False,False,False
7.045,-0.2864036,1,-0.04436463,True,False,False
7.05,-0.2864036,1,-0.04436463,False,False,False
7.055,-0.2864036,1,-0.04436463,True,False,False
7.06,-0.2864036,1,-0.04436463,False,False,False
7.065,-0.2864036,1,-0.04436463,True,False,False
7.07,-0.2864036,1,-0.04436463,False,False,False
7.075,-0.2864036,1,-0.04436463,True,False,False
7.08,-0.2864036,1,-0.04436463,False,False,False
7.085,-0.2864036,1,-0.04436463,True,False,False
7.09,-0.2864036,1,-0.04436463,False,False,False
7.095,-0.2864036,1,-0.04436463,True,False,False
7.1,-0.2864036,1,-0.04436463,False,False,False
7.105,-0.2864036,1,-0.04436463,True,False,False
7.11,-0.2864036,1,-0.04436463,False,False,False
7.115,-0.2864036,1,-0.04436463,True,False,False
7.12,-0.2864036,1,-0.04436463,False,False,False
7.125,-0.2864036,1,-0.04436463,True,False,False
7.13,-0.2864036,1,-0.04436463,False,False,False
7.135,-0.2864036,1,-0.04436463,True,False,False
7.14,-0.2864036,1,-0.04436463,False,False,False
7.145,-0.2864036,1,-0.04436463,True,False,False
7.15,-0.2864036,1,-0.04436463,False,False,False
7.155,-0.2864036,1,-0.04436463,True,False,False
7.16,-0.2864036,1,-0.04436463,False,False,False
7.165,-0.2864036,1,-0.04436463,True,False,False
7.17,-0.2864036,1,-0.04436463,False,False,False
7.175,-0.2864036,1,-0.04436463,True,False,False
7.18,-0.2864036,1,-0.04436463,False,False,False
7.185,-0.2864036,1,-0.04436463,True,False,False
7.19,-0.2864036,1,-0.04436463,False,False,False
7.195,-0.2864036,1,-0.04436463,True,False,False
7.2,-0.2864036,1,-0.04436463,False,False,False
7.205,-0.2864036,1,-0.04436463,True,False,False
7.21,-0.2864036,1,-0.04436463,False,False,False
7.215,-0.2864036,1,-0.04436463,True,False,False
7.22,-0.2864036,1,-0.04436463,False,False,False
7.225,-0.2864036,1,-0.04436463,True,False,False
7.23,-0.2864036,1,-0.04436463,False,False,False
7.235,-0.2864036,1,-0.04436463,True,False,False
7.24,-0.2864036,1,-0.04436463,False,False,False
7.245,-0.2864036,1,-0.04436463,True,False,False
7.25,-0.2864036,1,-0.04436463,False,False,False
7.255,-0.2864036,1,-0.04436463,True,False,False
7.26,-0.2864036,1,-0.04436463,False,False,False
7.265,-0.2864036,1,-0.04436463,True,False,False
7.27,-0.2864036,1,-0.04436463,False,False,False
7.275,-0.2864036,1,-0.04436463,True,False,False
7.28,-0.2864036,1,-0.04436463,False,False,False
7.285,-0.2864036,1,-0.04436463,True,False,False
7.29,-0.2864036,1,-0.04436463,False,False,False
7.295,-0.2864036,1,-0.04436463,True,False,False
7.3,-0.2864036,1,-0.04436463,False,False,False
7.305,-0.2864036,1,-0.04436463,True,False,False
7.31,-0.2864036,1,-0.04436463,False,False,False
7.315,-0.2864036,1,-0.04436463,True,False,False
7.32,-0.2864036,1,-0.04436463,False,False,False
7.325,-0.2864036,1,-0.04436463,True,False,False
7.33,-0.2864036,1,-0.04436463,False,False,False
7.335,-0.2864036,1,-0.04436463,True,False,False
7.34,-0.2864036,1,-0.04436463,False,False,False
7.345,-0.2864036,1,-0.04436463,True,False,False
7.35,-0.2864036,1,-0.04436463,False,False,False
7.355,-0.2864036,1,-0.04436463,True,False,False
7.36,-0.2864036,1,-0.04436463,False,False,False
7.365,-0.2864036,1,-0.04436463,True,False,False
7.37,-0.2864036,1,-0.04436463,False,False,False
7.375,-0.2864036,1,-0.04436463,True,False,False
7.38,-0.2864036,1,-0.04436463,False,False,False
7.385,-0.2864036,1,-0.04436463,True,False,False
7.39,-0.2864036,1,-0.04436463,False,False,False
7.395,-0.2864036,1,-0.04436463,True,False,False
7.4,-0.2864036,1,-0.04436463,False,False,False
7.405,-0.2864036,1,-0.04436463,True,False,False
7.41,-0.2864036,1,-0.04436463,False,False,False
7.415,-0.2864036,1,-0.04436463,True,False,False
7.42,-0.2864036,1,-0.04436463,False,False,False
7.425,-0.2864036,1,-0.04436463,True,False,False
7.43,-0.2864036,1,-0.04436463,False,False,False
7.435,-0.2864036,1,-0.04436463,True,False,False
7.44,-0.2864036,1,-0.04436463,False,False,False
7.445,-0.2864036,1,-0.04436463,True,False,False
7.45,-0.2864036,1,-0.04436463,False,False,False
7.455,-0.2864036,1,-0.04436463,True,False,False
7.46,-0.2864036,1,-0.04436463,False,False,False
7.465,-0.2864036,1,-0.04436463,True,False,False
7.47,-0.2864036,1,-0.04436463,False,False,False
7.475,-0.2864036,1,-0.04436463,True,False,False
7.48,-0.2864036,1,-0.04436463,False,False,False
7.485,-0.2864036,1,-0.04436463,True,False,False
7.49,-0.2864036,1,-0.04436463,False,False,False
7.495,-0.2864036,1,-0.04436463,True,False,False
7.5,-0.2864036,1,-0.04436463,False,False,False
7.505,-0.2864036,1,-0.04436463,True,False,False
7.51,-0.2864036,1,-0.04436463,False,False,False
7.515,-0.2864036,1,-0.04436463,True,False,False
7.52,-0.2864036,1,-0.04436463,False,False,False
7.525,-0.2864036,1,-0.04436463,True,False,False
7.53,-0.2864036,1,-0.04436463,False,False,False
7.535,-0.2864036,1,-0.04436463,True,False,False
7.54,-0.2864036,1,-0.04436463,False,False,False
7.545,-0.2864036,1,-0.04436463,True,False,False
7.55,-0.2864036,1,-0.04436463,False,False,False
7.555,-0.2864036,1,-0.04436463,True,False,False
7.56,-0.2864036,1,-0.04436463,False,False,False
7.565,-0.2864036,1,-0.04436463,True,False,False
7.57,-0.2864036,1,-0.04436463,False,False,False
7.575,-0.2864036,1,-0.04436463,True,False,False
7.58,-0.2864036,1,-0.04436463,False,False,False
7.585,-0.2864036,1,-0.04436463,True,False,False
7.59,-0.2864036,1,-0.04436463,False,False,False
7.595,-0.2864036,1,-0.04436463,True,False,False
7.6,-0.2864036,1,-0.04436463,False,False,False
7.605,-0.2864036,1,-0.04436463,True,False,False
7.61,-0.2864036,1,-0.04436463,False,False,False
7.615,-0.2864036,1,-0.04436463,True,False,False
7.62,-0.2864036,1,-0.04436463,False,False,False
7.625,-0.2864036,1,-0.04436463,True,False,False
7.63,-0.2864036,1,-0.04436463,False,False,False
7.635,-0.2864036,1,-0.04436463,True,False,False
7.64,-0.2864036,1,-0.04436463,False,False,False
7.645,-0.2864036,1,-0.04436463,True,False,False
7.65,-0.2864036,1,-0.04436463,False,False,False
7.655,-0.2864036,1,-0.04436463,True,False,False
7.66,-0.2864036,1,-0.04436463,False,False,False
7.665,-0.2864036,1,-0.04436463,True,False,False
7.67,-0.2864036,1,-0.04436463,False,False,False
7.675,-0.2864036,1,-0.04436463,True,False,False
7.68,-0.2864036,1,-0.04436463,False,False,False
7.685,-0.2864036,1,-0.04436463,True,False,False
7.69,-0.2864036,1,-0.04436463,False,False,False
7.695,-0.2864036,1,-0.04436463,True,False,False
7.7,-0.2864036,1,-0.04436463,False,False,False
7.705,-0.2864036,1,-0.04436463,True,False,False
7.71,-0.2864036,1,-0.04436463,False,False,False
7.715,-0.2864036,1,-0.04436463,True,False,False
7.72,-0.2864036,1,-0.04436463,False,False,False
7.725,-0.2864036,1,-0.04436463,True,False,False
7.73,-0.2864036,1,-0.04436463,False,False,False
7.735,-0.2864036,1,-0.04436463,True,False,False
7.74,-0.2864036,1,-0.04436463,False,False,False
7.745,-0.2864036,1,-0.04436463,True,False,False
7.75,-0.2864036,1,-0.04436463,False,False,False
7.755,-0.2864036,1,-0.04436463,True,False,False
7.76,-0.2864036,1,-0.04436463,False,False,False
7.765,-0.2864036,1,-0.04436463,True,False,False
7.77,-0.2864036,1,-0.04436463,False,False,False
7.775,-0.2864036,1,-0.04436463,True,False,False
7.78,-0.2864036,1,-0.04436463,False,False,False
7.785,-0.2864036,1,-0.04436463,True,False,False
7.79,-0.2864036,1,-0.04436463,False,False,False
7.795,-0.2864036,1,-0.04436463,True,False,False
7.8,-0.2864036,1,-0.04436463,False,False,False
7.805,-0.2864036,1,-0.04436463,True,False,False
7.81,-0.2864036,1,-0.04436463,False,False,False
7.815,-0.2864036,1,-0.04436463,True,False,False
7.82,-0.2864036,1,-0.04436463,False,False,False
7.825,-0.2864036,1,-0.04436463,True,False,False
7.83,-0.2864036,1,-0.04436463,False,False,False
7.835,-0.2864036,1,-0.04436463,True,False,False
7.84,-0.2864036,1,-0.04436463,False,False,False
7.845,-0.2864036,1,-0.04436463,True,False,False
7.85,-0.2864036,1,-0.04436463,False,False,False
7.855,-0.2864036,1,-0.04436463,True,False,False
7.86,-0.2864036,1,-0.04436463,False,False,False
7.865,-0.2864036,1,-0.04436463,True,False,False
7.87,-0.2864036,1,-0.04436463,False,False,False
7.875,-0.2864036,1,-0.04436463,True,False,False
7.88,-0.2864036,1,-0.04436463,False,False,False
7.885,-0.2864036,1,-0.04436463,True,False,False
7.89,-0.2864036,1,-0.04436463,False,False,False
7.895,-0.2864036,1,-0.04436463,True,False,False
7.9,-0.2864036,1,-0.04436463,False,False,False
7.905,-0.2864036,1,-0.04436463,True,False,False
7.91,-0.2864036,1,-0.04436463,False,False,False
7.915,-0.2864036,1,-0.04436463,True,False,False
7.92,-0.2864036,1,-0.04436463,False,False,False
7.925,-0.2864036,1,-0.04436463,True,False,False
7.93,-0.2864036,1,-0.04436463,False,False,False
7.935,-0.2864036,1,-0.04436463,True,False,False
7.94,-0.2864036,1,-0.04436463,False,False,False
7.945,-0.2864036,1,-0.04436463,True,False,False
7.95,-0.2864036,1,-0.04436463,False,False,False
7.955,-0.2864036,1,-0.04436463,True,False,False
7.96,-0.2864036,1,-0.04436463,False,False,False
7.965,-0.2864036,1,-0.04436463,True,False,False
7.97,-0.2864036,1,-0.04436463,False,False,False
7.975,-0.2864036,1,-0.04436463,True,False,False
7.98,-0.2864036,1,-0.04436463,False,False,False
7.985,-0.2864036,1,-0.04436463,True,False,False
7.99,-0.2864036,1,-0.04436463,False,False,False
7.995,-0.2864036,1,-0.04436463,True,False,False
8,-0.2864036,1,-0.04436463,False,False,False
8.005,-0.2864036,1,-0.04436463,True,False,False
8.01,-0.2864036,1,-0.04436463,False,False,False
8.014999,-0.2864036,1,-0.04436463,True,False,False
8.02,-0.2864036,1,-0.04436463,False,False,False
8.025,-0.2864036,1,-0.04436463,True,False,False
8.03,-0.2864036,1,-0.04436463,False,False,False
8.035,-0.2864036,1,-0.04436463,True,False,False
8.04,-0.2864036,1,-0.04436463,False,False,False
8.045,-0.2864036,1,-0.04436463,True,False,False
8.05,-0.2864036,1,-0.04436463,False,False,False
8.054999,-0.2864036,1,-0.04436463,True,False,False
8.059999,-0.2864036,1,-0.04436463,False,False,False
8.065,-0.2864036,1,-0.04436463,True,False,False
8.07,-0.2864036,1,-0.04436463,False,False,False
8.075,-0.2864036,1,-0.04436463,True,False,False
8.08,-0.2864036,1,-0.04436463,False,False,False
8.085,-0.2864036,1,-0.04436463,True,False,False
8.09,-0.2864036,1,-0.04436463,False,False,False
8.095,-0.2864036,1,-0.04436463,True,False,False
8.099999,-0.2864036,1,-0.04436463,False,False,False
8.105,-0.2864036,1,-0.04436463,True,False,False
8.11,-0.2864036,1,-0.04436463,False,False,False
8.115,-0.2864036,1,-0.04436463,True,False,False
8.12,-0.2864036,1,-0.04436463,False,False,False
8.125,-0.2864036,1,-0.04436463,True,False,False
8.13,-0.2864036,1,-0.04436463,False,False,False
8.135,-0.2864036,1,-0.04436463,True,False,False
8.139999,-0.2864036,1,-0.04436463,False,False,False
8.145,-0.2864036,1,-0.04436463,True,False,False
8.15,-0.2864036,1,-0.04436463,False,False,False
8.155,-0.2864036,1,-0.04436463,True,False,False
8.16,-0.2864036,1,-0.04436463,False,False,False
8.165,-0.2864036,1,-0.04436463,True,False,False
8.17,-0.2864036,1,-0.04436463,False,False,False
8.175,-0.2864036,1,-0.04436463,True,False,False
8.179999,-0.2864036,1,-0.04436463,False,False,False
8.184999,-0.2864036,1,-0.04436463,True,False,False
8.19,-0.2864036,1,-0.04436463,False,False,False
8.195,-0.2864036,1,-0.04436463,True,False,False
8.2,-0.2864036,1,-0.04436463,False,False,False
8.205,-0.2864036,1,-0.04436463,True,False,False
8.21,-0.2864036,1,-0.04436463,False,False,False
8.215,-0.2864036,1,-0.04436463,True,False,False
8.22,-0.2864036,1,-0.04436463,False,False,False
8.224999,-0.2864036,1,-0.04436463,True,False,False
8.23,-0.2864036,1,-0.04436463,False,False,False
8.235,-0.2864036,1,-0.04436463,True,False,False
8.24,-0.2864036,1,-0.04436463,False,False,False
8.245,-0.2864036,1,-0.04436463,True,False,False
8.25,-0.2864036,1,-0.04436463,False,False,False
8.255,-0.2864036,1,-0.04436463,True,False,False
8.26,-0.2864036,1,-0.04436463,False,False,False
8.264999,-0.2864036,1,-0.04436463,True,False,False
8.27,-0.2864036,1,-0.04436463,False,False,False
8.275,-0.2864036,1,-0.04436463,True,False,False
8.28,-0.2864036,1,-0.04436463,False,False,False
8.285,-0.2864036,1,-0.04436463,True,False,False
8.29,-0.2864036,1,-0.04436463,False,False,False
8.295,-0.2864036,1,-0.04436463,True,False,False
8.3,-0.2864036,1,-0.04436463,False,False,False
8.304999,-0.2864036,1,-0.04436463,True,False,False
8.309999,-0.2864036,1,-0.04436463,False,False,False
8.315,-0.2864036,1,-0.04436463,True,False,False
8.32,-0.2864036,1,-0.04436463,False,False,False
8.325,-0.2864036,1,-0.04436463,True,False,False
8.33,-0.2864036,1,-0.04436463,False,False,False
8.335,-0.2864036,1,-0.04436463,True,False,False
8.34,-0.2864036,1,-0.04436463,False,False,False
8.345,-0.2864036,1,-0.04436463,True,False,False
8.349999,-0.2864036,1,-0.04436463,False,False,False
8.355,-0.2864036,1,-0.04436463,True,False,False
8.36,-0.2864036,1,-0.04436463,False,False,False
8.365,-0.2864036,1,-0.04436463,True,False,False
8.37,-0.2864036,1,-0.04436463,False,False,False
8.375,-0.2864036,1,-0.04436463,True,False,False
8.38,-0.2864036,1,-0.04436463,False,False,False
8.385,-0.2864036,1,-0.04436463,True,False,False
8.389999,-0.2864036,1,-0.04436463,False,False,False
8.395,-0.2864036,1,-0.04436463,True,False,False
8.4,-0.2864036,1,-0.04436463,False,False,False
8.405,-0.2864036,1,-0.04436463,True,False,False
8.41,-0.2864036,1,-0.04436463,False,False,False
8.415,-0.2864036,1,-0.04436463,True,False,False
8.42,-0.2864036,1,-0.04436463,False,False,False
8.425,-0.2864036,1,-0.04436463,True,False,False
8.429999,-0.2864036,1,-0.04436463,False,False,False
8.434999,-0.2864036,1,-0.04436463,True,False,False
8.44,-0.2864036,1,-0.04436463,False,False,False
8.445,-0.2864036,1,-0.04436463,True,False,False
8.45,-0.2864036,1,-0.04436463,False,False,False
8.455,-0.2864036,1,-0.04436463,True,False,False
8.46,-0.2864036,1,-0.04436463,False,False,False
8.465,-0.2864036,1,-0.04436463,True,False,False
8.47,-0.2864036,1,-0.04436463,False,False,False
8.474999,-0.2864036,1,-0.04436463,True,False,False
8.48,-0.2864036,1,-0.04436463,False,False,False
8.485,-0.2864036,1,-0.04436463,True,False,False
8.49,-0.2864036,1,-0.04436463,False,False,False
8.495,-0.2864036,1,-0.04436463,True,False,False
8.5,-0.2864036,1,-0.04436463,False,False,False
8.505,-0.2864036,1,-0.04436463,True,False,False
8.51,-0.2864036,1,-0.04436463,False,False,False
8.514999,-0.2864036,1,-0.04436463,True,False,False
8.52,-0.2864036,1,-0.04436463,False,False,False
8.525,-0.2864036,1,-0.04436463,True,False,False
8.53,-0.2864036,1,-0.04436463,False,False,False
8.535,-0.2864036,1,-0.04436463,True,False,False
8.54,-0.2864036,1,-0.04436463,False,False,False
8.545,-0.2864036,1,-0.04436463,True,False,False
8.55,-0.2864036,1,-0.04436463,False,False,False
8.554999,-0.2864036,1,-0.04436463,True,False,False
8.559999,-0.2864036,1,-0.04436463,False,False,False
8.565,-0.2864036,1,-0.04436463,True,False,False
8.57,-0.2864036,1,-0.04436463,False,False,False
8.575,-0.2864036,1,-0.04436463,True,False,False
8.58,-0.2864036,1,-0.04436463,False,False,False
8.585,-0.2864036,1,-0.04436463,True,False,False
8.59,-0.2864036,1,-0.04436463,False,False,False
8.595,-0.2864036,1,-0.04436463,True,False,False
8.599999,-0.2864036,1,-0.04436463,False,False,False
8.605,-0.2864036,1,-0.04436463,True,False,False
8.61,-0.2864036,1,-0.04436463,False,False,False
8.615,-0.2864036,1,-0.04436463,True,False,False
8.62,-0.2864036,1,-0.04436463,False,False,False
8.625,-0.2864036,1,-0.04436463,True,False,False
8.63,-0.2864036,1,-0.04436463,False,False,False
8.635,-0.2864036,1,-0.04436463,True,False,False
8.639999,-0.2864036,1,-0.04436463,False,False,False
8.645,-0.2864036,1,-0.04436463,True,False,False
8.65,-0.2864036,1,-0.04436463,False,False,False
8.655,-0.2864036,1,-0.04436463,True,False,False
8.66,-0.2864036,1,-0.04436463,False,False,False
8.665,-0.2864036,1,-0.04436463,True,False,False
8.67,-0.2864036,1,-0.04436463,False,False,False
8.675,-0.2864036,1,-0.04436463,True,False,False
8.679999,-0.2864036,1,-0.04436463,False,False,False
8.684999,-0.2864036,1,-0.04436463,True,False,False
8.69,-0.2864036,1,-0.04436463,False,False,False
8.695,-0.2864036,1,-0.04436463,True,False,False
8.7,-0.2864036,1,-0.04436463,False,False,False
8.705,-0.2864036,1,-0.04436463,True,False,False
8.71,-0.2864036,1,-0.04436463,False,False,False
8.715,-0.2864036,1,-0.04436463,True,False,False
8.72,-0.2864036,1,-0.04436463,False,False,False
8.724999,-0.2864036,1,-0.04436463,True,False,False
8.73,-0.2864036,1,-0.04436463,False,False,False
8.735,-0.2864036,1,-0.04436463,True,False,False
8.74,-0.2864036,1,-0.04436463,False,False,False
8.745,-0.2864036,1,-0.04436463,True,False,False
8.75,-0.2864036,1,-0.04436463,False,False,False
8.755,-0.2864036,1,-0.04436463,True,False,False
8.76,-0.2864036,1,-0.04436463,False,False,False
8.764999,-0.2864036,1,-0.04436463,True,False,False
8.77,-0.2864036,1,-0.04436463,False,False,False
8.775,-0.2864036,1,-0.04436463,True,False,False
8.78,-0.2864036,1,-0.04436463,False,False,False
8.785,-0.2864036,1,-0.04436463,True,False,False
8.79,-0.2864036,1,-0.04436463,False,False,False
8.795,-0.2864036,1,-0.04436463,True,False,False
8.8,-0.2864036,1,-0.04436463,False,False,False
8.804999,-0.2864036,1,-0.04436463,True,False,False
8.809999,-0.2864036,1,-0.04436463,False,False,False
8.815,-0.2864036,1,-0.04436463,True,False,False
8.82,-0.2864036,1,-0.04436463,False,False,False
8.825,-0.2864036,1,-0.04436463,True,False,False
8.83,-0.2864036,1,-0.04436463,False,False,False
8.835,-0.2864036,1,-0.04436463,True,False,False
8.84,-0.2864036,1,-0.04436463,False,False,False
8.845,-0.2864036,1,-0.04436463,True,False,False
8.849999,-0.2864036,1,-0.04436463,False,False,False
8.855,-0.2864036,1,-0.04436463,True,False,False
8.86,-0.2864036,1,-0.04436463,False,False,False
8.865,-0.2864036,1,-0.04436463,True,False,False
8.87,-0.2864036,1,-0.04436463,False,False,False
8.875,-0.2864036,1,-0.04436463,True,False,False
8.88,-0.2864036,1,-0.04436463,False,False,False
8.885,-0.2864036,1,-0.04436463,True,False,False
8.889999,-0.2864036,1,-0.04436463,False,False,False
8.895,-0.2864036,1,-0.04436463,True,False,False
8.9,-0.2864036,1,-0.04436463,False,False,False
8.905,-0.2864036,1,-0.04436463,True,False,False
8.91,-0.2864036,1,-0.04436463,False,False,False
8.915,-0.2864036,1,-0.04436463,True,False,False
8.92,-0.2864036,1,-0.04436463,False,False,False
8.925,-0.2864036,1,-0.04436463,True,False,False
8.929999,-0.2864036,1,-0.04436463,False,False,False
8.934999,-0.2864036,1,-0.04436463,True,False,False
8.94,-0.2864036,1,-0.04436463,False,False,False
8.945,-0.2864036,1,-0.04436463,True,False,False
8.95,-0.2864036,1,-0.04436463,False,False,False
8.955,-0.2864036,1,-0.04436463,True,False,False
8.96,-0.2864036,1,-0.04436463,False,False,False
8.965,-0.2864036,1,-0.04436463,True,False,False
8.97,-0.2864036,1,-0.04436463,False,False,False
8.974999,-0.2864036,1,-0.04436463,True,False,False
8.98,-0.2864036,1,-0.04436463,False,False,False
8.985,-0.2864036,1,-0.04436463,True,False,False
8.99,-0.2864036,1,-0.04436463,False,False,False
8.995,-0.2864036,1,-0.04436463,True,False,False
9,-0.2864036,1,-0.04436463,False,False,False
9.005,-0.2864036,1,-0.04436463,True,False,False
9.01,-0.2864036,1,-0.04436463,False,False,False
9.014999,-0.2864036,1,-0.04436463,True,False,False
9.02,-0.2864036,1,-0.04436463,False,False,False
9.025,-0.2864036,1,-0.04436463,True,False,False
9.03,-0.2864036,1,-0.04436463,False,False,False
9.035,-0.2864036,1,-0.04436463,True,False,False
9.04,-0.2864036,1,-0.04436463,False,False,False
9.045,-0.2864036,1,-0.04436463,True,False,False
9.05,-0.2864036,1,-0.04436463,False,False,False
9.054999,-0.2864036,1,-0.04436463,True,False,False
9.059999,-0.2864036,1,-0.04436463,False,False,False
9.065,-0.2864036,1,-0.04436463,True,False,False
9.07,-0.2864036,1,-0.04436463,False,False,False
9.075,-0.2864036,1,-0.04436463,True,False,False
9.08,-0.2864036,1,-0.04436463,False,False,False
9.085,-0.2864036,1,-0.04436463,True,False,False
9.09,-0.2864036,1,-0.04436463,False,False,False
9.095,-0.2864036,1,-0.04436463,True,False,False
9.099999,-0.2864036,1,-0.04436463,False,False,False
9.105,-0.2864036,1,-0.04436463,True,False,False
9.11,-0.2864036,1,-0.04436463,False,False,False
9.115,-0.2864036,1,-0.04436463,True,False,False
9.12,-0.2864036,1,-0.04436463,False,False,False
9.125,-0.2864036,1,-0.04436463,True,False,False
9.13,-0.2864036,1,-0.04436463,False,False,False
9.135,-0.2864036,1,-0.04436463,True,False,False
9.139999,-0.2864036,1,-0.04436463,False,False,False
9.145,-0.2864036,1,-0.04436463,True,False,False
9.15,-0.2864036,1,-0.04436463,False,False,False
9.155,-0.2864036,1,-0.04436463,True,False,False
9.16,-0.2864036,1,-0.04436463,False,False,False
9.165,-0.2864036,1,-0.04436463,True,False,False
9.17,-0.2864036,1,-0.04436463,False,False,False
9.175,-0.2864036,1,-0.04436463,True,False,False
9.179999,-0.2864036,1,-0.04436463,False,False,False
9.184999,-0.2864036,1,-0.04436463,True,False,False
9.19,-0.2864036,1,-0.04436463,False,False,False
9.195,-0.2864036,1,-0.04436463,True,False,False
9.2,-0.2864036,1,-0.04436463,False,False,False
9.205,-0.2864036,1,-0.04436463,True,False,False
9.21,-0.2864036,1,-0.04436463,False,False,False
9.215,-0.2864036,1,-0.04436463,True,False,False
9.22,-0.2864036,1,-0.04436463,False,False,False
9.224999,-0.2864036,1,-0.04436463,True,False,False
9.23,-0.2864036,1,-0.04436463,False,False,False
9.235,-0.2864036,1,-0.04436463,True,False,False
9.24,-0.2864036,1,-0.04436463,False,False,False
9.245,-0.2864036,1,-0.04436463,True,False,False
9.25,-0.2864036,1,-0.04436463,False,False,False
9.255,-0.2864036,1,-0.04436463,True,False,False
9.26,-0.2864036,1,-0.04436463,False,False,False
9.264999,-0.2864036,1,-0.04436463,True,False,False
9.27,-0.2864036,1,-0.04436463,False,False,False
9.275,-0.2864036,1,-0.04436463,True,False,False
9.28,-0.2864036,1,-0.04436463,False,False,False
9.285,-0.2864036,1,-0.04436463,True,False,False
9.29,-0.2864036,1,-0.04436463,False,False,False
9.295,-0.2864036,1,-0.04436463,True,False,False
9.3,-0.2864036,1,-0.04436463,False,False,False
9.304999,-0.2864036,1,-0.04436463,True,False,False
9.309999,-0.2864036,1,-0.04436463,False,False,False
9.315,-0.2864036,1,-0.04436463,True,False,False
9.32,-0.2864036,1,-0.04436463,False,False,False
9.325,-0.2864036,1,-0.04436463,True,False,False
9.33,-0.2864036,1,-0.04436463,False,False,False
9.335,-0.2864036,1,-0.04436463,True,False,False
9.34,-0.2864036,1,-0.04436463,False,False,False
9.345,-0.2864036,1,-0.04436463,True,False,False
9.349999,-0.2864036,1,-0.04436463,False,False,False
9.355,-0.2864036,1,-0.04436463,True,False,False
9.36,-0.2864036,1,-0.04436463,False,False,False
9.365,-0.2864036,1,-0.04436463,True,False,False
9.37,-0.2864036,1,-0.04436463,False,False,False
9.375,-0.2864036,1,-0.04436463,True,False,False
9.38,-0.2864036,1,-0.04436463,False,False,False
9.385,-0.2864036,1,-0.04436463,True,False,False
9.389999,-0.2864036,1,-0.04436463,False,False,False
9.395,-0.2864036,1,-0.04436463,True,False,False
9.4,-0.2864036,1,-0.04436463,False,False,False
9.405,-0.2864036,1,-0.04436463,True,False,False
9.41,-0.2864036,1,-0.04436463,False,False,False
9.415,-0.2864036,1,-0.04436463,True,False,False
9.42,-0.2864036,1,-0.04436463,False,False,False
9.425,-0.2864036,1,-0.04436463,True,False,False
9.429999,-0.2864036,1,-0.04436463,False,False,False
9.434999,-0.2864036,1,-0.04436463,True,False,False
9.44,-0.2864036,1,-0.04436463,False,False,False
9.445,-0.2864036,1,-0.04436463,True,False,False
9.45,-0.2864036,1,-0.04436463,False,False,False
9.455,-0.2864036,1,-0.04436463,True,False,False
9.46,-0.2864036,1,-0.04436463,False,False,False
9.465,-0.2864036,1,-0.04436463,True,False,False
9.469999,-0.2864036,1,-0.04436463,False,False,False
9.474999,-0.2864036,1,-0.04436463,True,False,False
9.48,-0.2864036,1,-0.04436463,False,False,False
9.485,-0.2864036,1,-0.04436463,True,False,False
9.49,-0.2864036,1,-0.04436463,False,False,False
9.495,-0.2864036,1,-0.04436463,True,False,False
9.5,-0.2864036,1,-0.04436463,False,False,False
9.505,-0.2864036,1,-0.04436463,True,False,False
9.51,-0.2864036,1,-0.04436463,False,False,False
9.514999,-0.2864036,1,-0.04436463,True,False,False
9.52,-0.2864036,1,-0.04436463,False,False,False
9.525,-0.2864036,1,-0.04436463,True,False,False
9.53,-0.2864036,1,-0.04436463,False,False,False
9.535,-0.2864036,1,-0.04436463,True,False,False
9.54,-0.2864036,1,-0.04436463,False,False,False
9.545,-0.2864036,1,-0.04436463,True,False,False
9.55,-0.2864036,1,-0.04436463,False,False,False
9.554999,-0.2864036,1,-0.04436463,True,False,False
9.559999,-0.2864036,1,-0.04436463,False,False,False
9.565,-0.2864036,1,-0.04436463,True,False,False
9.57,-0.2864036,1,-0.04436463,False,False,False
9.575,-0.2864036,1,-0.04436463,True,False,False
9.58,-0.2864036,1,-0.04436463,False,False,False
9.585,-0.2864036,1,-0.04436463,True,False,False
9.59,-0.2864036,1,-0.04436463,False,False,False
9.594999,-0.2864036,1,-0.04436463,True,False,False
9.599999,-0.2864036,1,-0.04436463,False,False,False
9.605,-0.2864036,1,-0.04436463,True,False,False
9.61,-0.2864036,1,-0.04436463,False,False,False
9.615,-0.2864036,1,-0.04436463,True,False,False
9.62,-0.2864036,1,-0.04436463,False,False,False
9.625,-0.2864036,1,-0.04436463,True,False,False
9.63,-0.2864036,1,-0.04436463,False,False,False
9.635,-0.2864036,1,-0.04436463,True,False,False
9.639999,-0.2864036,1,-0.04436463,False,False,False
9.645,-0.2864036,1,-0.04436463,True,False,False
9.65,-0.2864036,1,-0.04436463,False,False,False
9.655,-0.2864036,1,-0.04436463,True,False,False
9.66,-0.2864036,1,-0.04436463,False,False,False
9.665,-0.2864036,1,-0.04436463,True,False,False
9.67,-0.2864036,1,-0.04436463,False,False,False
9.675,-0.2864036,1,-0.04436463,True,False,False
9.679999,-0.2864036,1,-0.04436463,False,False,False
9.684999,-0.2864036,1,-0.04436463,True,False,False
9.69,-0.2864036,1,-0.04436463,False,False,False
9.695,-0.2864036,1,-0.04436463,True,False,False
9.7,-0.2864036,1,-0.04436463,False,False,False
9.705,-0.2864036,1,-0.04436463,True,False,False
9.71,-0.2864036,1,-0.04436463,False,False,False
9.715,-0.2864036,1,-0.04436463,True,False,False
9.719999,-0.2864036,1,-0.04436463,False,False,False
9.724999,-0.2864036,1,-0.04436463,True,False,False
9.73,-0.2864036,1,-0.04436463,False,False,False
9.735,-0.2864036,1,-0.04436463,True,False,False
9.74,-0.2864036,1,-0.04436463,False,False,False
9.745,-0.2864036,1,-0.04436463,True,False,False
9.75,-0.2864036,1,-0.04436463,False,False,False
9.755,-0.2864036,1,-0.04436463,True,False,False
9.76,-0.2864036,1,-0.04436463,False,False,False
9.764999,-0.2864036,1,-0.04436463,True,False,False
9.77,-0.2864036,1,-0.04436463,False,False,False
9.775,-0.2864036,1,-0.04436463,True,False,False
9.78,-0.2864036,1,-0.04436463,False,False,False
9.785,-0.2864036,1,-0.04436463,True,False,False
9.79,-0.2864036,1,-0.04436463,False,False,False
9.795,-0.2864036,1,-0.04436463,True,False,False
9.8,-0.2864036,1,-0.04436463,False,False,False
9.804999,-0.2864036,1,-0.04436463,True,False,False
9.809999,-0.2864036,1,-0.04436463,False,False,False
9.815,-0.2864036,1,-0.04436463,True,False,False
9.82,-0.2864036,1,-0.04436463,False,False,False
9.825,-0.2864036,1,-0.04436463,True,False,False
9.83,-0.2864036,1,-0.04436463,False,False,False
9.835,-0.2864036,1,-0.04436463,True,False,False
9.84,-0.2864036,1,-0.04436463,False,False,False
9.844999,-0.2864036,1,-0.04436463,True,False,False
9.849999,-0.2864036,1,-0.04436463,False,False,False
9.855,-0.2864036,1,-0.04436463,True,False,False
9.86,-0.2864036,1,-0.04436463,False,False,False
9.865,-0.2864036,1,-0.04436463,True,False,False
9.87,-0.2864036,1,-0.04436463,False,False,False
9.875,-0.2864036,1,-0.04436463,True,False,False
9.88,-0.2864036,1,-0.04436463,False,False,False
9.885,-0.2864036,1,-0.04436463,True,False,False
9.889999,-0.2864036,1,-0.04436463,False,False,False
9.895,-0.2864036,1,-0.04436463,True,False,False
9.9,-0.2864036,1,-0.04436463,False,False,False
9.905,-0.2864036,1,-0.04436463,True,False,False
9.91,-0.2864036,1,-0.04436463,False,False,False
9.915,-0.2864036,1,-0.04436463,True,False,False
9.92,-0.2864036,1,-0.04436463,False,False,False
9.925,-0.2864036,1,-0.04436463,True,False,False
9.929999,-0.2864036,1,-0.04436463,False,False,False
9.934999,-0.2864036,1,-0.04436463,True,False,False
9.94,-0.2864036,1,-0.04436463,False,False,False
9.945,-0.2864036,1,-0.04436463,True,False,False
9.95,-0.2864036,1,-0.04436463,False,False,False
9.955,-0.2864036,1,-0.04436463,True,False,False
9.96,-0.2864036,1,-0.04436463,False,False,False
9.965,-0.2864036,1,-0.04436463,True,False,False
9.969999,-0.2864036,1,-0.04436463,False,False,False
9.974999,-0.2864036,1,-0.04436463,True,False,False
9.98,-0.2864036,1,-0.04436463,False,False,False
9.985,-0.2864036,1,-0.04436463,True,False,False
9.99,-0.2864036,1,-0.04436463,False,False,False
9.995,-0.2864036,1,-0.04436463,True,False,False
10,-0.2864036,1,-0.04436463,False,False,False
10.005,-0.2864036,1,-0.04436463,True,False,False
10.01,-0.2864036,1,-0.04436463,False,False,False
10.015,-0.2864036,1,-0.04436463,True,False,False
10.02,-0.2864036,1,-0.04436463,False,False,False
10.025,-0.2864036,1,-0.04436463,True,False,False
10.03,-0.2864036,1,-0.04436463,False,False,False
10.035,-0.2864036,1,-0.04436463,True,False,False
10.04,-0.2864036,1,-0.04436463,False,False,False
10.045,-0.2864036,1,-0.04436463,True,False,False
10.05,-0.2864036,1,-0.04436463,False,False,False
10.055,-0.2864036,1,-0.04436463,True,False,False
10.06,-0.2864036,1,-0.04436463,False,False,False
10.065,-0.2864036,1,-0.04436463,True,False,False
10.07,-0.2864036,1,-0.04436463,False,False,False
10.075,-0.2864036,1,-0.04436463,True,False,False
10.08,-0.2864036,1,-0.04436463,False,False,False
10.085,-0.2864036,1,-0.04436463,True,False,False
10.09,-0.2864036,1,-0.04436463,False,False,False
10.095,-0.2864036,1,-0.04436463,True,False,False
10.1,-0.2864036,1,-0.04436463,False,False,False
10.105,-0.2864036,1,-0.04436463,True,False,False
10.11,-0.2864036,1,-0.04436463,False,False,False
10.115,-0.2864036,1,-0.04436463,True,False,False
10.12,-0.2864036,1,-0.04436463,False,False,False
10.125,-0.2864036,1,-0.04436463,True,False,False
10.13,-0.2864036,1,-0.04436463,False,False,False
10.135,-0.2864036,1,-0.04436463,True,False,False
10.14,-0.2864036,1,-0.04436463,False,False,False
10.145,-0.2864036,1,-0.04436463,True,False,False
10.15,-0.2864036,1,-0.04436463,False,False,False
10.155,-0.2864036,1,-0.04436463,True,False,False
10.16,-0.2864036,1,-0.04436463,False,False,False
10.165,-0.2864036,1,-0.04436463,True,False,False
10.17,-0.2864036,1,-0.04436463,False,False,False
10.175,-0.2864036,1,-0.04436463,True,False,False
10.18,-0.2864036,1,-0.04436463,False,False,False
10.185,-0.2864036,1,-0.04436463,True,False,False
10.19,-0.2864036,1,-0.04436463,False,False,False
10.195,-0.2864036,1,-0.04436463,True,False,False
10.2,-0.2864036,1,-0.04436463,False,False,False
10.205,-0.2864036,1,-0.04436463,True,False,False
10.21,-0.2864036,1,-0.04436463,False,False,False
10.215,-0.2864036,1,-0.04436463,True,False,False
10.22,-0.2864036,1,-0.04436463,False,False,False
10.225,-0.2864036,1,-0.04436463,True,False,False
10.23,-0.2864036,1,-0.04436463,False,False,False
10.235,-0.2864036,1,-0.04436463,True,False,False
10.24,-0.2864036,1,-0.04436463,False,False,False
10.245,-0.2864036,1,-0.04436463,True,False,False
10.25,-0.2864036,1,-0.04436463,False,False,False
10.255,-0.2864036,1,-0.04436463,True,False,False
10.26,-0.2864036,1,-0.04436463,False,False,False
10.265,-0.2864036,1,-0.04436463,True,False,False
10.27,-0.2864036,1,-0.04436463,False,False,False
10.275,-0.2864036,1,-0.04436463,True,False,False
10.28,-0.2864036,1,-0.04436463,False,False,False
10.285,-0.2864036,1,-0.04436463,True,False,False
10.29,-0.2864036,1,-0.04436463,False,False,False
10.295,-0.2864036,1,-0.04436463,True,False,False
10.3,-0.2864036,1,-0.04436463,False,False,False
10.305,-0.2864036,1,-0.04436463,True,False,False
10.31,-0.2864036,1,-0.04436463,False,False,False
10.315,-0.2864036,1,-0.04436463,True,False,False
10.32,-0.2864036,1,-0.04436463,False,False,False
10.325,-0.2864036,1,-0.04436463,True,False,False
10.33,-0.2864036,1,-0.04436463,False,False,False
10.335,-0.2864036,1,-0.04436463,True,False,False
10.34,-0.2864036,1,-0.04436463,False,False,False
10.345,-0.2864036,1,-0.04436463,True,False,False
10.35,-0.2864036,1,-0.04436463,False,False,False
10.355,-0.2864036,1,-0.04436463,True,False,False
10.36,-0.2864036,1,-0.04436463,False,False,False
10.365,-0.2864036,1,-0.04436463,True,False,False
10.37,-0.2864036,1,-0.04436463,False,False,False
10.375,-0.2864036,1,-0.04436463,True,False,False
10.38,-0.2864036,1,-0.04436463,False,False,False
10.385,-0.2864036,1,-0.04436463,True,False,False
10.39,-0.2864036,1,-0.04436463,False,False,False
10.395,-0.2864036,1,-0.04436463,True,False,False
10.4,-0.2864036,1,-0.04436463,False,False,False
10.405,-0.2864036,1,-0.04436463,True,False,False
10.41,-0.2864036,1,-0.04436463,False,False,False
10.415,-0.2864036,1,-0.04436463,True,False,False
10.42,-0.2864036,1,-0.04436463,False,False,False
10.425,-0.2864036,1,-0.04436463,True,False,False
10.43,-0.2864036,1,-0.04436463,False,False,False
10.435,-0.2864036,1,-0.04436463,True,False,False
10.44,-0.2864036,1,-0.04436463,False,False,False
10.445,-0.2864036,1,-0.04436463,True,False,False
10.45,-0.2864036,1,-0.04436463,False,False,False
10.455,-0.2864036,1,-0.04436463,True,False,False
10.46,-0.2864036,1,-0.04436463,False,False,False
10.465,-0.2864036,1,-0.04436463,True,False,False
10.47,-0.2864036,1,-0.04436463,False,False,False
10.475,-0.2864036,1,-0.04436463,True,False,False
10.48,-0.2864036,1,-0.04436463,False,False,False
10.485,-0.2864036,1,-0.04436463,True,False,False
10.49,-0.2864036,1,-0.04436463,False,False,False
10.495,-0.2864036,1,-0.04436463,True,False,False
10.5,-0.2864036,1,-0.04436463,False,False,False
10.505,-0.2864036,1,-0.04436463,True,False,False
10.51,-0.2864036,1,-0.04436463,False,False,False
10.515,-0.2864036,1,-0.04436463,True,False,False
10.52,-0.2864036,1,-0.04436463,False,False,False
10.525,-0.2864036,1,-0.04436463,True,False,False
10.53,-0.2864036,1,-0.04436463,False,False,False
10.535,-0.2864036,1,-0.04436463,True,False,False
10.54,-0.2864036,1,-0.04436463,False,False,False
10.545,-0.2864036,1,-0.04436463,True,False,False
10.55,-0.2864036,1,-0.04436463,False,False,False
10.555,-0.2864036,1,-0.04436463,True,False,False
10.56,-0.2864036,1,-0.04436463,False,False,False
10.565,-0.2864036,1,-0.04436463,True,False,False
10.57,-0.2864036,1,-0.04436463,False,False,False
10.575,-0.2864036,1,-0.04436463,True,False,False
10.58,-0.2864036,1,-0.04436463,False,False,False
10.585,-0.2864036,1,-0.04436463,True,False,False
10.59,-0.2864036,1,-0.04436463,False,False,False
10.595,-0.2864036,1,-0.04436463,True,False,False
10.6,-0.2864036,1,-0.04436463,False,False,False
10.605,-0.2864036,1,-0.04436463,True,False,False
10.61,-0.2864036,1,-0.04436463,False,False,False
10.615,-0.2864036,1,-0.04436463,True,False,False
10.62,-0.2864036,1,-0.04436463,False,False,False
10.625,-0.2864036,1,-0.04436463,True,False,False
10.63,-0.2864036,1,-0.04436463,False,False,False
10.635,-0.2864036,1,-0.04436463,True,False,False
10.64,-0.2864036,1,-0.04436463,False,False,False
10.645,-0.2864036,1,-0.04436463,True,False,False
10.65,-0.2864036,1,-0.04436463,False,False,False
10.655,-0.2864036,1,-0.04436463,True,False,False
10.66,-0.2864036,1,-0.04436463,False,False,False
10.665,-0.2864036,1,-0.04436463,True,False,False
10.67,-0.2864036,1,-0.04436463,False,False,False
10.675,-0.2864036,1,-0.04436463,True,False,False
10.68,-0.2864036,1,-0.04436463,False,False,False
10.685,-0.2864036,1,-0.04436463,True,False,False
10.69,-0.2864036,1,-0.04436463,False,False,False
10.695,-0.2864036,1,-0.04436463,True,False,False
10.7,-0.2864036,1,-0.04436463,False,False,False
10.705,-0.2864036,1,-0.04436463,True,False,False
10.71,-0.2864036,1,-0.04436463,False,False,False
10.715,-0.2864036,1,-0.04436463,True,False,False
10.72,-0.2864036,1,-0.04436463,False,False,False
10.725,-0.2864036,1,-0.04436463,True,False,False
10.73,-0.2864036,1,-0.04436463,False,False,False
10.735,-0.2864036,1,-0.04436463,True,False,False
10.74,-0.2864036,1,-0.04436463,False,False,False
10.745,-0.2864036,1,-0.04436463,True,False,False
10.75,-0.2864036,1,-0.04436463,False,False,False
10.755,-0.2864036,1,-0.04436463,True,False,False
10.76,-0.2864036,1,-0.04436463,False,False,False
10.765,-0.2864036,1,-0.04436463,True,False,False
10.77,-0.2864036,1,-0.04436463,False,False,False
10.775,-0.2864036,1,-0.04436463,True,False,False
10.78,-0.2864036,1,-0.04436463,False,False,False
10.785,-0.2864036,1,-0.04436463,True,False,False
10.79,-0.2864036,1,-0.04436463,False,False,False
10.795,-0.2864036,1,-0.04436463,True,False,False
10.8,-0.2864036,1,-0.04436463,False,False,False
10.805,-0.2864036,1,-0.04436463,True,False,False
10.81,-0.2864036,1,-0.04436463,False,False,False
10.815,-0.2864036,1,-0.04436463,True,False,False
10.82,-0.2864036,1,-0.04436463,False,False,False
10.825,-0.2864036,1,-0.04436463,True,False,False
10.83,-0.2864036,1,-0.04436463,False,False,False
10.835,-0.2864036,1,-0.04436463,True,False,False
10.84,-0.2864036,1,-0.04436463,False,False,False
10.845,-0.2864036,1,-0.04436463,True,False,False
10.85,-0.2864036,1,-0.04436463,False,False,False
10.855,-0.2864036,1,-0.04436463,True,False,False
10.86,-0.2864036,1,-0.04436463,False,False,False
10.865,-0.2864036,1,-0.04436463,True,False,False
10.87,-0.2864036,1,-0.04436463,False,False,False
10.875,-0.2864036,1,-0.04436463,True,False,False
10.88,-0.2864036,1,-0.04436463,False,False,False
10.885,-0.2864036,1,-0.04436463,True,False,False
10.89,-0.2864036,1,-0.04436463,False,False,False
10.895,-0.2864036,1,-0.04436463,True,False,False
10.9,-0.2864036,1,-0.04436463,False,False,False
10.905,-0.2864036,1,-0.04436463,True,False,False
10.91,-0.2864036,1,-0.04436463,False,False,False
10.915,-0.2864036,1,-0.04436463,True,False,False
10.92,-0.2864036,1,-0.04436463,False,False,False
10.925,-0.2864036,1,-0.04436463,True,False,False
10.93,-0.2864036,1,-0.04436463,False,False,False
10.935,-0.2864036,1,-0.04436463,True,False,False
10.94,-0.2864036,1,-0.04436463,False,False,False
10.945,-0.2864036,1,-0.04436463,True,False,False
10.95,-0.2864036,1,-0.04436463,False,False,False
10.955,-0.2864036,1,-0.04436463,True,False,False
10.96,-0.2864036,1,-0.04436463,False,False,False
10.965,-0.2864036,1,-0.04436463,True,False,False
10.97,-0.2864036,1,-0.04436463,False,False,False
10.975,-0.2864036,1,-0.04436463,True,False,False
10.98,-0.2864036,1,-0.04436463,False,False,False
10.985,-0.2864036,1,-0.04436463,True,False,False
10.99,-0.2864036,1,-0.04436463,False,False,False
10.995,-0.2864036,1,-0.04436463,True,False,False
11,-0.2864036,1,-0.04436463,False,False,False
11.005,-0.2864036,1,-0.04436463,True,False,False
11.01,-0.2864036,1,-0.04436463,False,False,False
11.015,-0.2864036,1,-0.04436463,True,False,False
11.02,-0.2864036,1,-0.04436463,False,False,False
11.025,-0.2864036,1,-0.04436463,True,False,False
11.03,-0.2864036,1,-0.04436463,False,False,False
11.035,-0.2864036,1,-0.04436463,True,False,False
11.04,-0.2864036,1,-0.04436463,False,False,False
11.045,-0.2864036,1,-0.04436463,True,False,False
11.05,-0.2864036,1,-0.04436463,False,False,False
11.055,-0.2864036,1,-0.04436463,True,False,False
11.06,-0.2864036,1,-0.04436463,False,False,False
11.065,-0.2864036,1,-0.04436463,True,False,False
11.07,-0.2864036,1,-0.04436463,False,False,False
11.075,-0.2864036,1,-0.04436463,True,False,False
11.08,-0.2864036,1,-0.04436463,False,False,False
11.085,-0.2864036,1,-0.04436463,True,False,False
11.09,-0.2864036,1,-0.04436463,False,False,False
11.095,-0.2864036,1,-0.04436463,True,False,False
11.1,-0.2864036,1,-0.04436463,False,False,False
11.105,-0.2864036,1,-0.04436463,True,False,False
11.11,-0.2864036,1,-0.04436463,False,False,False
11.115,-0.2864036,1,-0.04436463,True,False,False
11.12,-0.2864036,1,-0.04436463,False,False,False
11.125,-0.2864036,1,-0.04436463,True,False,False
11.13,-0.2864036,1,-0.04436463,False,False,False
11.135,-0.2864036,1,-0.04436463,True,False,False
11.14,-0.2864036,1,-0.04436463,False,False,False
11.145,-0.2864036,1,-0.04436463,True,False,False
11.15,-0.2864036,1,-0.04436463,False,False,False
11.155,-0.2864036,1,-0.04436463,True,False,False
11.16,-0.2864036,1,-0.04436463,False,False,False
11.165,-0.2864036,1,-0.04436463,True,False,False
11.17,-0.2864036,1,-0.04436463,False,False,False
11.175,-0.2864036,1,-0.04436463,True,False,False
11.18,-0.2864036,1,-0.04436463,False,False,False
11.185,-0.2864036,1,-0.04436463,True,False,False
11.19,-0.2864036,1,-0.04436463,False,False,False
11.195,-0.2864036,1,-0.04436463,True,False,False
11.2,-0.2864036,1,-0.04436463,False,False,False
11.205,-0.2864036,1,-0.04436463,True,False,False
11.21,-0.2864036,1,-0.04436463,False,False,False
11.215,-0.2864036,1,-0.04436463,True,False,False
11.22,-0.2864036,1,-0.04436463,False,False,False
11.225,-0.2864036,1,-0.04436463,True,False,False
11.23,-0.2864036,1,-0.04436463,False,False,False
11.235,-0.2864036,1,-0.04436463,True,False,False
11.24,-0.2864036,1,-0.04436463,False,False,False
11.245,-0.2864036,1,-0.04436463,True,False,False
11.25,-0.2864036,1,-0.04436463,False,False,False
11.255,-0.2864036,1,-0.04436463,True,False,False
11.26,-0.2864036,1,-0.04436463,False,False,False
11.265,-0.2864036,1,-0.04436463,True,False,False
11.27,-0.2864036,1,-0.04436463,False,False,False
11.275,-0.2864036,1,-0.04436463,True,False,False
11.28,-0.2864036,1,-0.04436463,False,False,False
11.285,-0.2864036,1,-0.04436463,True,False,False
11.29,-0.2864036,1,-0.04436463,False,False,False
11.295,-0.2864036,1,-0.04436463,True,False,False
11.3,-0.2864036,1,-0.04436463,False,False,False
11.305,-0.2864036,1,-0.04436463,True,False,False
11.31,-0.2864036,1,-0.04436463,False,False,False
11.315,-0.2864036,1,-0.04436463,True,False,False
11.32,-0.2864036,1,-0.04436463,False,False,False
11.325,-0.2864036,1,-0.04436463,True,False,False
11.33,-0.2864036,1,-0.04436463,False,False,False
11.335,-0.2864036,1,-0.04436463,True,False,False
11.34,-0.2864036,1,-0.04436463,False,False,False
11.345,-0.2864036,1,-0.04436463,True,False,False
11.35,-0.2864036,1,-0.04436463,False,False,False
11.355,-0.2864036,1,-0.04436463,True,False,False
11.36,-0.2864036,1,-0.04436463,False,False,False
11.365,-0.2864036,1,-0.04436463,True,False,False
11.37,-0.2864036,1,-0.04436463,False,False,False
11.375,-0.2864036,1,-0.04436463,True,False,False
11.38,-0.2864036,1,-0.04436463,False,False,False
11.385,-0.2864036,1,-0.04436463,True,False,False
11.39,-0.2864036,1,-0.04436463,False,False,False
11.395,-0.2864036,1,-0.04436463,True,False,False
11.4,-0.2864036,1,-0.04436463,False,False,False
11.405,-0.2864036,1,-0.04436463,True,False,False
11.41,-0.2864036,1,-0.04436463,False,False,False
11.415,-0.2864036,1,-0.04436463,True,False,False
11.42,-0.2864036,1,-0.04436463,False,False,False
11.425,-0.2864036,1,-0.04436463,True,False,False
11.43,-0.2864036,1,-0.04436463,False,False,False
11.435,-0.2864036,1,-0.04436463,True,False,False
11.44,-0.2864036,1,-0.04436463,False,False,False
11.445,-0.2864036,1,-0.04436463,True,False,False
11.45,-0.2864036,1,-0.04436463,False,False,False
11.455,-0.2864036,1,-0.04436463,True,False,False
11.46,-0.2864036,1,-0.04436463,False,False,False
11.465,-0.2864036,1,-0.04436463,True,False,False
11.47,-0.2864036,1,-0.04436463,False,False,False
11.475,-0.2864036,1,-0.04436463,True,False,False
11.48,-0.2864036,1,-0.04436463,False,False,False
11.485,-0.2864036,1,-0.04436463,True,False,False
11.49,-0.2864036,1,-0.04436463,False,False,False
11.495,-0.2864036,1,-0.04436463,True,False,False
11.5,-0.2864036,1,-0.04436463,False,False,False
11.505,-0.2864036,1,-0.04436463,True,False,False
11.51,-0.2864036,1,-0.04436463,False,False,False
11.515,-0.2864036,1,-0.04436463,True,False,False
11.52,-0.2864036,1,-0.04436463,False,False,False
11.525,-0.2864036,1,-0.04436463,True,False,False
11.53,-0.2864036,1,-0.04436463,False,False,False
11.535,-0.2864036,1,-0.04436463,True,False,False
11.54,-0.2864036,1,-0.04436463,False,False,False
11.545,-0.2864036,1,-0.04436463,True,False,False
11.55,-0.2864036,1,-0.04436463,False,False,False
11.555,-0.2864036,1,-0.04436463,True,False,False
11.56,-0.2864036,1,-0.04436463,False,False,False
11.565,-0.2864036,1,-0.04436463,True,False,False
11.57,-0.2864036,1,-0.04436463,False,False,False
11.575,-0.2864036,1,-0.04436463,True,False,False
11.58,-0.2864036,1,-0.04436463,False,False,False
11.585,-0.2864036,1,-0.04436463,True,False,False
11.59,-0.2864036,1,-0.04436463,False,False,False
11.595,-0.2864036,1,-0.04436463,True,False,False
11.6,-0.2864036,1,-0.04436463,False,False,False
11.605,-0.2864036,1,-0.04436463,True,False,False
11.61,-0.2864036,1,-0.04436463,False,False,False
11.615,-0.2864036,1,-0.04436463,True,False,False
11.62,-0.2864036,1,-0.04436463,False,False,False
11.625,-0.2864036,1,-0.04436463,True,False,False
11.63,-0.2864036,1,-0.04436463,False,False,False
11.635,-0.2864036,1,-0.04436463,True,False,False
11.64,-0.2864036,1,-0.04436463,False,False,False
11.645,-0.2864036,1,-0.04436463,True,False,False
11.65,-0.2864036,1,-0.04436463,False,False,False
11.655,-0.2864036,1,-0.04436463,True,False,False
11.66,-0.2864036,1,-0.04436463,False,False,False
11.665,-0.2864036,1,-0.04436463,True,False,False
11.67,-0.2864036,1,-0.04436463,False,False,False
11.675,-0.2864036,1,-0.04436463,True,False,False
11.68,-0.2864036,1,-0.04436463,False,False,False
11.685,-0.2864036,1,-0.04436463,True,False,False
11.69,-0.2864036,1,-0.04436463,False,False,False
11.695,-0.2864036,1,-0.04436463,True,False,False
11.7,-0.2864036,1,-0.04436463,False,False,False
11.705,-0.2864036,1,-0.04436463,True,False,False
11.71,-0.2864036,1,-0.04436463,False,False,False
11.715,-0.2864036,1,-0.04436463,True,False,False
11.72,-0.2864036,1,-0.04436463,False,False,False
11.725,-0.2864036,1,-0.04436463,True,False,False
11.73,-0.2864036,1,-0.04436463,False,False,False
11.735,-0.2864036,1,-0.04436463,True,False,False
11.74,-0.2864036,1,-0.04436463,False,False,False
11.745,-0.2864036,1,-0.04436463,True,False,False
11.75,-0.2864036,1,-0.04436463,False,False,False
11.755,-0.2864036,1,-0.04436463,True,False,False
11.76,-0.2864036,1,-0.04436463,False,False,False
11.765,-0.2864036,1,-0.04436463,True,False,False
11.77,-0.2864036,1,-0.04436463,False,False,False
11.775,-0.2864036,1,-0.04436463,True,False,False
11.78,-0.2864036,1,-0.04436463,False,False,False
11.785,-0.2864036,1,-0.04436463,True,False,False
11.79,-0.2864036,1,-0.04436463,False,False,False
11.795,-0.2864036,1,-0.04436463,True,False,False
11.8,-0.2864036,1,-0.04436463,False,False,False
11.805,-0.2864036,1,-0.04436463,True,False,False
11.81,-0.2864036,1,-0.04436463,False,False,False
11.815,-0.2864036,1,-0.04436463,True,False,False
11.82,-0.2864036,1,-0.04436463,False,False,False
11.825,-0.2864036,1,-0.04436463,True,False,False
11.83,-0.2864036,1,-0.04436463,False,False,False
11.835,-0.2864036,1,-0.04436463,True,False,False
11.84,-0.2864036,1,-0.04436463,False,False,False
11.845,-0.2864036,1,-0.04436463,True,False,False
11.85,-0.2864036,1,-0.04436463,False,False,False
11.855,-0.2864036,1,-0.04436463,True,False,False
11.86,-0.2864036,1,-0.04436463,False,False,False
11.865,-0.2864036,1,-0.04436463,True,False,False
11.87,-0.2864036,1,-0.04436463,False,False,False
11.875,-0.2864036,1,-0.04436463,True,False,False
11.88,-0.2864036,1,-0.04436463,False,False,False
11.885,-0.2864036,1,-0.04436463,True,False,False
11.89,-0.2864036,1,-0.04436463,False,False,False
11.895,-0.2864036,1,-0.04436463,True,False,False
11.9,-0.2864036,1,-0.04436463,False,False,False
11.905,-0.2864036,1,-0.04436463,True,False,False
11.91,-0.2864036,1,-0.04436463,False,False,False
11.915,-0.2864036,1,-0.04436463,True,False,False
11.92,-0.2864036,1,-0.04436463,False,False,False
11.925,-0.2864036,1,-0.04436463,True,False,False
11.93,-0.2864036,1,-0.04436463,False,False,False
11.935,-0.2864036,1,-0.04436463,True,False,False
11.94,-0.2864036,1,-0.04436463,False,False,False
11.945,-0.2864036,1,-0.04436463,True,False,False
11.95,-0.2864036,1,-0.04436463,False,False,False
11.955,-0.2864036,1,-0.04436463,True,False,False
11.96,-0.2864036,1,-0.04436463,False,False,False
11.965,-0.2864036,1,-0.04436463,True,False,False
