Time,X,Y,Z,SIGNAL,REWARD,BUTTON
0,0,1,0,False,False,False
0,0,1,4.356553E-23,False,False,False
0.005,0,1,8.720034E-23,True,False,False
0.01,0,1,1.308352E-22,False,False,False
0.015,0,1,1.7447E-22,True,False,False
0.02,0,1,2.181053E-22,False,False,False
0.025,0.175,1,-1.18,True,False,False
0.03,0.175,1,-1.18,False,False,False
0.035,0.175,1,-1.18,True,False,False
0.04,0.175,1,-1.18,False,False,False
0.045,0.175,1,-1.18,True,False,False
0.05,0.175,1,-1.18,False,False,False
0.055,0.2153025,1,-1.151612,True,False,False
0.06,0.2153025,1,-1.151612,False,False,False
0.065,0.2153025,1,-1.151612,True,False,False
0.07,0.2153025,1,-1.151612,False,False,False
0.075,0.2153025,1,-1.151612,True,False,False
0.08,0.2153025,1,-1.151612,False,False,False
0.085,0.2156128,1,-1.147455,True,False,False
0.09,0.2156128,1,-1.147455,False,False,False
0.095,0.2156128,1,-1.147455,True,False,False
0.09999999,0.2156128,1,-1.147455,False,False,False
0.105,0.2025791,1,-1.142002,True,False,False
0.11,0.2025791,1,-1.142002,False,False,False
0.115,0.2025791,1,-1.142002,True,False,False
0.12,0.2025791,1,-1.142002,False,False,False
0.125,0.1219023,1,-1.165476,True,False,False
0.13,0.1219023,1,-1.165476,False,False,False
0.135,0.1065409,1,-1.189898,True,False,False
0.14,0.1065409,1,-1.189898,False,False,False
0.145,0.09899104,1,-1.22147,True,False,False
0.15,0.09899104,1,-1.22147,False,False,False
0.155,0.09899104,1,-1.22147,True,False,False
0.16,0.09899104,1,-1.22147,False,False,False
0.165,0.09899104,1,-1.22147,True,False,False
0.17,0.09899104,1,-1.22147,False,False,False
0.175,0.09899104,1,-1.22147,True,False,False
0.18,0.09899104,1,-1.22147,False,False,False
0.185,0.09899104,1,-1.22147,True,False,False
0.19,0.09899104,1,-1.22147,False,False,False
0.195,0.09899104,1,-1.22147,True,False,False
0.2,0.09899104,1,-1.22147,False,False,False
0.205,0.09899104,1,-1.22147,True,False,False
0.21,0.09899104,1,-1.22147,False,False,False
0.215,0.09899104,1,-1.22147,True,False,False
0.22,0.09899104,1,-1.22147,False,False,False
0.225,0.09899104,1,-1.22147,True,False,False
0.23,0.09899104,1,-1.22147,False,False,False
0.235,0.09899104,1,-1.22147,True,False,False
0.24,0.09899104,1,-1.22147,False,False,False
0.245,0.09899104,1,-1.22147,True,False,False
0.25,0.09899104,1,-1.22147,False,False,False
0.255,0.09899104,1,-1.22147,True,False,False
0.26,0.09899104,1,-1.22147,False,False,False
0.265,0.09899104,1,-1.22147,True,False,False
0.27,0.09899104,1,-1.22147,False,False,False
0.275,0.09899104,1,-1.22147,True,False,False
0.28,0.09899104,1,-1.22147,False,False,False
0.285,0.09899104,1,-1.22147,True,False,False
0.29,0.09899104,1,-1.22147,False,False,False
0.295,0.09899104,1,-1.22147,True,False,False
0.3,0.09899104,1,-1.22147,False,False,False
0.305,0.09899104,1,-1.22147,True,False,False
0.31,0.09899104,1,-1.22147,False,False,False
0.315,0.09899104,1,-1.22147,True,False,False
0.32,0.09899104,1,-1.22147,False,False,False
0.325,0.09899104,1,-1.22147,True,False,False
0.33,0.09899104,1,-1.22147,False,False,False
0.335,0.09899104,1,-1.22147,True,False,False
0.34,0.09899104,1,-1.22147,False,False,False
0.345,0.09899104,1,-1.22147,True,False,False
0.35,0.09899104,1,-1.22147,False,False,False
0.355,0.09899104,1,-1.22147,True,False,False
0.36,0.09899104,1,-1.22147,False,False,False
0.365,0.09899104,1,-1.22147,True,False,False
0.37,0.09899104,1,-1.22147,False,False,False
0.375,0.09899104,1,-1.22147,True,False,False
0.38,0.09899104,1,-1.22147,False,False,False
0.385,0.09899104,1,-1.22147,True,False,False
0.39,0.09899104,1,-1.22147,False,False,False
0.395,0.09899104,1,-1.22147,True,False,False
0.4,0.09899104,1,-1.22147,False,False,False
0.405,0.09899104,1,-1.22147,True,False,False
0.41,0.09899104,1,-1.22147,False,False,False
0.415,0.09899104,1,-1.22147,True,False,False
0.42,0.09899104,1,-1.22147,False,False,False
0.425,0.09899104,1,-1.22147,True,False,False
0.43,0.1075539,1,-1.218946,False,False,False
0.435,0.1075539,1,-1.218946,True,False,False
0.44,0.1131876,1,-1.216392,False,False,False
0.445,0.1158835,1,-1.213285,True,False,False
0.45,0.1158835,1,-1.213285,False,False,False
0.455,0.118081,1,-1.202771,True,False,False
0.46,0.1183246,1,-1.196906,False,False,False
0.465,0.1183246,1,-1.196906,True,False,False
0.47,0.1183246,1,-1.196906,False,False,False
0.475,0.1183246,1,-1.196906,True,False,False
0.48,0.1183246,1,-1.196906,False,False,False
0.485,0.1307255,1,-1.191336,True,False,False
0.49,0.1323938,1,-1.189814,False,False,False
0.495,0.1323938,1,-1.189814,True,False,False
0.5,0.1324981,1,-1.187563,False,False,False
0.505,0.1316986,1,-1.186686,True,False,False
0.51,0.1316986,1,-1.186686,False,False,False
0.515,0.1285393,1,-1.18492,True,False,False
0.52,0.1285393,1,-1.18492,False,False,False
0.525,0.1213363,1,-1.180905,True,False,False
0.53,0.1143437,1,-1.179196,False,False,False
0.535,0.1033895,1,-1.175588,True,False,False
0.54,0.1033895,1,-1.175588,False,False,False
0.545,0.1033895,1,-1.175588,True,False,False
0.55,0.09085971,1,-1.173562,False,False,False
0.555,0.08474976,1,-1.173369,True,False,False
0.56,0.0654589,1,-1.172801,False,False,False
0.565,0.0654589,1,-1.172801,True,False,False
0.57,0.0450845,1,-1.170636,False,False,False
0.575,0.03416307,1,-1.170466,True,False,False
0.58,0.01927958,1,-1.169226,False,False,False
0.585,0.01927958,1,-1.169226,True,False,False
0.59,0.005734869,1,-1.169137,False,False,False
0.595,0.005734869,1,-1.169137,True,False,False
0.6,-0.01074883,1,-1.168008,False,False,False
0.605,-0.01405401,1,-1.168021,True,False,False
0.61,-0.02928432,1,-1.167011,False,False,False
0.615,-0.02928432,1,-1.167011,True,False,False
0.62,-0.04294896,1,-1.166177,False,False,False
0.625,-0.04294896,1,-1.166177,True,False,False
0.63,-0.06475855,1,-1.164832,False,False,False
0.635,-0.07774278,1,-1.164047,True,False,False
0.64,-0.09008028,1,-1.163357,False,False,False
0.645,-0.09008028,1,-1.163357,True,False,False
0.65,-0.09671368,1,-1.16274,False,False,False
0.655,-0.1033782,1,-1.162017,True,False,False
0.66,-0.1033782,1,-1.162017,False,False,False
0.665,-0.1196263,1,-1.161131,True,False,False
0.67,-0.1265045,1,-1.160441,False,False,False
0.675,-0.1265045,1,-1.160441,True,False,False
0.68,-0.1338539,1,-1.160766,False,False,False
0.685,-0.1396923,1,-1.16104,True,False,False
0.69,-0.1396923,1,-1.16104,False,False,False
0.695,-0.1435838,1,-1.16123,True,False,False
0.7,-0.1460007,1,-1.161352,False,False,False
0.705,-0.1460007,1,-1.161352,True,False,False
0.71,-0.1460007,1,-1.161352,False,False,False
0.715,-0.1460007,1,-1.161352,True,False,False
0.72,-0.1460007,1,-1.161352,False,False,False
0.725,-0.1460007,1,-1.161352,True,False,False
0.73,-0.1460007,1,-1.161352,False,False,False
0.735,-0.1460007,1,-1.161352,True,False,False
0.74,-0.14492,1,-1.161296,False,False,False
0.745,-0.143402,1,-1.161219,True,False,False
0.75,-0.143402,1,-1.161219,False,False,False
0.755,-0.1396916,1,-1.161033,True,False,False
0.76,-0.1331881,1,-1.159987,False,False,False
0.765,-0.1331881,1,-1.159987,True,False,False
0.77,-0.1267872,1,-1.159689,False,False,False
0.775,-0.1221498,1,-1.159483,True,False,False
0.78,-0.1027584,1,-1.156881,False,False,False
0.785,-0.1027584,1,-1.156881,True,False,False
0.79,-0.09368925,1,-1.156555,False,False,False
0.795,-0.09368925,1,-1.156555,True,False,False
0.8,-0.0733304,1,-1.155038,False,False,False
0.805,-0.05913082,1,-1.153884,True,False,False
0.81,-0.05913082,1,-1.153884,False,False,False
0.815,-0.03284302,1,-1.152518,True,False,False
0.82,-0.03284302,1,-1.152518,False,False,False
0.825,-0.02231698,1,-1.152397,True,False,False
0.83,-0.003262393,1,-1.151719,False,False,False
0.835,-0.003262393,1,-1.151719,True,False,False
0.84,0.03843198,1,-1.149533,False,False,False
0.845,0.07103878,1,-1.149089,True,False,False
0.85,0.1124895,1,-1.147681,False,False,False
0.855,0.1124895,1,-1.147681,True,False,False
0.86,0.1427586,1,-1.147189,False,False,False
0.865,0.1713597,1,-1.147396,True,False,False
0.87,0.1713597,1,-1.147396,False,False,False
0.875,0.21279,1,-1.148147,True,False,False
0.88,0.21279,1,-1.148147,False,False,False
0.885,0.3105975,1,-1.150964,True,False,False
0.89,0.4124321,1,-1.158094,False,False,False
0.895,0.4124321,1,-1.158094,True,False,False
0.9,0.5001263,1,-1.167018,False,False,False
0.905,0.5978066,1,-1.180805,True,False,False
0.91,0.6807848,1,-1.195167,False,False,False
0.915,0.6807848,1,-1.195167,True,False,False
0.92,0.6979287,1,-1.198643,False,False,False
0.925,0.6979287,1,-1.198643,True,False,False
0.93,0.7492765,1,-1.209456,False,False,False
0.935,0.8350282,1,-1.229097,True,False,False
0.94,0.8556218,1,-1.234452,False,False,False
0.945,0.8556218,1,-1.234452,True,False,False
0.95,0.905045,1,-1.248796,False,False,False
0.955,0.9395355,1,-1.258705,True,False,False
0.96,0.9395355,1,-1.258705,False,False,False
0.965,0.9571461,1,-1.263973,True,False,False
0.97,0.9767087,1,-1.270401,False,False,False
0.975,0.9767087,1,-1.270401,True,False,False
0.98,0.9947193,1,-1.275606,False,False,False
0.985,1.000453,1,-1.277334,True,False,False
0.9899999,1.000453,1,-1.277334,False,False,False
0.995,1.000453,1,-1.277334,True,False,False
1,1.070885,1,-1.29887,False,False,False
1.005,1.070885,1,-1.29887,True,False,False
1.01,1.08294,1,-1.302149,False,False,False
1.015,1.08294,1,-1.302149,True,False,False
1.02,1.08294,1,-1.302149,False,False,False
1.025,1.099813,1,-1.306998,True,False,False
1.03,1.109269,1,-1.309089,False,False,False
1.035,1.109269,1,-1.309089,True,False,False
1.04,1.112988,1,-1.309744,False,False,False
1.045,1.118155,1,-1.311018,True,False,False
1.05,1.118155,1,-1.311018,False,False,False
1.055,1.120519,1,-1.310998,True,False,False
1.06,1.120911,1,-1.310063,False,False,False
1.065,1.120911,1,-1.310063,True,False,False
1.07,1.119398,1,-1.308304,False,False,False
1.075,1.115605,1,-1.305744,True,False,False
1.08,1.115605,1,-1.305744,False,False,False
1.085,1.068493,1,-1.279678,True,False,False
1.09,1.068493,1,-1.279678,False,False,False
1.095,1.048017,1,-1.271594,True,False,False
1.1,1.032383,1,-1.265561,False,False,False
1.105,1.010208,1,-1.258801,True,False,False
1.11,1.010208,1,-1.258801,False,False,False
1.115,1.000097,1,-1.256552,True,False,False
1.12,0.9928493,1,-1.254882,False,False,False
1.125,0.9889949,1,-1.253749,True,False,False
1.13,0.9889949,1,-1.253749,False,False,False
1.135,0.9829137,1,-1.251947,True,False,False
1.14,0.9829137,1,-1.251947,False,False,False
1.145,0.9775668,1,-1.250027,True,False,False
1.15,0.9705601,1,-1.247983,False,False,False
1.155,0.9705601,1,-1.247983,True,False,False
1.16,0.9666997,1,-1.246617,False,False,False
1.165,0.9589618,1,-1.243891,True,False,False
1.17,0.9589618,1,-1.243891,False,False,False
1.175,0.9539478,1,-1.241613,True,False,False
1.18,0.9466824,1,-1.238632,False,False,False
1.185,0.9466824,1,-1.238632,True,False,False
1.19,0.9407015,1,-1.23694,False,False,False
1.195,0.9341815,1,-1.235055,True,False,False
1.2,0.9341815,1,-1.235055,False,False,False
1.205,0.9318625,1,-1.23427,True,False,False
1.21,0.9224379,1,-1.231086,False,False,False
1.215,0.9224379,1,-1.231086,True,False,False
1.22,0.9153569,1,-1.228389,False,False,False
1.225,0.9093251,1,-1.226392,True,False,False
1.23,0.9093251,1,-1.226392,False,False,False
1.235,0.8953557,1,-1.221802,True,False,False
1.24,0.8826422,1,-1.217698,False,False,False
1.245,0.8826422,1,-1.217698,True,False,False
1.25,0.8700897,1,-1.213369,False,False,False
1.255,0.8615615,1,-1.210703,True,False,False
1.26,0.8472928,1,-1.206291,False,False,False
1.265,0.8472928,1,-1.206291,True,False,False
1.27,0.8307487,1,-1.201652,False,False,False
1.275,0.8307487,1,-1.201652,True,False,False
1.28,0.8109677,1,-1.195777,False,False,False
1.285,0.7772413,1,-1.186992,True,False,False
1.29,0.750808,1,-1.180393,False,False,False
1.295,0.750808,1,-1.180393,True,False,False
1.3,0.7195334,1,-1.172854,False,False,False
1.305,0.7195334,1,-1.172854,True,False,False
1.31,0.7042931,1,-1.169328,False,False,False
1.315,0.6602035,1,-1.159786,True,False,False
1.32,0.6602035,1,-1.159786,False,False,False
1.325,0.6255551,1,-1.152455,True,False,False
1.33,0.5831293,1,-1.14398,False,False,False
1.335,0.5831293,1,-1.14398,True,False,False
1.34,0.5438213,1,-1.136379,False,False,False
1.345,0.4999182,1,-1.128525,True,False,False
1.35,0.4999182,1,-1.128525,False,False,False
1.355,0.4714149,1,-1.123621,True,False,False
1.36,0.4529515,1,-1.120636,False,False,False
1.365,0.4529515,1,-1.120636,True,False,False
1.37,0.3955117,1,-1.111734,False,False,False
1.375,0.3598534,1,-1.106946,True,False,False
1.38,0.3365043,1,-1.104109,False,False,False
1.385,0.3365043,1,-1.104109,True,False,False
1.39,0.3146533,1,-1.100325,False,False,False
1.395,0.3048025,1,-1.098714,True,False,False
1.4,0.3048025,1,-1.098714,False,False,False
1.405,0.3016371,1,-1.098392,True,False,False
1.41,0.3016371,1,-1.098392,False,False,False
1.415,0.3025976,1,-1.098824,True,False,False
1.42,0.3052456,1,-1.099545,False,False,False
1.425,0.3052456,1,-1.099545,True,False,False
1.43,0.3052456,1,-1.099545,False,False,False
1.435,0.3052456,1,-1.099545,True,False,False
1.44,0.3052456,1,-1.099545,False,False,False
1.445,0.3052456,1,-1.099545,True,False,False
1.45,0.3052456,1,-1.099545,False,False,False
1.455,0.3052456,1,-1.099545,True,False,False
1.46,0.3052456,1,-1.099545,False,False,False
1.465,0.3052456,1,-1.099545,True,False,False
1.47,0.3052456,1,-1.099545,False,False,False
1.475,0.3052456,1,-1.099545,True,False,False
1.48,0.3052456,1,-1.099545,False,False,False
1.485,0.3052456,1,-1.099545,True,False,False
1.49,0.3052456,1,-1.099545,False,False,False
1.495,0.3052456,1,-1.099545,True,False,False
1.5,0.3052456,1,-1.099545,False,False,False
1.505,0.3052456,1,-1.099545,True,False,False
1.51,0.3052456,1,-1.099545,False,False,False
1.515,0.3052456,1,-1.099545,True,False,False
1.52,0.3052456,1,-1.099545,False,False,False
1.525,0.3052456,1,-1.099545,True,False,False
1.53,0.3052456,1,-1.099545,False,False,False
1.535,0.3052456,1,-1.099545,True,False,False
1.54,0.3052456,1,-1.099545,False,False,False
1.545,0.3052456,1,-1.099545,True,False,False
1.55,0.3052456,1,-1.099545,False,False,False
1.555,0.3052456,1,-1.099545,True,False,False
1.56,0.3052456,1,-1.099545,False,False,False
1.565,0.3052456,1,-1.099545,True,False,False
1.57,0.3064361,1,-1.099666,False,False,False
1.575,0.3064361,1,-1.099666,True,False,False
1.58,0.3104176,1,-1.099415,False,False,False
1.585,0.3162207,1,-1.100439,True,False,False
1.59,0.3162207,1,-1.100439,False,False,False
1.595,0.3147691,1,-1.100643,True,False,False
1.6,0.3126267,1,-1.101249,False,False,False
1.605,0.3126267,1,-1.101249,True,False,False
1.61,0.3039166,1,-1.102573,False,False,False
1.615,0.2912186,1,-1.103572,True,False,False
1.62,0.2811365,1,-1.103849,False,False,False
1.625,0.2811365,1,-1.103849,True,False,False
1.63,0.271786,1,-1.103973,False,False,False
1.635,0.2520466,1,-1.103599,True,False,False
1.64,0.2520466,1,-1.103599,False,False,False
1.645,0.1454266,1,-1.096203,True,False,False
1.65,0.1454266,1,-1.096203,False,False,False
1.655,0.1150766,1,-1.09552,True,False,False
1.66,0.08580315,1,-1.095754,False,False,False
1.665,0.08580315,1,-1.095754,True,False,False
1.67,0.04877581,1,-1.096243,False,False,False
1.675,0.00312921,1,-1.096915,True,False,False
1.68,0.00312921,1,-1.096915,False,False,False
1.685,-0.04056077,1,-1.098058,True,False,False
1.69,-0.0673011,1,-1.099808,False,False,False
1.695,-0.1080594,1,-1.101929,True,False,False
1.7,-0.1080594,1,-1.101929,False,False,False
1.705,-0.1622074,1,-1.105927,True,False,False
1.71,-0.1622074,1,-1.105927,False,False,False
1.715,-0.2079829,1,-1.109771,True,False,False
1.72,-0.2563907,1,-1.114483,False,False,False
1.725,-0.2563907,1,-1.114483,True,False,False
1.73,-0.304776,1,-1.119729,False,False,False
1.735,-0.3460337,1,-1.124343,True,False,False
1.74,-0.3675223,1,-1.127063,False,False,False
1.745,-0.3675223,1,-1.127063,True,False,False
1.75,-0.4407265,1,-1.136443,False,False,False
1.755,-0.4888437,1,-1.14349,True,False,False
1.76,-0.4888437,1,-1.14349,False,False,False
1.765,-0.5520042,1,-1.151571,True,False,False
1.77,-0.5520042,1,-1.151571,False,False,False
1.775,-0.5898278,1,-1.156864,True,False,False
1.78,-0.6310848,1,-1.163013,False,False,False
1.785,-0.6310848,1,-1.163013,True,False,False
1.79,-0.6465725,1,-1.165431,False,False,False
1.795,-0.6465725,1,-1.165431,True,False,False
1.8,-0.6465725,1,-1.165431,False,False,False
1.805,-0.6465725,1,-1.165431,True,False,False
1.81,-0.6465725,1,-1.165431,False,False,False
1.815,-0.6465725,1,-1.165431,True,False,False
1.82,-0.6465725,1,-1.165431,False,False,False
1.825,-0.6465725,1,-1.165431,True,False,False
1.83,-0.6465725,1,-1.165431,False,False,False
1.835,-0.6465725,1,-1.165431,True,False,False
1.84,-0.6465725,1,-1.165431,False,False,False
1.845,-0.6465725,1,-1.165431,True,False,False
1.85,-0.6465725,1,-1.165431,False,False,False
1.855,-0.6465725,1,-1.165431,True,False,False
1.86,-0.6465725,1,-1.165431,False,False,False
1.865,-0.6465725,1,-1.165431,True,False,False
1.87,-0.6465725,1,-1.165431,False,False,False
1.875,-0.6465725,1,-1.165431,True,False,False
1.88,-0.6465725,1,-1.165431,False,False,False
1.885,-0.6465725,1,-1.165431,True,False,False
1.89,-0.6465725,1,-1.165431,False,False,False
1.895,-0.6465725,1,-1.165431,True,False,False
1.9,-0.6465725,1,-1.165431,False,False,False
1.905,-0.6465725,1,-1.165431,True,False,False
1.91,-0.6465725,1,-1.165431,False,False,False
1.915,-0.6465725,1,-1.165431,True,False,False
1.92,-0.6465725,1,-1.165431,False,False,False
1.925,-0.6465725,1,-1.165431,True,False,False
1.93,-0.6465725,1,-1.165431,False,False,False
1.935,-0.6465725,1,-1.165431,True,False,False
1.94,-0.6465725,1,-1.165431,False,False,False
1.945,-0.6465725,1,-1.165431,True,False,False
1.95,-0.6465725,1,-1.165431,False,False,False
1.955,-0.6465725,1,-1.165431,True,False,False
1.96,-0.6465725,1,-1.165431,False,False,False
1.965,-0.6465725,1,-1.165431,True,False,False
1.97,-0.6465725,1,-1.165431,False,False,False
1.975,-0.6465725,1,-1.165431,True,False,False
1.98,-0.6465725,1,-1.165431,False,False,False
1.985,-0.6465725,1,-1.165431,True,False,False
1.99,-0.6465725,1,-1.165431,False,False,False
1.995,-0.6448866,1,-1.165033,True,False,False
2,-0.6448866,1,-1.165033,False,False,False
2.005,-0.6459714,1,-1.166786,True,False,False
2.01,-0.651754,1,-1.169964,False,False,False
2.015,-0.651754,1,-1.169964,True,False,False
2.02,-0.6607977,1,-1.174275,False,False,False
2.025,-0.6607977,1,-1.174275,True,False,False
2.03,-0.6791747,1,-1.186224,False,False,False
2.035,-0.7043696,1,-1.201912,True,False,False
2.04,-0.7043696,1,-1.201912,False,False,False
2.045,-0.7338293,1,-1.217318,True,False,False
2.05,-0.7788206,1,-1.239675,False,False,False
2.055,-0.8193402,1,-1.258823,True,False,False
2.06,-0.8193402,1,-1.258823,False,False,False
2.065,-0.8411665,1,-1.269797,True,False,False
2.07,-0.8411665,1,-1.269797,False,False,False
2.075,-0.8848941,1,-1.290632,True,False,False
2.08,-0.9506511,1,-1.321569,False,False,False
2.085,-0.9506511,1,-1.321569,True,False,False
2.09,-1.007245,1,-1.347782,False,False,False
2.095,-1.075024,1,-1.379498,True,False,False
2.1,-1.075024,1,-1.379498,False,False,False
2.105,-1.145232,1,-1.411801,True,False,False
2.11,-1.216051,1,-1.445599,False,False,False
2.115,-1.266786,1,-1.471151,True,False,False
2.12,-1.266786,1,-1.471151,False,False,False
2.125,-1.282821,1,-1.479307,True,False,False
2.13,-1.324962,1,-1.501075,False,False,False
2.135,-1.324962,1,-1.501075,True,False,False
2.14,-1.390614,1,-1.536376,False,False,False
2.145,-1.426841,1,-1.556669,True,False,False
2.15,-1.426841,1,-1.556669,False,False,False
2.155,-1.457944,1,-1.575055,True,False,False
2.16,-1.474311,1,-1.58501,False,False,False
2.165,-1.474311,1,-1.58501,True,False,False
2.17,-1.491251,1,-1.595986,False,False,False
2.175,-1.491251,1,-1.595986,True,False,False
2.18,-1.497122,1,-1.600646,False,False,False
2.185,-1.497122,1,-1.600646,True,False,False
2.19,-1.497122,1,-1.600646,False,False,False
2.195,-1.497122,1,-1.600646,True,False,False
2.2,-1.497122,1,-1.600646,False,False,False
2.205,-1.497122,1,-1.600646,True,False,False
2.21,-1.497122,1,-1.600646,False,False,False
2.215,-1.497122,1,-1.600646,True,False,False
2.22,-1.497122,1,-1.600646,False,False,False
2.225,-1.497122,1,-1.600646,True,False,False
2.23,-1.497122,1,-1.600646,False,False,False
2.235,-1.497122,1,-1.600646,True,False,False
2.24,-1.497122,1,-1.600646,False,False,False
2.245,-1.497122,1,-1.600646,True,False,False
2.25,-1.497122,1,-1.600646,False,False,False
2.255,-1.497122,1,-1.600646,True,False,False
2.26,-1.497122,1,-1.600646,False,False,False
2.265,-1.497122,1,-1.600646,True,False,False
2.27,-1.497122,1,-1.600646,False,False,False
2.275,-1.497122,1,-1.600646,True,False,False
2.28,-1.497122,1,-1.600646,False,False,False
2.285,-1.497122,1,-1.600646,True,False,False
2.29,-1.497122,1,-1.600646,False,False,False
2.295,-1.497122,1,-1.600646,True,False,False
2.3,-1.497122,1,-1.600646,False,False,False
2.305,-1.497122,1,-1.600646,True,False,False
2.31,-1.497122,1,-1.600646,False,False,False
2.315,-1.497122,1,-1.600646,True,False,False
2.32,-1.497122,1,-1.600646,False,False,False
2.325,-1.497122,1,-1.600646,True,False,False
2.33,-1.497122,1,-1.600646,False,False,False
2.335,-1.497122,1,-1.600646,True,False,False
2.34,-1.497122,1,-1.600646,False,False,False
2.345,-1.497122,1,-1.600646,True,False,False
2.35,-1.497122,1,-1.600646,False,False,False
2.355,-1.497122,1,-1.600646,True,False,False
2.36,-1.497122,1,-1.600646,False,False,False
2.365,-1.497122,1,-1.600646,True,False,False
2.37,-1.497122,1,-1.600646,False,False,False
2.375,-1.495069,1,-1.59935,True,False,False
2.38,-1.494064,1,-1.596723,False,False,False
2.385,-1.494064,1,-1.596723,True,False,False
2.39,-1.494459,1,-1.592678,False,False,False
2.395,-1.493824,1,-1.591634,True,False,False
2.4,-1.494097,1,-1.591805,False,False,False
2.405,-1.494097,1,-1.591805,True,False,False
2.41,-1.495322,1,-1.593817,False,False,False
2.415,-1.497538,1,-1.596126,True,False,False
2.42,-1.497538,1,-1.596126,False,False,False
2.425,-1.506804,1,-1.603449,True,False,False
2.43,-1.516281,1,-1.609473,False,False,False
2.435,-1.516281,1,-1.609473,True,False,False
2.44,-1.553503,1,-1.633337,False,False,False
2.445,-1.563037,1,-1.63966,True,False,False
2.45,-1.563037,1,-1.63966,False,False,False
2.455,-1.598107,1,-1.661885,True,False,False
2.46,-1.624774,1,-1.679083,False,False,False
2.465,-1.624774,1,-1.679083,True,False,False
2.47,-1.662106,1,-1.702545,False,False,False
2.475,-1.662106,1,-1.702545,True,False,False
2.48,-1.703222,1,-1.7287,False,False,False
2.485,-1.758407,1,-1.763773,True,False,False
2.49,-1.758407,1,-1.763773,False,False,False
2.495,-1.804787,1,-1.794984,True,False,False
2.5,-1.830259,1,-1.812547,False,False,False
2.505,-1.830259,1,-1.812547,True,False,False
2.51,-1.873291,1,-1.841863,False,False,False
2.515,-1.919133,1,-1.873864,True,False,False
2.52,-1.919133,1,-1.873864,False,False,False
2.525,-1.953047,1,-1.898065,True,False,False
2.53,-2.005557,1,-1.936362,False,False,False
2.535,-2.005557,1,-1.936362,True,False,False
2.54,-2.038862,1,-1.961448,False,False,False
2.545,-2.07105,1,-1.987134,True,False,False
2.55,-2.07105,1,-1.987134,False,False,False
2.555,-2.090435,1,-2.003544,True,False,False
2.56,-2.097857,1,-2.010335,False,False,False
2.565,-2.097857,1,-2.010335,True,False,False
2.57,-2.111503,1,-2.021832,False,False,False
2.575,-2.120439,1,-2.030028,True,False,False
2.58,-2.120439,1,-2.030028,False,False,False
2.585,-2.121414,1,-2.031086,True,False,False
2.59,-2.121414,1,-2.031086,False,False,False
2.595,-2.121414,1,-2.031086,True,False,False
2.6,-2.121414,1,-2.031086,False,False,False
2.605,-2.121414,1,-2.031086,True,False,False
2.61,-2.121414,1,-2.031086,False,False,False
2.615,-2.121414,1,-2.031086,True,False,False
2.62,-2.121414,1,-2.031086,False,False,False
2.625,-2.121414,1,-2.031086,True,False,False
2.63,-2.121414,1,-2.031086,False,False,False
2.635,-2.121414,1,-2.031086,True,False,False
2.64,-2.121414,1,-2.031086,False,False,False
2.645,-2.121414,1,-2.031086,True,False,False
2.65,-2.121414,1,-2.031086,False,False,False
2.655,-2.121414,1,-2.031086,True,False,False
2.66,-2.121414,1,-2.031086,False,False,False
2.665,-2.121414,1,-2.031086,True,False,False
2.67,-2.121414,1,-2.031086,False,False,False
2.675,-2.121414,1,-2.031086,True,False,False
2.68,-2.121414,1,-2.031086,False,False,False
2.685,-2.121414,1,-2.031086,True,False,False
2.69,-2.121414,1,-2.031086,False,False,False
2.695,-2.121414,1,-2.031086,True,False,False
2.7,-2.121414,1,-2.031086,False,False,False
2.705,-2.121414,1,-2.031086,True,False,False
2.71,-2.121414,1,-2.031086,False,False,False
2.715,-2.121414,1,-2.031086,True,False,False
2.72,-2.121414,1,-2.031086,False,False,False
2.725,-2.121414,1,-2.031086,True,False,False
2.73,-2.121414,1,-2.031086,False,False,False
2.735,-2.121414,1,-2.031086,True,False,False
2.74,-2.121414,1,-2.031086,False,False,False
2.745,-2.121414,1,-2.031086,True,False,False
2.75,-2.121414,1,-2.031086,False,False,False
2.755,-2.121414,1,-2.031086,True,False,False
2.76,-2.121414,1,-2.031086,False,False,False
2.765,-2.121414,1,-2.031086,True,False,False
2.77,-2.121414,1,-2.031086,False,False,False
2.775,-2.121414,1,-2.031086,True,False,False
2.78,-2.121824,1,-2.031531,False,False,False
2.785,-2.123511,1,-2.03276,True,False,False
2.79,-2.124494,1,-2.036849,False,False,False
2.795,-2.124494,1,-2.036849,True,False,False
2.8,-2.129522,1,-2.039643,False,False,False
2.805,-2.134822,1,-2.040138,True,False,False
2.81,-2.134822,1,-2.040138,False,False,False
2.815,-2.144534,1,-2.03803,True,False,False
2.82,-2.144534,1,-2.03803,False,False,False
2.825,-2.153606,1,-2.034719,True,False,False
2.83,-2.162262,1,-2.031415,False,False,False
2.835,-2.162262,1,-2.031415,True,False,False
2.84,-2.18048,1,-2.024848,False,False,False
2.845,-2.204394,1,-2.015123,True,False,False
2.85,-2.204394,1,-2.015123,False,False,False
2.855,-2.225773,1,-2.005634,True,False,False
2.86,-2.246208,1,-1.997092,False,False,False
2.865,-2.270207,1,-1.987113,True,False,False
2.87,-2.270207,1,-1.987113,False,False,False
2.875,-2.301584,1,-1.973747,True,False,False
2.88,-2.315919,1,-1.967516,False,False,False
2.885,-2.315919,1,-1.967516,True,False,False
2.89,-2.351042,1,-1.953067,False,False,False
2.895,-2.351042,1,-1.953067,True,False,False
2.9,-2.378757,1,-1.942204,False,False,False
2.905,-2.41725,1,-1.926967,True,False,False
2.91,-2.41725,1,-1.926967,False,False,False
2.915,-2.451255,1,-1.913563,True,False,False
2.92,-2.481605,1,-1.901028,False,False,False
2.925,-2.508879,1,-1.889449,True,False,False
2.93,-2.508879,1,-1.889449,False,False,False
2.935,-2.530379,1,-1.880293,True,False,False
2.94,-2.55894,1,-1.867484,False,False,False
2.945,-2.55894,1,-1.867484,True,False,False
2.95,-2.596057,1,-1.850939,False,False,False
2.955,-2.627848,1,-1.835427,True,False,False
2.96,-2.627848,1,-1.835427,False,False,False
2.965,-2.652777,1,-1.82338,True,False,False
2.97,-2.652777,1,-1.82338,False,False,False
2.975,-2.683752,1,-1.807484,True,False,False
2.98,-2.708764,1,-1.794507,False,False,False
2.985,-2.708764,1,-1.794507,True,False,False
2.99,-2.723684,1,-1.78701,False,False,False
2.995,-2.752374,1,-1.77148,True,False,False
3,-2.778883,1,-1.756396,False,False,False
3.005,-2.778883,1,-1.756396,True,False,False
3.01,-2.804361,1,-1.741362,False,False,False
3.015,-2.804361,1,-1.741362,True,False,False
3.02,-2.819924,1,-1.731001,False,False,False
3.025,-2.838083,1,-1.717698,True,False,False
3.03,-2.847757,1,-1.710081,False,False,False
3.035,-2.847757,1,-1.710081,True,False,False
3.04,-2.857872,1,-1.70027,False,False,False
3.045,-2.857872,1,-1.70027,True,False,False
3.05,-2.861232,1,-1.696218,False,False,False
3.055,-2.863369,1,-1.692158,True,False,False
3.06,-2.863369,1,-1.692158,False,False,False
3.065,-2.860553,1,-1.691506,True,False,False
3.07,-2.852994,1,-1.695838,False,False,False
3.075,-2.852994,1,-1.695838,True,False,False
3.08,-2.840936,1,-1.704807,False,False,False
3.085,-2.825204,1,-1.71727,True,False,False
3.09,-2.825204,1,-1.71727,False,False,False
3.095,-2.805478,1,-1.734146,True,False,False
3.1,-2.805478,1,-1.734146,False,False,False
3.105,-2.805478,1,-1.734146,True,False,False
3.11,-2.805478,1,-1.734146,False,False,False
3.115,-2.805478,1,-1.734146,True,False,False
3.12,-2.805478,1,-1.734146,False,False,False
3.125,-2.805478,1,-1.734146,True,False,False
3.13,-2.805478,1,-1.734146,False,False,False
3.135,-2.805478,1,-1.734146,True,False,False
3.14,-2.805478,1,-1.734146,False,False,False
3.145,-2.805478,1,-1.734146,True,False,False
3.15,-2.805478,1,-1.734146,False,False,False
3.155,-2.805478,1,-1.734146,True,False,False
3.16,-2.805478,1,-1.734146,False,False,False
3.165,-2.805478,1,-1.734146,True,False,False
3.17,-2.805478,1,-1.734146,False,False,False
3.175,-2.805478,1,-1.734146,True,False,False
3.18,-2.805478,1,-1.734146,False,False,False
3.185,-2.805478,1,-1.734146,True,False,False
3.19,-2.805478,1,-1.734146,False,False,False
3.195,-2.805478,1,-1.734146,True,False,False
3.2,-2.805478,1,-1.734146,False,False,False
3.205,-2.805478,1,-1.734146,True,False,False
3.21,-2.805478,1,-1.734146,False,False,False
3.215,-2.805478,1,-1.734146,True,False,False
3.22,-2.805478,1,-1.734146,False,False,False
3.225,-2.805478,1,-1.734146,True,False,False
3.23,-2.805478,1,-1.734146,False,False,False
3.235,-2.805478,1,-1.734146,True,False,False
3.24,-2.805478,1,-1.734146,False,False,False
3.245,-2.805478,1,-1.734146,True,False,False
3.25,-2.805478,1,-1.734146,False,False,False
3.255,-2.805478,1,-1.734146,True,False,False
3.26,-2.805478,1,-1.734146,False,False,False
3.265,-2.805478,1,-1.734146,True,False,False
3.27,-2.805478,1,-1.734146,False,False,False
3.275,-2.805478,1,-1.734146,True,False,False
3.28,-2.805478,1,-1.734146,False,False,False
3.285,-2.805478,1,-1.734146,True,False,False
3.29,-2.805478,1,-1.734146,False,False,False
3.295,-2.805478,1,-1.734146,True,False,False
3.3,-2.805478,1,-1.734146,False,False,False
3.305,-2.806758,1,-1.734041,True,False,False
3.31,-2.810583,1,-1.731466,False,False,False
3.315,-2.810583,1,-1.731466,True,False,False
3.32,-2.815273,1,-1.726881,False,False,False
3.325,-2.824466,1,-1.721655,True,False,False
3.33,-2.824466,1,-1.721655,False,False,False
3.335,-2.83656,1,-1.714854,True,False,False
3.34,-2.856375,1,-1.70125,False,False,False
3.345,-2.856375,1,-1.70125,True,False,False
3.35,-2.874714,1,-1.687289,False,False,False
3.355,-2.889391,1,-1.675721,True,False,False
3.36,-2.910768,1,-1.6574,False,False,False
3.365,-2.910768,1,-1.6574,True,False,False
3.37,-2.922232,1,-1.646875,False,False,False
3.375,-2.922232,1,-1.646875,True,False,False
3.38,-2.946561,1,-1.624099,False,False,False
3.385,-2.982739,1,-1.589856,True,False,False
3.39,-2.982739,1,-1.589856,False,False,False
3.395,-3.012155,1,-1.562137,True,False,False
3.4,-3.043928,1,-1.532069,False,False,False
3.405,-3.043928,1,-1.532069,True,False,False
3.41,-3.072742,1,-1.506291,False,False,False
3.415,-3.117,1,-1.467544,True,False,False
3.42,-3.117,1,-1.467544,False,False,False
3.425,-3.134979,1,-1.452618,True,False,False
3.43,-3.180537,1,-1.415498,False,False,False
3.435,-3.209625,1,-1.3922,True,False,False
3.44,-3.209625,1,-1.3922,False,False,False
3.445,-3.247676,1,-1.362686,True,False,False
3.45,-3.281956,1,-1.336528,False,False,False
3.455,-3.281956,1,-1.336528,True,False,False
3.46,-3.330887,1,-1.300358,False,False,False
3.465,-3.330887,1,-1.300358,True,False,False
3.47,-3.369667,1,-1.270931,False,False,False
3.475,-3.369667,1,-1.270931,True,False,False
3.48,-3.369667,1,-1.270931,False,False,False
3.485,-3.369667,1,-1.270931,True,False,False
3.49,-3.484356,1,-1.184069,False,False,False
3.495,-3.484356,1,-1.184069,True,False,False
3.5,-3.546108,1,-1.137078,False,False,False
3.505,-3.594002,1,-1.099591,True,False,False
3.51,-3.594002,1,-1.099591,False,False,False
3.515,-3.639615,1,-1.064367,True,False,False
3.52,-3.687526,1,-1.027495,False,False,False
3.525,-3.687526,1,-1.027495,True,False,False
3.53,-3.728551,1,-0.9959443,False,False,False
3.535,-3.750439,1,-0.9785824,True,False,False
3.54,-3.750439,1,-0.9785824,False,False,False
3.545,-3.790648,1,-0.9471574,True,False,False
3.55,-3.84343,1,-0.9046142,False,False,False
3.555,-3.84343,1,-0.9046142,True,False,False
3.56,-3.878702,1,-0.8744057,False,False,False
3.565,-3.878702,1,-0.8744057,True,False,False
3.57,-3.993403,1,-0.7698941,False,False,False
3.575,-4.030704,1,-0.7333919,True,False,False
3.58,-4.069002,1,-0.6948682,False,False,False
3.585,-4.069002,1,-0.6948682,True,False,False
3.59,-4.083551,1,-0.6797239,False,False,False
3.595,-4.117181,1,-0.6442323,True,False,False
3.6,-4.142797,1,-0.6160021,False,False,False
3.605,-4.142797,1,-0.6160021,True,False,False
3.61,-4.161376,1,-0.5941499,False,False,False
3.615,-4.161376,1,-0.5941499,True,False,False
3.62,-4.181672,1,-0.5689196,False,False,False
3.625,-4.200083,1,-0.545224,True,False,False
3.63,-4.200083,1,-0.545224,False,False,False
3.635,-4.212007,1,-0.5287291,True,False,False
3.64,-4.214938,1,-0.5244466,False,False,False
3.645,-4.2232,1,-0.5099919,True,False,False
3.65,-4.2232,1,-0.5099919,False,False,False
3.655,-4.220619,1,-0.5083942,True,False,False
3.66,-4.21875,1,-0.5094905,False,False,False
3.665,-4.21875,1,-0.5094905,True,False,False
3.67,-4.21875,1,-0.5094905,False,False,False
3.675,-4.21875,1,-0.5094905,True,False,False
3.68,-4.21875,1,-0.5094905,False,False,False
3.685,-4.21875,1,-0.5094905,True,False,False
3.69,-4.21875,1,-0.5094905,False,False,False
3.695,-4.21875,1,-0.5094905,True,False,False
3.7,-4.21875,1,-0.5094905,False,False,False
3.705,-4.21875,1,-0.5094905,True,False,False
3.71,-4.21875,1,-0.5094905,False,False,False
3.715,-4.21875,1,-0.5094905,True,False,False
3.72,-4.21875,1,-0.5094905,False,False,False
3.725,-4.21875,1,-0.5094905,True,False,False
3.73,-4.21875,1,-0.5094905,False,False,False
3.735,-4.21875,1,-0.5094905,True,False,False
3.74,-4.21875,1,-0.5094905,False,False,False
3.745,-4.21875,1,-0.5094905,True,False,False
3.75,-4.21875,1,-0.5094905,False,False,False
3.755,-4.21875,1,-0.5094905,True,False,False
3.76,-4.21875,1,-0.5094905,False,False,False
3.765,-4.21875,1,-0.5094905,True,False,False
3.77,-4.21875,1,-0.5094905,False,False,False
3.775,-4.21875,1,-0.5094905,True,False,False
3.78,-4.21875,1,-0.5094905,False,False,False
3.785,-4.21875,1,-0.5094905,True,False,False
3.79,-4.21875,1,-0.5094905,False,False,False
3.795,-4.21875,1,-0.5094905,True,False,False
3.8,-4.21875,1,-0.5094905,False,False,False
3.805,-4.21875,1,-0.5094905,True,False,False
3.81,-4.21875,1,-0.5094905,False,False,False
3.815,-4.21875,1,-0.5094905,True,False,False
3.82,-4.21875,1,-0.5094905,False,False,False
3.825,-4.21875,1,-0.5094905,True,False,False
3.83,-4.21875,1,-0.5094905,False,False,False
3.835,-4.21875,1,-0.5094905,True,False,False
3.84,-4.21875,1,-0.5094905,False,False,False
3.845,-4.21875,1,-0.5094905,True,False,False
3.85,-4.21875,1,-0.5094905,False,False,False
3.855,-4.21875,1,-0.5094905,True,False,False
3.86,-4.21875,1,-0.5094905,False,False,False
3.865,-4.21875,1,-0.5094905,True,False,False
3.87,-4.21875,1,-0.5094905,False,False,False
3.875,-4.21875,1,-0.5094905,True,False,False
3.88,-4.21875,1,-0.5094905,False,False,False
3.885,-4.21875,1,-0.5094905,True,False,False
3.89,-4.21875,1,-0.5094905,False,False,False
3.895,-4.21875,1,-0.5094905,True,False,False
3.9,-4.21875,1,-0.5094905,False,False,False
3.905,-4.21875,1,-0.5094905,True,False,False
3.91,-4.21875,1,-0.5094905,False,False,False
3.915,-4.21875,1,-0.5094905,True,False,False
3.92,-4.21875,1,-0.5094905,False,False,False
3.925,-4.21875,1,-0.5094905,True,False,False
3.93,-4.21875,1,-0.5094905,False,False,False
3.935,-4.21875,1,-0.5094905,True,False,False
3.94,-4.21875,1,-0.5094905,False,False,False
3.945,-4.21875,1,-0.5094905,True,False,False
3.95,-4.21875,1,-0.5094905,False,False,False
3.955,-4.217581,1,-0.5080912,True,False,False
3.96,-4.217581,1,-0.5080912,False,False,False
3.965,-4.215188,1,-0.5070493,True,False,False
3.97,-4.214922,1,-0.5067317,False,False,False
3.975,-4.21597,1,-0.504661,True,False,False
3.98,-4.21597,1,-0.504661,False,False,False
3.985,-4.21597,1,-0.504661,True,False,False
3.99,-4.21597,1,-0.504661,False,False,False
3.995,-4.224742,1,-0.4973038,True,False,False
4,-4.2361,1,-0.4895636,False,False,False
4.005,-4.2361,1,-0.4895636,True,False,False
4.01,-4.247511,1,-0.4833302,False,False,False
4.015,-4.264581,1,-0.4758148,True,False,False
4.02,-4.272589,1,-0.4724362,False,False,False
4.025,-4.272589,1,-0.4724362,True,False,False
4.03,-4.29621,1,-0.463988,False,False,False
4.035,-4.29621,1,-0.463988,True,False,False
4.04,-4.29621,1,-0.463988,False,False,False
4.045,-4.350754,1,-0.4471596,True,False,False
4.05,-4.350754,1,-0.4471596,False,False,False
4.055,-4.373563,1,-0.4413961,True,False,False
4.06,-4.406742,1,-0.4326595,False,False,False
4.065,-4.406742,1,-0.4326595,True,False,False
4.07,-4.43229,1,-0.4263921,False,False,False
4.075,-4.44956,1,-0.4231153,True,False,False
4.08,-4.479743,1,-0.4168568,False,False,False
4.085,-4.479743,1,-0.4168568,True,False,False
4.09,-4.511408,1,-0.4104499,False,False,False
4.095,-4.511408,1,-0.4104499,True,False,False
4.1,-4.566308,1,-0.3980441,False,False,False
4.105,-4.594849,1,-0.3914793,True,False,False
4.11,-4.594849,1,-0.3914793,False,False,False
4.115,-4.625305,1,-0.3846462,True,False,False
4.12,-4.674443,1,-0.3741326,False,False,False
4.125,-4.674443,1,-0.3741326,True,False,False
4.13,-4.689676,1,-0.3705814,False,False,False
4.135,-4.733533,1,-0.3596349,True,False,False
4.14,-4.733533,1,-0.3596349,False,False,False
4.145,-4.766711,1,-0.3509888,True,False,False
4.15,-4.812215,1,-0.3381198,False,False,False
4.155,-4.8486,1,-0.3270979,True,False,False
4.16,-4.8486,1,-0.3270979,False,False,False
4.165,-4.892992,1,-0.3123366,True,False,False
4.17,-4.92763,1,-0.3011173,False,False,False
4.175,-4.92763,1,-0.3011173,True,False,False
4.18,-4.953571,1,-0.292754,False,False,False
4.185,-4.972525,1,-0.2863376,True,False,False
4.19,-4.972525,1,-0.2863376,False,False,False
4.195,-5.015299,1,-0.2714278,True,False,False
4.2,-5.049135,1,-0.2590216,False,False,False
4.205,-5.049135,1,-0.2590216,True,False,False
4.21,-5.096391,1,-0.241209,False,False,False
4.215,-5.134044,1,-0.2263499,True,False,False
4.22,-5.134044,1,-0.2263499,False,False,False
4.225,-5.134044,1,-0.2263499,True,False,False
4.23,-5.336553,1,-0.1470189,False,False,False
4.235,-5.336553,1,-0.1470189,True,False,False
4.24,-5.352399,1,-0.1405514,False,False,False
4.245,-5.395419,1,-0.1210922,True,False,False
4.25,-5.395419,1,-0.1210922,False,False,False
4.255,-5.438812,1,-0.100663,True,False,False
4.26,-5.438812,1,-0.100663,False,False,False
4.265,-5.477758,1,-0.08098055,True,False,False
4.27,-5.511043,1,-0.06302381,False,False,False
4.275,-5.511043,1,-0.06302381,True,False,False
4.28,-5.539725,1,-0.04602973,False,False,False
4.285,-5.578104,1,-0.02288538,True,False,False
4.29,-5.578104,1,-0.02288538,False,False,False
4.295,-5.596251,1,-0.01102452,True,False,False
4.3,-5.646541,1,0.02189288,False,True,False
4.305,-5.646541,1,0.02189288,True,True,False
4.31,-5.674581,1,0.04178564,False,True,False
4.315,-5.716655,1,0.07392071,True,True,False
4.32,-5.716655,1,0.07392071,False,True,False
4.325,-5.74284,1,0.09542809,True,True,False
4.33,-5.763249,1,0.113234,False,True,False
4.335,-5.763249,1,0.113234,True,True,False
4.34,-5.784328,1,0.1313556,False,True,False
4.345,-5.796696,1,0.1424845,True,True,False
4.35,-5.796696,1,0.1424845,False,True,False
4.355,-5.809969,1,0.1545337,True,True,False
4.36,-5.821367,1,0.1642829,False,True,False
4.365,-5.825957,1,0.168516,True,True,False
4.37,-5.825957,1,0.168516,False,True,False
4.375,-5.826845,1,0.1700088,True,True,False
4.38,-5.826845,1,0.1700088,False,True,False
4.385,-5.825062,1,0.1693099,True,True,False
4.39,-5.825062,1,0.1693099,False,True,False
4.395,-5.825062,1,0.1693099,True,True,False
4.4,-5.825062,1,0.1693099,False,True,False
4.405,-5.825062,1,0.1693099,True,True,False
4.41,-5.825062,1,0.1693099,False,True,False
4.415,-5.825062,1,0.1693099,True,True,False
4.42,-5.825062,1,0.1693099,False,True,False
4.425,-5.825062,1,0.1693099,True,True,False
4.43,-5.825062,1,0.1693099,False,True,False
4.435,-5.825062,1,0.1693099,True,True,False
4.44,-5.825062,1,0.1693099,False,True,False
4.445,-5.825062,1,0.1693099,True,True,False
4.45,-5.825062,1,0.1693099,False,True,False
4.455,-5.825062,1,0.1693099,True,True,False
4.46,-5.825062,1,0.1693099,False,True,False
4.465,-5.825062,1,0.1693099,True,True,False
4.47,-5.825062,1,0.1693099,False,True,False
4.475,-5.825062,1,0.1693099,True,True,False
4.48,-5.825062,1,0.1693099,False,True,False
4.485,-5.825062,1,0.1693099,True,True,False
4.49,-5.825062,1,0.1693099,False,True,False
4.495,-5.825062,1,0.1693099,True,True,False
4.5,-5.825062,1,0.1693099,False,True,False
4.505,-5.825062,1,0.1693099,True,True,False
4.51,-5.825062,1,0.1693099,False,True,False
4.515,-5.825062,1,0.1693099,True,True,False
4.52,-5.825062,1,0.1693099,False,True,False
4.525,-5.825062,1,0.1693099,True,True,False
4.53,-5.825062,1,0.1693099,False,True,False
4.535,-5.825062,1,0.1693099,True,True,False
4.54,-5.825062,1,0.1693099,False,True,False
4.545,-5.825062,1,0.1693099,True,True,False
4.55,-5.825062,1,0.1693099,False,True,False
4.555,-5.825062,1,0.1693099,True,True,False
4.56,-5.825062,1,0.1693099,False,True,False
4.565,-5.825062,1,0.1693099,True,True,False
4.57,-5.825062,1,0.1693099,False,True,False
4.575,-5.825062,1,0.1693099,True,True,False
4.58,-5.825062,1,0.1693099,False,True,False
4.585,-5.825062,1,0.1693099,True,True,False
4.59,-5.825062,1,0.1693099,False,True,False
4.595,-5.825062,1,0.1693099,True,True,False
4.6,-5.825062,1,0.1693099,False,True,False
4.605,-5.825062,1,0.1693099,True,True,False
4.61,-5.825062,1,0.1693099,False,True,False
4.615,-5.825062,1,0.1693099,True,True,False
4.62,-5.825062,1,0.1693099,False,True,False
4.625,-5.825062,1,0.1693099,True,True,False
4.63,-5.825062,1,0.1693099,False,True,False
4.635,-5.825062,1,0.1693099,True,True,False
4.64,-5.825062,1,0.1693099,False,True,False
4.645,-5.825062,1,0.1693099,True,True,False
4.65,-5.825062,1,0.1693099,False,True,False
4.655,-5.825062,1,0.1693099,True,True,False
4.66,-5.825062,1,0.1693099,False,True,False
4.665,-5.825062,1,0.1693099,True,True,False
4.67,-5.825062,1,0.1693099,False,True,False
4.675,-5.825062,1,0.1693099,True,True,False
4.68,-5.825062,1,0.1693099,False,True,False
4.685,-5.825062,1,0.1693099,True,True,False
4.69,-5.825062,1,0.1693099,False,True,False
4.695,-5.825062,1,0.1693099,True,True,False
4.7,-5.825062,1,0.1693099,False,True,False
4.705,-5.825062,1,0.1693099,True,True,False
4.71,-5.825062,1,0.1693099,False,True,False
4.715,-5.825062,1,0.1693099,True,True,False
4.72,-5.825062,1,0.1693099,False,True,False
4.725,-5.825062,1,0.1693099,True,True,False
4.73,-5.82515,1,0.1697133,False,True,False
4.735,-5.826149,1,0.1709542,True,True,False
4.74,-5.826149,1,0.1709542,False,True,False
4.745,-5.827518,1,0.1722783,True,True,False
4.75,-5.830168,1,0.173983,False,True,False
4.755,-5.830168,1,0.173983,True,True,False
4.76,-5.835889,1,0.1749449,False,True,False
4.765,-5.841988,1,0.174941,True,True,False
4.77,-5.846644,1,0.1754358,False,True,False
4.775,-5.846644,1,0.1754358,True,True,False
4.78,-5.850573,1,0.176032,False,True,False
4.785,-5.856607,1,0.1768308,True,True,False
4.79,-5.856607,1,0.1768308,False,True,False
4.795,-5.867682,1,0.1775461,True,True,False
4.8,-5.867682,1,0.1775461,False,True,False
4.805,-5.87636,1,0.1777635,True,True,False
4.81,-5.88754,1,0.1770743,False,True,False
4.815,-5.88754,1,0.1770743,True,True,False
4.82,-5.899451,1,0.1755314,False,True,False
4.825,-5.915067,1,0.1719335,True,True,False
4.83,-5.925698,1,0.1699026,False,True,False
4.835,-5.925698,1,0.1699026,True,True,False
4.84,-5.930331,1,0.1688034,False,True,False
4.845,-5.930331,1,0.1688034,True,True,False
4.85,-5.941486,1,0.1665922,False,True,False
4.855,-5.959429,1,0.1625619,True,True,False
4.86,-5.959429,1,0.1625619,False,True,False
4.865,-5.959429,1,0.1625619,True,True,False
4.87,-5.98668,1,0.1561066,False,True,False
4.875,-5.98668,1,0.1561066,True,True,False
4.88,-5.999942,1,0.1536715,False,True,False
4.885,-6.016986,1,0.1501791,True,True,False
4.89,-6.016986,1,0.1501791,False,True,False
4.895,-6.023194,1,0.1492266,True,True,False
4.9,-6.03961,1,0.1473335,False,True,False
4.905,-6.03961,1,0.1473335,True,True,False
4.91,-6.057748,1,0.1461934,False,True,False
4.915,-6.076121,1,0.1455601,True,True,False
4.92,-6.076121,1,0.1455601,False,True,False
4.925,-6.087945,1,0.1454017,True,True,False
4.93,-6.107662,1,0.1468199,False,True,False
4.935,-6.121843,1,0.1479691,True,True,False
4.94,-6.121843,1,0.1479691,False,True,False
4.945,-6.130882,1,0.1493094,True,True,False
4.95,-6.14295,1,0.1509307,False,True,False
4.955,-6.14295,1,0.1509307,True,True,False
4.96,-6.163968,1,0.1547634,False,True,False
4.965,-6.163968,1,0.1547634,True,True,False
4.97,-6.180825,1,0.1581304,False,True,False
4.975,-6.197542,1,0.1620332,True,True,False
4.98,-6.214278,1,0.1662229,False,True,False
4.985,-6.214278,1,0.1662229,True,True,False
4.99,-6.233934,1,0.1709625,False,True,False
4.995,-6.238718,1,0.1722768,True,True,False
5,-6.238718,1,0.1722768,False,True,False
5.005,-6.276412,1,0.1820578,True,True,False
5.01,-6.276412,1,0.1820578,False,True,False
5.015,-6.290306,1,0.1856851,True,True,False
5.02,-6.311425,1,0.1909604,False,True,False
5.025,-6.327006,1,0.1953726,True,True,False
5.03,-6.327006,1,0.1953726,False,True,False
5.035,-6.348202,1,0.201207,True,True,False
5.04,-6.362031,1,0.2054789,False,True,False
5.045,-6.362031,1,0.2054789,True,True,False
5.05,-6.384818,1,0.2123945,False,True,False
5.055,-6.384818,1,0.2123945,True,True,False
5.06,-6.388595,1,0.2135928,False,True,False
5.065,-6.410324,1,0.2206826,True,True,False
5.07,-6.410324,1,0.2206826,False,True,False
5.075,-6.425364,1,0.2255126,True,True,False
5.08,-6.446034,1,0.2323467,False,True,False
5.085,-6.458295,1,0.2363298,True,True,False
5.09,-6.458295,1,0.2363298,False,True,False
5.095,-6.479227,1,0.2432722,True,True,False
5.1,-6.479227,1,0.2432722,False,True,False
5.105,-6.493218,1,0.2479487,True,True,False
5.11,-6.50089,1,0.2505893,False,True,False
5.115,-6.516177,1,0.2554071,True,True,False
5.12,-6.516177,1,0.2554071,False,True,False
5.125,-6.533662,1,0.2607996,True,True,False
5.13,-6.533662,1,0.2607996,False,True,False
5.135,-6.548172,1,0.2652277,True,True,False
5.14,-6.568688,1,0.2716244,False,True,False
5.145,-6.568688,1,0.2716244,True,True,False
5.15,-6.58341,1,0.2760214,False,True,False
5.155,-6.617108,1,0.2854672,True,False,False
5.16,-6.617108,1,0.2854672,False,False,False
5.165,-6.62607,1,0.2881324,True,False,False
5.17,-6.62607,1,0.2881324,False,False,False
5.175,-6.62607,1,0.2881324,True,False,False
5.18,-6.637988,1,0.2918512,False,False,False
5.185,-6.668722,1,0.3004713,True,False,False
5.19,-6.668722,1,0.3004713,False,False,False
5.195,-6.681067,1,0.3039672,True,False,False
5.2,-6.696674,1,0.3083567,False,False,False
5.205,-6.710913,1,0.3120573,True,False,False
5.21,-6.710913,1,0.3120573,False,False,False
5.215,-6.720063,1,0.3144937,True,False,False
5.22,-6.720063,1,0.3144937,False,False,False
5.225,-6.720063,1,0.3144937,True,False,False
5.23,-6.751576,1,0.3227651,False,False,False
5.235,-6.751576,1,0.3227651,True,False,False
5.24,-6.764371,1,0.3258395,False,False,False
5.245,-6.783496,1,0.3307622,True,False,False
5.25,-6.797305,1,0.3341629,False,False,False
5.255,-6.797305,1,0.3341629,True,False,False
5.26,-6.812061,1,0.3381993,False,False,False
5.265,-6.812061,1,0.3381993,True,False,False
5.27,-6.827311,1,0.3422666,False,False,False
5.275,-6.830207,1,0.3430358,True,False,False
5.28,-6.843209,1,0.346631,False,False,False
5.285,-6.843209,1,0.346631,True,False,False
5.29,-6.856225,1,0.3499939,False,False,False
5.295,-6.865431,1,0.3520244,True,False,False
5.3,-6.865431,1,0.3520244,False,False,False
5.305,-6.880975,1,0.3562291,True,False,False
5.31,-6.880975,1,0.3562291,False,False,False
5.315,-6.890131,1,0.3583828,True,False,False
5.32,-6.896574,1,0.3597383,False,False,False
5.325,-6.896574,1,0.3597383,True,False,False
5.33,-6.900651,1,0.3606717,False,False,False
5.335,-6.907583,1,0.3623153,True,False,False
5.34,-6.911767,1,0.3633993,False,False,False
5.345,-6.911767,1,0.3633993,True,False,False
5.35,-6.917588,1,0.3645193,False,False,False
5.355,-6.921625,1,0.365503,True,False,False
5.36,-6.921625,1,0.365503,False,False,False
5.365,-6.925956,1,0.3663072,True,False,False
5.37,-6.929611,1,0.3670649,False,False,False
5.375,-6.929611,1,0.3670649,True,False,False
5.38,-6.931223,1,0.3673986,False,False,False
5.385,-6.931223,1,0.3673986,True,False,False
5.39,-6.933163,1,0.3676468,False,False,False
5.395,-6.934707,1,0.3679658,True,False,False
5.4,-6.935974,1,0.3682274,False,False,False
5.405,-6.935974,1,0.3682274,True,False,False
5.41,-6.937701,1,0.3684475,False,False,False
5.415,-6.938227,1,0.3687007,True,False,False
5.42,-6.938227,1,0.3687007,False,False,False
5.425,-6.938227,1,0.3687007,True,False,False
5.43,-6.938227,1,0.3687007,False,False,False
5.435,-6.938227,1,0.3687007,True,False,False
5.44,-6.938227,1,0.3687007,False,False,False
5.445,-6.938227,1,0.3687007,True,False,False
5.45,-6.938227,1,0.3687007,False,False,False
5.455,-6.938227,1,0.3687007,True,False,False
5.46,-6.938227,1,0.3687007,False,False,False
5.465,-6.938227,1,0.3687007,True,False,False
5.47,-6.938227,1,0.3687007,False,False,False
5.475,-6.938227,1,0.3687007,True,False,False
5.48,-6.938227,1,0.3687007,False,False,False
5.485,-6.938358,1,0.3684283,True,False,False
5.49,-6.938358,1,0.3684283,False,False,False
5.495,-6.938358,1,0.3684283,True,False,False
5.5,-6.938358,1,0.3684283,False,False,False
5.505,-6.938358,1,0.3684283,True,False,False
5.51,-6.938358,1,0.3684283,False,False,False
5.515,-6.938358,1,0.3684283,True,False,False
5.52,-6.938358,1,0.3684283,False,False,False
5.525,-6.938358,1,0.3684283,True,False,False
5.53,-6.938358,1,0.3684283,False,False,False
5.535,-6.938358,1,0.3684283,True,False,False
5.54,-6.938358,1,0.3684283,False,False,False
5.545,-6.938358,1,0.3684283,True,False,False
5.55,-6.938358,1,0.3684283,False,False,False
5.555,-6.938358,1,0.3684283,True,False,False
5.56,-6.938358,1,0.3684283,False,False,False
5.565,-6.938358,1,0.3684283,True,False,False
5.57,-6.938358,1,0.3684283,False,False,False
5.575,-6.938358,1,0.3684283,True,False,False
5.58,-6.938358,1,0.3684283,False,False,False
5.585,-6.938358,1,0.3684283,True,False,False
5.59,-6.938358,1,0.3684283,False,False,False
5.595,-6.938358,1,0.3684283,True,False,False
5.6,-6.938358,1,0.3684283,False,False,False
5.605,-6.938358,1,0.3684283,True,False,False
5.61,-6.938358,1,0.3684283,False,False,False
5.615,-6.938358,1,0.3684283,True,False,False
5.62,-6.938358,1,0.3684283,False,False,False
5.625,-6.938358,1,0.3684283,True,False,False
5.63,-6.938358,1,0.3684283,False,False,False
5.635,-6.938358,1,0.3684283,True,False,False
5.64,-6.938358,1,0.3684283,False,False,False
5.645,-6.938358,1,0.3684283,True,False,False
5.65,-6.938358,1,0.3684283,False,False,False
5.655,-6.938358,1,0.3684283,True,False,False
5.66,-6.938358,1,0.3684283,False,False,False
5.665,-6.938358,1,0.3684283,True,False,False
5.67,-6.938358,1,0.3684283,False,False,False
5.675,-6.938227,1,0.3680533,True,False,False
5.68,-6.937984,1,0.3679369,False,False,False
5.685,-6.937984,1,0.3679369,True,False,False
5.69,-6.937261,1,0.367589,False,False,False
5.695,-6.936379,1,0.3671652,True,False,False
5.7,-6.936379,1,0.3671652,False,False,False
5.705,-6.935711,1,0.3668441,True,False,False
5.71,-6.933331,1,0.3662346,False,False,False
5.715,-6.933331,1,0.3662346,True,False,False
5.72,-6.931721,1,0.3659026,False,False,False
5.725,-6.928697,1,0.3651954,True,False,False
5.73,-6.928697,1,0.3651954,False,False,False
5.735,-6.925865,1,0.3642984,True,False,False
5.74,-6.921975,1,0.3632993,False,False,False
5.745,-6.921975,1,0.3632993,True,False,False
5.75,-6.915738,1,0.3620085,False,False,False
5.755,-6.90666,1,0.3596689,True,False,False
5.76,-6.90666,1,0.3596689,False,False,False
5.765,-6.901644,1,0.3587354,True,False,False
5.77,-6.895465,1,0.3569214,False,False,False
5.775,-6.895465,1,0.3569214,True,False,False
5.78,-6.895465,1,0.3569214,False,False,False
5.785,-6.878302,1,0.3526559,True,False,False
5.79,-6.878302,1,0.3526559,False,False,False
5.795,-6.867516,1,0.3497593,True,False,False
5.8,-6.855341,1,0.3463901,False,False,False
5.805,-6.848291,1,0.344541,True,False,False
5.81,-6.848291,1,0.344541,False,False,False
5.815,-6.840219,1,0.3426021,True,False,False
5.82,-6.829734,1,0.3399139,False,False,False
5.825,-6.829734,1,0.3399139,True,False,False
5.83,-6.815598,1,0.3365486,False,False,False
5.835,-6.815598,1,0.3365486,True,False,False
5.84,-6.804458,1,0.3336698,False,False,False
5.845,-6.781546,1,0.3269702,True,False,False
5.85,-6.781546,1,0.3269702,False,False,False
5.855,-6.769037,1,0.3235358,True,False,False
5.86,-6.750843,1,0.31854,False,False,False
5.865,-6.750843,1,0.31854,True,False,False
5.87,-6.743005,1,0.3164225,False,False,False
5.875,-6.72371,1,0.3107855,True,False,False
5.88,-6.72371,1,0.3107855,False,False,False
5.885,-6.712276,1,0.3073756,True,False,False
5.89,-6.693629,1,0.3020453,False,False,False
5.895,-6.693629,1,0.3020453,True,False,False
5.9,-6.684489,1,0.2992652,False,False,False
5.905,-6.657361,1,0.2906402,True,False,False
5.91,-6.643283,1,0.2864205,False,False,False
5.915,-6.643283,1,0.2864205,True,False,False
5.92,-6.636696,1,0.2839608,False,False,False
5.925,-6.636696,1,0.2839608,True,False,False
5.93,-6.622918,1,0.2794862,False,False,False
5.935,-6.610018,1,0.2752858,True,True,False
5.94,-6.595942,1,0.2703495,False,True,False
5.945,-6.595942,1,0.2703495,True,True,False
5.95,-6.579737,1,0.2647532,False,True,False
5.955,-6.566072,1,0.2599382,True,True,False
5.96,-6.566072,1,0.2599382,False,True,False
5.965,-6.559021,1,0.2572733,True,True,False
5.97,-6.535915,1,0.2492477,False,True,False
5.975,-6.535915,1,0.2492477,True,True,False
5.98,-6.529134,1,0.247088,False,True,False
5.985,-6.515837,1,0.2423644,True,True,False
5.99,-6.515837,1,0.2423644,False,True,False
5.995,-6.505097,1,0.2386539,True,True,False
6,-6.505097,1,0.2386539,False,True,False
6.005,-6.493437,1,0.2346182,True,True,False
6.01,-6.481818,1,0.23094,False,True,False
6.015,-6.481818,1,0.23094,True,True,False
6.02,-6.466695,1,0.225893,False,True,False
6.025,-6.448997,1,0.2201823,True,True,False
6.03,-6.448997,1,0.2201823,False,True,False
6.035,-6.44269,1,0.2180798,True,True,False
6.04,-6.425343,1,0.2131593,False,True,False
6.045,-6.412797,1,0.2093087,True,True,False
6.05,-6.412797,1,0.2093087,False,True,False
6.055,-6.387069,1,0.2015239,True,True,False
6.06,-6.387069,1,0.2015239,False,True,False
6.065,-6.376777,1,0.1988097,True,True,False
6.07,-6.361816,1,0.1945025,False,True,False
6.075,-6.354259,1,0.1925814,True,True,False
6.08,-6.354259,1,0.1925814,False,True,False
6.085,-6.349476,1,0.1914103,True,True,False
6.09,-6.349476,1,0.1914103,False,True,False
6.095,-6.339411,1,0.1887926,True,True,False
6.1,-6.328637,1,0.1860324,False,True,False
6.105,-6.328637,1,0.1860324,True,True,False
6.11,-6.321763,1,0.1844078,False,True,False
6.115,-6.312146,1,0.1821286,True,True,False
6.12,-6.312146,1,0.1821286,False,True,False
6.125,-6.305254,1,0.1808696,True,True,False
6.13,-6.300198,1,0.1800134,False,True,False
6.135,-6.300198,1,0.1800134,True,True,False
6.14,-6.297955,1,0.1798219,False,True,False
6.145,-6.292645,1,0.1794381,True,True,False
6.15,-6.290269,1,0.1792327,False,True,False
6.155,-6.290269,1,0.1792327,True,True,False
6.16,-6.289171,1,0.1795653,False,True,False
6.165,-6.289171,1,0.1795653,True,True,False
6.17,-6.28904,1,0.1798089,False,True,False
6.175,-6.289022,1,0.1804544,True,True,False
6.18,-6.289022,1,0.1804544,False,True,False
6.185,-6.290401,1,0.1828618,True,True,False
6.19,-6.293615,1,0.1874157,False,True,False
6.195,-6.294429,1,0.1887835,True,True,False
6.2,-6.294429,1,0.1887835,False,True,False
6.205,-6.29885,1,0.1943381,True,True,False
6.21,-6.29885,1,0.1943381,False,True,False
6.215,-6.303594,1,0.2007591,True,True,False
6.22,-6.31837,1,0.2182336,False,True,False
6.225,-6.31837,1,0.2182336,True,True,False
6.23,-6.32488,1,0.2267297,False,True,False
6.235,-6.332962,1,0.2379449,True,True,False
6.24,-6.340385,1,0.2479232,False,True,False
6.245,-6.340385,1,0.2479232,True,True,False
6.25,-6.343449,1,0.251966,False,True,False
6.255,-6.343449,1,0.251966,True,True,False
6.26,-6.353608,1,0.2664051,False,True,False
6.265,-6.381391,1,0.3058675,True,True,False
6.27,-6.381391,1,0.3058675,False,True,False
6.275,-6.391313,1,0.3189808,True,True,False
6.28,-6.403017,1,0.3352093,False,True,False
6.285,-6.403017,1,0.3352093,True,True,False
6.29,-6.412076,1,0.3472305,False,True,False
6.295,-6.426286,1,0.3648835,True,True,False
6.3,-6.426286,1,0.3648835,False,True,False
6.305,-6.43132,1,0.3711747,True,True,False
6.31,-6.447305,1,0.3910405,False,True,False
6.315,-6.447305,1,0.3910405,True,True,False
6.32,-6.455587,1,0.4004871,False,True,False
6.325,-6.455587,1,0.4004871,True,True,False
6.33,-6.455587,1,0.4004871,False,True,False
6.335,-6.475506,1,0.4224935,True,True,False
6.34,-6.48652,1,0.4339007,False,True,False
6.345,-6.48652,1,0.4339007,True,True,False
6.35,-6.496085,1,0.4442185,False,True,False
6.355,-6.501956,1,0.4497462,True,False,False
6.36,-6.501956,1,0.4497462,False,False,False
6.365,-6.511683,1,0.459147,True,False,False
6.37,-6.521771,1,0.4682786,False,False,False
6.375,-6.521771,1,0.4682786,True,False,False
6.38,-6.531158,1,0.476666,False,False,False
6.385,-6.541881,1,0.4850647,True,False,False
6.39,-6.541881,1,0.4850647,False,False,False
6.395,-6.548508,1,0.4905292,True,False,False
6.4,-6.556166,1,0.4955584,False,False,False
6.405,-6.556166,1,0.4955584,True,False,False
6.41,-6.560567,1,0.4982037,False,False,False
6.415,-6.562081,1,0.4991142,True,False,False
6.42,-6.562081,1,0.4991142,False,False,False
6.425,-6.569498,1,0.5035721,True,False,False
6.43,-6.573741,1,0.5057527,False,False,False
6.435,-6.573741,1,0.5057527,True,False,False
6.44,-6.579551,1,0.5083245,False,False,False
6.445,-6.58422,1,0.5098832,True,False,False
6.45,-6.58422,1,0.5098832,False,False,False
6.455,-6.589157,1,0.511828,True,False,False
6.46,-6.59333,1,0.5125935,False,False,False
6.465,-6.59333,1,0.5125935,True,False,False
6.47,-6.594516,1,0.512856,False,False,False
6.475,-6.599424,1,0.5134543,True,False,False
6.48,-6.599424,1,0.5134543,False,False,False
6.485,-6.601476,1,0.5132387,True,False,False
6.49,-6.60397,1,0.5129755,False,False,False
6.495,-6.60397,1,0.5129755,True,False,False
6.5,-6.606485,1,0.5123399,False,False,False
6.505,-6.608672,1,0.5114408,True,False,False
6.51,-6.608672,1,0.5114408,False,False,False
6.515,-6.61007,1,0.5105435,True,False,False
6.52,-6.611472,1,0.5093307,False,False,False
6.525,-6.613019,1,0.5081432,True,False,False
6.53,-6.613019,1,0.5081432,False,False,False
6.535,-6.614658,1,0.5063186,True,False,False
6.54,-6.614658,1,0.5063186,False,False,False
6.545,-6.616192,1,0.5044949,True,False,False
6.55,-6.618066,1,0.5022625,False,False,False
6.555,-6.619085,1,0.5005313,True,False,False
6.56,-6.619085,1,0.5005313,False,False,False
6.565,-6.619847,1,0.4985462,True,False,False
6.57,-6.619847,1,0.4985462,False,False,False
6.575,-6.619637,1,0.4966893,True,False,False
6.58,-6.619707,1,0.4956393,False,False,False
6.585,-6.619707,1,0.4956393,True,False,False
6.59,-6.61942,1,0.4945409,False,False,False
6.595,-6.618716,1,0.492866,True,False,False
6.6,-6.618716,1,0.492866,False,False,False
6.605,-6.618165,1,0.4907614,True,False,False
6.61,-6.617554,1,0.4898265,False,False,False
6.615,-6.617554,1,0.4898265,True,False,False
6.62,-6.61701,1,0.4877541,False,False,False
6.625,-6.616068,1,0.485524,True,False,False
6.63,-6.616068,1,0.485524,False,False,False
6.635,-6.615786,1,0.484453,True,False,False
6.64,-6.615676,1,0.4826536,False,False,False
6.645,-6.615676,1,0.4826536,True,False,False
6.65,-6.615283,1,0.480023,False,False,False
6.655,-6.61542,1,0.4778278,True,False,False
6.66,-6.61542,1,0.4778278,False,False,False
6.665,-6.615457,1,0.4718033,True,False,False
6.67,-6.615471,1,0.4685647,False,False,False
6.675,-6.61534,1,0.4649513,True,False,False
6.68,-6.61534,1,0.4649513,False,False,False
6.685,-6.61543,1,0.4634006,True,False,False
6.69,-6.61543,1,0.4634006,False,False,False
6.695,-6.615486,1,0.4593141,True,False,False
6.7,-6.615943,1,0.4544116,False,False,False
6.705,-6.615943,1,0.4544116,True,False,False
6.71,-6.616395,1,0.4494833,False,False,False
6.715,-6.616922,1,0.4436428,True,False,False
6.72,-6.616922,1,0.4436428,False,False,False
6.725,-6.617304,1,0.441688,True,False,False
6.73,-6.618856,1,0.4360554,False,False,False
6.735,-6.619752,1,0.4337476,True,False,False
6.74,-6.619752,1,0.4337476,False,False,False
6.745,-6.621384,1,0.4277622,True,False,False
6.75,-6.621384,1,0.4277622,False,False,False
6.755,-6.623473,1,0.4231576,True,False,False
6.76,-6.624812,1,0.4207479,False,False,False
6.765,-6.624812,1,0.4207479,True,False,False
6.77,-6.626533,1,0.4176441,False,False,False
6.775,-6.62837,1,0.4143219,True,False,False
6.78,-6.62837,1,0.4143219,False,False,False
6.785,-6.629596,1,0.4120973,True,False,False
6.79,-6.630167,1,0.4110598,False,False,False
6.795,-6.630167,1,0.4110598,True,False,False
6.8,-6.630509,1,0.4104367,False,False,False
6.805,-6.630509,1,0.4104367,True,False,False
6.81,-6.630509,1,0.4104367,False,False,False
6.815,-6.634381,1,0.4060298,True,False,False
6.82,-6.635048,1,0.4048094,False,False,False
6.825,-6.635048,1,0.4048094,True,False,False
6.83,-6.636256,1,0.4033663,False,False,False
6.835,-6.637223,1,0.4023158,True,False,False
6.84,-6.637223,1,0.4023158,False,False,False
6.845,-6.639221,1,0.4001437,True,False,False
6.85,-6.639694,1,0.3992728,False,False,False
6.855,-6.639694,1,0.3992728,True,False,False
6.86,-6.641627,1,0.3974653,False,False,False
6.865,-6.643081,1,0.3957173,True,False,False
6.87,-6.644503,1,0.3938878,False,False,False
6.875,-6.644503,1,0.3938878,True,False,False
6.88,-6.647883,1,0.3898097,False,False,False
6.885,-6.647883,1,0.3898097,True,False,False
6.89,-6.650099,1,0.3875306,False,False,False
6.895,-6.652254,1,0.3851552,True,False,False
6.9,-6.653163,1,0.3841516,False,False,False
6.905,-6.653163,1,0.3841516,True,False,False
6.91,-6.655709,1,0.3804377,False,False,False
6.915,-6.655709,1,0.3804377,True,False,False
6.92,-6.657638,1,0.3776967,False,False,False
6.925,-6.659616,1,0.3756396,True,False,False
6.93,-6.659616,1,0.3756396,False,False,False
6.935,-6.661309,1,0.3724402,True,False,False
6.94,-6.662596,1,0.3710035,False,False,False
6.945,-6.663714,1,0.3688807,True,False,False
6.95,-6.663714,1,0.3688807,False,False,False
6.955,-6.66511,1,0.3673174,True,False,False
6.96,-6.66511,1,0.3673174,False,False,False
6.965,-6.667326,1,0.363093,True,False,False
6.97,-6.668443,1,0.3609561,False,False,False
6.975,-6.668443,1,0.3609561,True,False,False
6.98,-6.669028,1,0.3598346,False,False,False
6.985,-6.669028,1,0.3598346,True,False,False
6.99,-6.673897,1,0.3504767,False,False,False
6.995,-6.673897,1,0.3504767,True,False,False
7,-6.674285,1,0.3497246,False,False,False
7.005,-6.674532,1,0.3492451,True,False,False
7.01,-6.674532,1,0.3492451,False,False,False
7.015,-6.675065,1,0.3469841,True,False,False
7.02,-6.675065,1,0.3469841,False,False,False
7.025,-6.675385,1,0.3463613,True,False,False
7.03,-6.675867,1,0.344305,False,False,False
7.035,-6.675867,1,0.344305,True,False,False
7.04,-6.676545,1,0.3429849,False,False,False
7.045,-6.676337,1,0.3423402,True,False,False
7.05,-6.6769,1,0.3412412,False,False,False
7.055,-6.6769,1,0.3412412,True,False,False
7.06,-6.676733,1,0.3407226,False,False,False
7.065,-6.676733,1,0.3407226,True,False,False
7.07,-6.6769,1,0.3403961,False,False,False
7.075,-6.677078,1,0.3400477,True,False,False
7.08,-6.677078,1,0.3400477,False,False,False
7.085,-6.677078,1,0.3400477,True,False,False
7.09,-6.677078,1,0.3400477,False,False,False
7.095,-6.677078,1,0.3400477,True,False,False
7.1,-6.677078,1,0.3400477,False,False,False
7.105,-6.677078,1,0.3400477,True,False,False
7.11,-6.677078,1,0.3400477,False,False,False
7.115,-6.677078,1,0.3400477,True,False,False
7.12,-6.677078,1,0.3400477,False,False,False
7.125,-6.677078,1,0.3400477,True,False,False
7.13,-6.677078,1,0.3400477,False,False,False
7.135,-6.677078,1,0.3400477,True,False,False
7.14,-6.677078,1,0.3400477,False,False,False
7.145,-6.677078,1,0.3400477,True,False,False
7.15,-6.677078,1,0.3400477,False,False,False
7.155,-6.677078,1,0.3400477,True,False,False
7.16,-6.677078,1,0.3400477,False,False,False
7.165,-6.677078,1,0.3400477,True,False,False
7.17,-6.677078,1,0.3400477,False,False,False
7.175,-6.677078,1,0.3400477,True,False,False
7.18,-6.677078,1,0.3400477,False,False,False
7.185,-6.677078,1,0.3400477,True,False,False
7.19,-6.677078,1,0.3400477,False,False,False
7.195,-6.677078,1,0.3400477,True,False,False
7.2,-6.677078,1,0.3400477,False,False,False
7.205,-6.677078,1,0.3400477,True,False,False
7.21,-6.677078,1,0.3400477,False,False,False
7.215,-6.677078,1,0.3400477,True,False,False
7.22,-6.677078,1,0.3400477,False,False,False
7.225,-6.677078,1,0.3400477,True,False,False
7.23,-6.677078,1,0.3400477,False,False,False
7.235,-6.677078,1,0.3400477,True,False,False
7.24,-6.677078,1,0.3400477,False,False,False
7.245,-6.677078,1,0.3400477,True,False,False
7.25,-6.677078,1,0.3400477,False,False,False
7.255,-6.677078,1,0.3400477,True,False,False
7.26,-6.677078,1,0.3400477,False,False,False
7.265,-6.677078,1,0.3400477,True,False,False
7.27,-6.677078,1,0.3400477,False,False,False
7.275,-6.677078,1,0.3400477,True,False,False
7.28,-6.677078,1,0.3400477,False,False,False
7.285,-6.677078,1,0.3400477,True,False,False
7.29,-6.677078,1,0.3400477,False,False,False
7.295,-6.677078,1,0.3400477,True,False,False
7.3,-6.677078,1,0.3400477,False,False,False
7.305,-6.677078,1,0.3400477,True,False,False
7.31,-6.677078,1,0.3400477,False,False,False
7.315,-6.677078,1,0.3400477,True,False,False
7.32,-6.677078,1,0.3400477,False,False,False
7.325,-6.677078,1,0.3400477,True,False,False
7.33,-6.677078,1,0.3400477,False,False,False
7.335,-6.677078,1,0.3400477,True,False,False
7.34,-6.677078,1,0.3400477,False,False,False
7.345,-6.677078,1,0.3400477,True,False,False
7.35,-6.677078,1,0.3400477,False,False,False
7.355,-6.677078,1,0.3400477,True,False,False
7.36,-6.677078,1,0.3400477,False,False,False
7.365,-6.677078,1,0.3400477,True,False,False
7.37,-6.677267,1,0.3396793,False,False,False
7.375,-6.677267,1,0.3396793,True,False,False
7.38,-6.677267,1,0.3396793,False,False,False
7.385,-6.677267,1,0.3396793,True,False,False
7.39,-6.677267,1,0.3396793,False,False,False
7.395,-6.677267,1,0.3396793,True,False,False
7.4,-6.67745,1,0.3393204,False,False,False
7.405,-6.67745,1,0.3393204,True,False,False
7.41,-6.67745,1,0.3393204,False,False,False
7.415,-6.67745,1,0.3393204,True,False,False
7.42,-6.67745,1,0.3393204,False,False,False
7.425,-6.67745,1,0.3393204,True,False,False
7.43,-6.677579,1,0.3390689,False,False,False
7.435,-6.677579,1,0.3390689,True,False,False
7.44,-6.677579,1,0.3390689,False,False,False
7.445,-6.677579,1,0.3390689,True,False,False
7.45,-6.677579,1,0.3390689,False,False,False
7.455,-6.677579,1,0.3390689,True,False,False
7.46,-6.677764,1,0.3387071,False,False,False
7.465,-6.677764,1,0.3387071,True,False,False
7.47,-6.677764,1,0.3387071,False,False,False
7.475,-6.677764,1,0.3387071,True,False,False
7.48,-6.677764,1,0.3387071,False,False,False
7.485,-6.677764,1,0.3387071,True,False,False
7.49,-6.677764,1,0.3387071,False,False,False
7.495,-6.677764,1,0.3387071,True,False,False
7.5,-6.677764,1,0.3387071,False,False,False
7.505,-6.677764,1,0.3387071,True,False,False
7.51,-6.677764,1,0.3387071,False,False,False
7.515,-6.677764,1,0.3387071,True,False,False
7.52,-6.677764,1,0.3387071,False,False,False
7.525,-6.677764,1,0.3387071,True,False,False
7.53,-6.677764,1,0.3387071,False,False,False
7.535,-6.677764,1,0.3387071,True,False,False
7.54,-6.677764,1,0.3387071,False,False,False
7.545,-6.677515,1,0.3385798,True,False,False
7.55,-6.677515,1,0.3385798,False,False,False
7.555,-6.677515,1,0.3385798,True,False,False
7.56,-6.677515,1,0.3385798,False,False,False
7.565,-6.677791,1,0.3380393,True,False,False
7.57,-6.677791,1,0.3380393,False,False,False
7.575,-6.677791,1,0.3380393,True,False,False
7.58,-6.677791,1,0.3380393,False,False,False
7.585,-6.677791,1,0.3380393,True,False,False
7.59,-6.677791,1,0.3380393,False,False,False
7.595,-6.677791,1,0.3380393,True,False,False
7.6,-6.677791,1,0.3380393,False,False,False
7.605,-6.677791,1,0.3380393,True,False,False
7.61,-6.677791,1,0.3380393,False,False,False
7.615,-6.677791,1,0.3380393,True,False,False
7.62,-6.677791,1,0.3380393,False,False,False
7.625,-6.677791,1,0.3380393,True,False,False
7.63,-6.677791,1,0.3380393,False,False,False
7.635,-6.677791,1,0.3380393,True,False,False
7.64,-6.677791,1,0.3380393,False,False,False
7.645,-6.677791,1,0.3380393,True,False,False
7.65,-6.677791,1,0.3380393,False,False,False
7.655,-6.677791,1,0.3380393,True,False,False
7.66,-6.677958,1,0.3377138,False,False,False
7.665,-6.677958,1,0.3377138,True,False,False
7.67,-6.677958,1,0.3377138,False,False,False
7.675,-6.677958,1,0.3377138,True,False,False
7.68,-6.677958,1,0.3377138,False,False,False
7.685,-6.677958,1,0.3377138,True,False,False
7.69,-6.677958,1,0.3377138,False,False,False
7.695,-6.677958,1,0.3377138,True,False,False
7.7,-6.677958,1,0.3377138,False,False,False
7.705,-6.677958,1,0.3377138,True,False,False
7.71,-6.677958,1,0.3377138,False,False,False
7.715,-6.677958,1,0.3377138,True,False,False
7.72,-6.677958,1,0.3377138,False,False,False
7.725,-6.677958,1,0.3377138,True,False,False
7.73,-6.677958,1,0.3377138,False,False,False
7.735,-6.677958,1,0.3377138,True,False,False
7.74,-6.677958,1,0.3377138,False,False,False
7.745,-6.677958,1,0.3377138,True,False,False
7.75,-6.677958,1,0.3377138,False,False,False
7.755,-6.677958,1,0.3377138,True,False,False
7.76,-6.677958,1,0.3377138,False,False,False
