%YAML 1.1
%TAG !u! tag:unity3d.com,2011:
--- !u!1001 &4620700503542965546
PrefabInstance:
  m_ObjectHideFlags: 0
  serializedVersion: 2
  m_Modification:
    m_TransformParent: {fileID: 0}
    m_Modifications:
    - target: {fileID: 100060, guid: 641e9d2f5c6b4cb438161abef3be8300, type: 3}
      propertyPath: m_Name
      value: vr_glove_right_model_slim
      objectReference: {fileID: 0}
    - target: {fileID: 400060, guid: 641e9d2f5c6b4cb438161abef3be8300, type: 3}
      propertyPath: m_RootOrder
      value: 0
      objectReference: {fileID: 0}
    - target: {fileID: 400060, guid: 641e9d2f5c6b4cb438161abef3be8300, type: 3}
      propertyPath: m_LocalPosition.x
      value: 0
      objectReference: {fileID: 0}
    - target: {fileID: 400060, guid: 641e9d2f5c6b4cb438161abef3be8300, type: 3}
      propertyPath: m_LocalPosition.y
      value: 0
      objectReference: {fileID: 0}
    - target: {fileID: 400060, guid: 641e9d2f5c6b4cb438161abef3be8300, type: 3}
      propertyPath: m_LocalPosition.z
      value: 0
      objectReference: {fileID: 0}
    - target: {fileID: 400060, guid: 641e9d2f5c6b4cb438161abef3be8300, type: 3}
      propertyPath: m_LocalRotation.w
      value: 1
      objectReference: {fileID: 0}
    - target: {fileID: 400060, guid: 641e9d2f5c6b4cb438161abef3be8300, type: 3}
      propertyPath: m_LocalRotation.x
      value: 0
      objectReference: {fileID: 0}
    - target: {fileID: 400060, guid: 641e9d2f5c6b4cb438161abef3be8300, type: 3}
      propertyPath: m_LocalRotation.y
      value: 0
      objectReference: {fileID: 0}
    - target: {fileID: 400060, guid: 641e9d2f5c6b4cb438161abef3be8300, type: 3}
      propertyPath: m_LocalRotation.z
      value: 0
      objectReference: {fileID: 0}
    - target: {fileID: 400060, guid: 641e9d2f5c6b4cb438161abef3be8300, type: 3}
      propertyPath: m_LocalEulerAnglesHint.x
      value: 0
      objectReference: {fileID: 0}
    - target: {fileID: 400060, guid: 641e9d2f5c6b4cb438161abef3be8300, type: 3}
      propertyPath: m_LocalEulerAnglesHint.y
      value: 0
      objectReference: {fileID: 0}
    - target: {fileID: 400060, guid: 641e9d2f5c6b4cb438161abef3be8300, type: 3}
      propertyPath: m_LocalEulerAnglesHint.z
      value: 0
      objectReference: {fileID: 0}
    m_RemovedComponents: []
  m_SourcePrefab: {fileID: 100100000, guid: 641e9d2f5c6b4cb438161abef3be8300, type: 3}
