Launch number,User satisfied
1,False
2,True
3,False
4,False
5,True
6,True
7,True
8,True
9,True
10,False
11,True
12,False
13,True
14,True
15,False
16,True
17,True
18,True
19,True
20,True
21,False
22,True
23,False
24,False
25,True
26,True
27,False
28,False
29,False
30,False
31,True
32,False
33,True
34,True
35,True
36,False
37,True
38,True
39,True
40,True
41,False
42,True
43,True
44,True
45,True
46,True
47,False
48,True
49,True
50,True
