Launch counter,Elapsed time,Absolute time,Enhancement mode,Target mode,Support rate,Self efficacy,RedBall initial position X,RedBall initial position Y,RedBall initial position Z,Target position X,Target position Y,Target position Z,Target rotation X,Target rotation Y,Target rotation Z,Real velocity X,Real velocity Y,Real velocity Z,Real velocity magnitude,Velocity force X,Velocity force Y,Velocity force Z,Direction force X,Direction force Y,Direction force Z,Enhanced velocity X,Enhanced velocity Y,Enhanced velocity Z,Enhanced velocity magnitude,Angular velocity X,Angular velocity Y,Angular velocity Z,Direction error,Enhanced direction error
1,3.02734,15:42:8:109,SupportRate,Ground,20,True,0.1143638,1.022225,0.2214286,0,0,4.5,270,180,0,-0.4904082,-0.4022388,1.452785,1.585207,,,,,,,-0.4184264,0.3046273,2.138671,2.200408,3.166369,0.04638102,0.8465868,,
2,12.74723,15:42:17:821,SupportRate,Ground,21,True,0.1810476,0.9898128,0.1239643,0,0,4.5,270,180,0,-0.3475773,1.37036,1.118736,1.80285,,,,,,,-0.3182673,1.740324,1.939605,2.625279,-8.044921,1.188698,-2.734766,,
3,15.27079,15:42:20:348,SupportRate,Ground,22,True,0.1982452,1.010371,0.1881897,0,0,4.5,270,180,0,-0.281911,1.455095,0.7450323,1.65887,,,,,,,-0.2697816,1.824035,1.666248,2.48521,-8.547465,2.079046,-3.506212,,
4,16.54155,15:42:21:615,SupportRate,Ground,23,True,0.2045243,0.9919355,0.2030992,0,0,4.5,270,180,0,-0.2378479,1.405546,0.6873985,1.582608,,,,,,,-0.2371636,1.802652,1.664231,2.464846,-9.376241,2.42689,-3.031661,,
5,19.00194,15:42:24:77,SupportRate,Ground,24,True,0.2106879,0.9871286,0.2122845,0,0,4.5,270,180,0,-0.1588171,1.392426,0.668268,1.552628,,,,,,,-0.1788286,1.809946,1.690839,2.483308,-8.999942,1.851076,-2.139666,,
6,21.07697,15:42:26:151,SupportRate,Ground,25,True,0.1973788,0.9249536,0.1961616,0,0,4.5,270,180,0,-0.4578116,0.8863146,1.220747,1.576505,,,,,,,-0.4008522,1.447759,2.169204,2.638586,-2.714803,1.363732,-2.404837,,
7,24.97219,15:42:30:48,SupportRate,Ground,26,True,0.1809761,1.088105,0.1775188,0,0,4.5,270,180,0,-0.4832483,1.689365,1.98573,2.651529,,,,,,,-0.4105752,2.064474,2.734624,3.450912,-3.282528,0.5463302,-3.690768,,
8,26.16893,15:42:31:243,SupportRate,Ground,27,True,0.2167426,0.9867581,0.2594482,0,0,4.5,270,180,0,-0.3011805,1.546703,1.500084,2.175604,,,,,,,-0.2871398,1.974758,2.411351,3.129973,-0.6645715,1.357946,-2.807401,,
9,28.58073,15:42:33:654,SupportRate,Ground,28,True,0.2137634,0.9601266,0.2479198,0,0,4.5,270,180,0,-0.3181288,1.163678,1.293539,1.768784,,,,,,,-0.2982576,1.714834,2.30794,2.890709,-2.478355,1.823038,-2.586686,,
10,29.80158,15:42:34:876,SupportRate,Ground,29,True,0.1961221,1.026326,0.2894315,0,0,4.5,270,180,0,-0.4324436,1.722367,1.250161,2.171741,,,,,,,-0.3718792,2.131187,2.279763,3.14286,-2.988361,0.8351755,-3.137693,,
11,32.45419,15:42:37:528,SupportRate,Ground,20,True,0.1753798,1.296841,0.353414,0,0,4.5,270,180,0,-0.05984585,2.700248,0.2422833,2.711756,,,,,,,-0.08581608,2.786617,1.090845,2.99375,-13.73811,2.151553,-3.091695,,
12,33.88055,15:42:38:954,SupportRate,Ground,22,True,0.2258226,0.9751125,0.2290637,0,0,4.5,270,180,0,-0.4696116,1.918184,1.865543,2.716655,,,,,,,-0.423555,2.185243,2.538031,3.375839,-4.182167,0.4245237,-0.3508823,,
13,35.18673,15:42:40:261,SupportRate,Ground,24,True,0.17834,1.005858,0.216006,0,0,4.5,270,180,0,-0.4405673,1.550728,1.719932,2.357333,,,,,,,-0.3838394,1.930255,2.484399,3.169457,-2.943286,-1.011266,-1.622322,,
14,36.42561,15:42:41:499,SupportRate,Ground,26,True,0.2093102,0.9593413,0.2275489,0,0,4.5,270,180,0,-0.4044785,1.31473,1.300395,1.89292,,,,,,,-0.3622478,1.787244,2.246897,2.893789,-1.026226,0.09785698,-1.156817,,
15,37.6977,15:42:42:772,SupportRate,Ground,28,True,0.189777,1.01719,0.2345436,0,0,4.5,270,180,0,-0.4286867,1.666644,1.006756,1.993749,,,,,,,-0.3693528,2.07697,2.08913,2.968954,-2.734651,-0.1294051,-2.349132,,
16,38.97162,15:42:44:50,SupportRate,Ground,30,True,0.1635783,1.306378,0.2814074,0,0,4.5,270,180,0,-0.377017,3.010497,0.3408783,3.053102,,,,,,,-0.3168996,3.046975,1.605137,3.458461,-10.93073,-0.3034087,-5.940291,,
17,40.20422,15:42:45:282,SupportRate,Ground,32,True,0.2124829,0.9757404,0.223428,0,0,4.5,270,180,0,-0.4431602,1.389555,0.9474531,1.73923,,,,,,,-0.3797029,1.947167,2.221272,2.978202,-1.673653,0.6905973,-2.664363,,
18,41.46126,15:42:46:540,SupportRate,Ground,34,True,0.2148413,0.9567358,0.2273518,0,0,4.5,270,180,0,-0.498834,1.204435,0.9738247,1.627216,,,,,,,-0.4137506,1.859838,2.323617,3.004894,-1.710533,0.5904189,-2.124715,,
19,42.65965,15:42:47:736,SupportRate,Ground,36,True,0.2085988,0.9672781,0.2152963,0,0,4.5,270,180,0,-0.4319373,1.233116,0.7944968,1.529173,,,,,,,-0.3631341,1.916747,2.289213,3.007704,-1.074103,0.2208272,-2.293615,,
20,43.83482,15:42:48:910,SupportRate,Ground,38,True,0.2126084,0.9751781,0.2193391,0,0,4.5,270,180,0,-0.4321983,1.40005,0.9587203,1.751023,,,,,,,-0.3610744,2.058226,2.469115,3.234687,-2.450295,0.8493829,-2.753224,,
21,45.01632,15:42:50:94,SupportRate,Ground,20,True,0.1822788,0.9805006,0.216752,0,0,4.5,270,180,0,-0.5888538,1.508902,0.9107001,1.8582,,,,,,,-0.5130504,1.83354,1.714722,2.562296,-2.208381,0.591435,-3.264148,,
22,47.34463,15:42:52:421,SupportRate,Ground,23,True,0.2003974,0.9732107,0.2248899,0,0,4.5,270,180,0,-0.5063663,1.665878,1.19064,2.109308,,,,,,,-0.4430446,2.003107,2.050492,2.900559,-3.026878,0.7401781,-3.255546,,
23,48.58166,15:42:53:655,SupportRate,Ground,26,True,0.2054252,0.975455,0.2190087,0,0,4.5,270,180,0,-0.4074277,1.375141,0.9348125,1.711983,,,,,,,-0.3630483,1.831948,1.97448,2.717795,-2.48313,0.627987,-2.588297,,
24,49.94113,15:42:55:19,SupportRate,Ground,29,True,0.1821833,1.146193,0.283823,0,0,4.5,270,180,0,-0.3861625,2.179943,0.6757588,2.314718,,,,,,,-0.3329705,2.456066,1.840454,3.087134,-6.078372,-0.4948297,-2.052562,,
25,51.16569,15:42:56:240,SupportRate,Ground,32,True,0.2041919,0.9765608,0.2256284,0,0,4.5,270,180,0,-0.4537091,1.49905,1.039166,1.879593,,,,,,,-0.3838056,2.021623,2.282549,3.073158,-2.904573,0.6848865,-2.58772,,
26,52.37951,15:42:57:453,SupportRate,Ground,35,True,0.1898966,0.9796693,0.2002415,0,0,4.5,270,180,0,-0.4719856,1.450477,0.8609668,1.751547,,,,,,,-0.3833163,2.039042,2.292372,3.091859,-2.50359,-0.07979566,-2.970758,,
27,53.53704,15:42:58:612,SupportRate,Ground,38,True,0.2111341,0.962668,0.2112119,0,0,4.5,270,180,0,-0.4965532,1.393823,1.038709,1.807823,,,,,,,-0.4005778,2.054365,2.527326,3.281502,-2.849339,0.9862935,-2.896792,,
28,54.75819,15:42:59:835,SupportRate,Ground,41,True,0.20203,0.9871126,0.2046047,0,0,4.5,270,180,0,-0.3724703,1.41926,0.8071821,1.674687,,,,,,,-0.3149785,2.121521,2.500746,3.29451,-2.031441,0.1425763,-2.601828,,
29,55.94323,15:43:1:17,SupportRate,Ground,44,True,0.1946003,0.9654744,0.2019042,0,0,4.5,270,180,0,-0.5174789,1.451739,0.9387206,1.804585,,,,,,,-0.3886755,2.191094,2.709788,3.50641,-2.360991,0.4876406,-3.383811,,
30,57.16306,15:43:2:237,SupportRate,Ground,47,True,0.2004759,0.9850609,0.2052951,0,0,4.5,270,180,0,-0.4617037,1.402875,0.7141154,1.640485,,,,,,,-0.3530663,2.215607,2.6999,3.510418,-2.026813,-0.2877616,-2.793386,,
31,58.29242,15:43:3:366,SupportRate,Ground,20,True,0.1893677,1.00395,0.1875561,0,0,4.5,270,180,0,-0.4326974,1.663718,0.8916849,1.936565,,,,,,,-0.3895409,1.957392,1.701303,2.62251,-3.366939,0.1942672,-3.509749,,
32,60.7193,15:43:5:793,SupportRate,Ground,24,True,0.2013075,0.9820436,0.1898922,0,0,4.5,270,180,0,-0.3735579,1.303389,0.7460154,1.547548,,,,,,,-0.3395038,1.742277,1.757394,2.497845,-2.398914,0.4202687,-2.801527,,
33,63.13612,15:43:8:210,SupportRate,Ground,28,True,0.1942747,0.9767431,0.1953809,0,0,4.5,270,180,0,-0.5185749,1.452212,0.7748376,1.72575,,,,,,,-0.4360451,1.922579,1.946513,2.770444,-2.285526,0.09321243,-3.108026,,
34,64.44667,15:43:9:520,SupportRate,Ground,32,True,0.2080011,1.022318,0.2264812,0,0,4.5,270,180,0,-0.3284127,1.33788,0.6596816,1.527402,,,,,,,-0.2992702,1.912028,2.009017,2.789545,-3.228962,0.5042186,-2.557116,,
35,66.85711,15:43:11:932,SupportRate,Ground,36,True,0.1981274,0.988204,0.1953858,0,0,4.5,270,180,0,-0.4996179,1.416142,0.7380542,1.67326,,,,,,,-0.40173,2.033884,2.253374,3.061987,-2.733291,0.3303059,-3.02965,,
36,68.21071,15:43:13:284,SupportRate,Ground,40,True,0.2078868,0.9903567,0.2019097,0,0,4.5,270,180,0,-0.2480615,1.33274,0.7343201,1.541738,,,,,,,-0.2443626,2.052481,2.415599,3.179231,-3.105955,0.3348712,-2.140716,,
37,70.57986,15:43:15:655,SupportRate,Ground,44,True,0.1910651,0.9740332,0.1978653,0,0,4.5,270,180,0,-0.4314499,1.349437,0.6729568,1.568439,,,,,,,-0.3385245,2.133805,2.558996,3.349057,-3.029555,0.1433833,-2.623068,,
38,71.86996,15:43:16:944,SupportRate,Ground,48,True,0.1872495,0.9866903,0.2107788,0,0,4.5,270,180,0,-0.4916945,1.275748,0.6240975,1.502928,,,,,,,-0.3590128,2.166793,2.691494,3.473905,-2.883203,-0.1657874,-2.478877,,
39,73.25496,15:43:18:328,SupportRate,Ground,52,True,0.1850604,1.023006,0.1989017,0,0,4.5,270,180,0,-0.3595514,1.407572,0.5695819,1.560436,,,,,,,-0.2823751,2.304322,2.825102,3.656616,-4.025388,0.002599095,-2.934289,,
40,74.35583,15:43:19:430,SupportRate,Ground,56,True,0.1816496,0.9843905,0.1859166,0,0,4.5,270,180,0,-0.498882,1.336827,0.5740945,1.538042,,,,,,,-0.3365138,2.342175,3.031425,3.845591,-2.828475,0.0695012,-3.059129,,
41,75.63362,15:43:20:708,SupportRate,Ground,20,True,0.1846916,1.008001,0.2005993,0,0,4.5,270,180,0,-0.3664664,1.491912,0.5920938,1.646413,,,,,,,-0.3354488,1.819948,1.457801,2.355827,-3.875751,0.2714888,-3.406669,,
42,76.7593,15:43:21:834,SupportRate,Ground,25,True,0.1829595,0.9853182,0.1877232,0,0,4.5,270,180,0,-0.4243689,1.427378,0.6749324,1.634941,,,,,,,-0.3708776,1.853557,1.745981,2.573261,-2.343863,-0.02470884,-3.270821,,
43,77.90469,15:43:22:981,SupportRate,Ground,30,True,0.1936809,0.9763176,0.1874054,0,0,4.5,270,180,0,-0.444138,1.277658,0.6530492,1.502045,,,,,,,-0.3778452,1.833988,1.947845,2.701921,-2.296055,0.7739175,-3.83757,,
44,79.11225,15:43:24:186,SupportRate,Ground,35,True,0.1746479,1.054913,0.2194039,0,0,4.5,270,180,0,-0.3615,1.470953,0.5110386,1.598608,,,,,,,-0.3042555,2.052352,2.030231,2.902853,-4.082117,0.05838553,-3.09011,,
45,80.23367,15:43:25:308,SupportRate,Ground,40,True,0.1888008,1.014621,0.2031994,0,0,4.5,270,180,0,-0.442349,1.43888,0.6711435,1.648175,,,,,,,-0.3517217,2.116165,2.367016,3.194468,-3.239213,-0.2012743,-2.641546,,
46,81.4045,15:43:26:482,SupportRate,Ground,45,True,0.2033026,1.007686,0.2120324,0,0,4.5,270,180,0,-0.2744162,1.350819,0.6184126,1.510778,,,,,,,-0.2556411,2.152392,2.54867,3.345723,-3.877339,-0.0294284,-2.131181,,
47,82.68366,15:43:27:762,SupportRate,Ground,50,True,0.1846129,1.07296,0.2150506,0,0,4.5,270,180,0,-0.2945952,1.38838,0.5066716,1.507017,,,,,,,-0.251532,2.260236,2.672664,3.509283,-4.217493,0.1223459,-2.955489,,
48,83.91083,15:43:28:985,SupportRate,Ground,55,True,0.1810572,1.048549,0.2113504,0,0,4.5,270,180,0,-0.2919687,1.390697,0.5056228,1.50829,,,,,,,-0.2443984,2.348464,2.904424,3.743087,-3.784957,-0.2062491,-2.264354,,
49,85.23172,15:43:30:307,SupportRate,Ground,60,True,0.1755922,1.107922,0.230235,0,0,4.5,270,180,0,-0.2302878,1.47478,0.2363445,1.511247,,,,,,,-0.2102497,2.469167,2.967141,3.865866,-4.663591,-0.421211,-2.63324,,
50,86.55691,15:43:31:632,SupportRate,Ground,65,True,0.2024576,1.003345,0.2168282,0,0,4.5,270,180,0,-0.3083602,1.308591,0.7347926,1.532128,,,,,,,-0.2586862,2.493866,3.446643,4.262116,-3.066195,-0.09669842,-1.838753,,
