Launch number,Target hit,Error,Drop point X,Drop point Y
1,False,0.6662461,-0.163909,-0.6457691
2,True,0.2612463,-0.09966642,-0.2414875
3,True,0.1615851,-0.1395669,-0.08142996
4,False,0.4054764,-0.3758698,0.1520953
5,True,0.2325178,-0.1886218,-0.1359644
6,False,0.3199791,-0.2364952,-0.215538
7,False,0.327086,-0.1596522,-0.2854757
8,False,0.8302808,-0.05576376,-0.8284061
9,True,0.2757053,-0.2298602,-0.1522422
10,True,0.2793131,-0.153564,-0.2333107
11,True,0.2818625,-0.1456489,-0.2413149
12,False,0.7182619,-0.2221556,-0.6830425
13,True,0.1450377,-0.09790991,-0.1070027
14,True,0.1665418,-0.1589593,0.04968023
15,False,0.4841062,-0.1682091,-0.4539433
16,True,0.2720036,-0.04715905,-0.2678843
17,False,0.7825182,-0.1105884,-0.7746644
18,True,0.2756649,-0.21639,-0.1707821
19,True,0.1409305,-0.1376957,-0.03002167
20,True,0.2697565,-0.09738891,-0.2515631
21,False,0.4841146,-0.2037198,-0.4391642
22,True,0.2170596,-0.02065666,0.2160745
23,False,0.5408546,-0.2125933,-0.4973207
24,True,0.2612916,-0.02798658,0.2597885
25,True,0.2172936,-0.1819143,0.1188431
