Launch number,Change noticed
1,NV
2,False
3,True
4,False
5,False
6,True
7,False
8,False
9,False
10,False
11,NV
12,False
13,True
14,True
15,True
16,False
17,True
18,False
19,True
20,False
21,NV
22,True
23,False
24,True
25,False
26,False
27,False
28,True
29,True
30,False
31,NV
32,True
33,False
34,False
35,True
36,False
37,False
38,True
39,False
40,False
41,NV
42,False
43,True
44,True
45,True
46,True
47,False
48,True
49,False
50,True
