Launch number,Target hit,Error,Drop point X,Drop point Y
1,False,1.51989,-0.08806254,-1.517337
2,False,3.944659,0.1747704,-3.940786
3,False,4.044407,0.02225302,-4.044346
4,False,4.044305,0.043923,-4.044066
5,False,3.877513,0.01916915,-3.877465
6,False,3.95272,0.006186517,-3.952716
7,False,4.018514,0.02337114,-4.018446
8,False,4.124484,0.1908742,-4.120065
9,False,4.322534,0.2001313,-4.317898
10,False,4.240467,0.1312614,-4.238435
11,False,4.081843,0.1724729,-4.078197
12,False,4.327202,0.1259507,-4.325369
13,False,4.148225,0.1992795,-4.143436
14,False,4.033619,0.09264936,-4.032555
15,False,4.24227,0.1264571,-4.240385
16,False,4.302629,0.13805,-4.300413
17,False,4.220569,0.1278913,-4.21863
18,False,4.202055,0.1780088,-4.198283
19,False,4.188216,0.1549259,-4.185349
20,False,4.291367,0.2503178,-4.28406
21,False,4.34356,0.05560537,-4.343204
22,False,4.145965,0.1785702,-4.142118
23,False,4.294374,0.02024247,-4.294327
24,False,4.360913,0.1117175,-4.359482
25,False,4.100162,0.1044077,-4.098833
26,False,4.290052,0.1314772,-4.288037
27,False,4.314337,0.1907128,-4.31012
28,False,4.170061,0.1621196,-4.166908
29,False,4.305509,0.2166005,-4.300057
30,False,4.128528,0.1187328,-4.12682
31,False,4.263118,0.1105113,-4.261685
32,False,4.318418,0.1077707,-4.317072
33,False,4.202297,0.05284914,-4.201964
34,False,4.138279,0.1299955,-4.136237
35,False,4.238597,0.2362816,-4.232007
36,False,4.312861,0.1081824,-4.311504
37,False,4.205194,0.1006419,-4.20399
38,False,4.343378,0.2207624,-4.337764
39,False,4.033937,-0.07898578,-4.033163
40,False,3.997496,0.2749918,-3.988026
41,False,4.05815,-0.1036146,-4.056827
42,False,4.327161,0.1936937,-4.322824
43,False,3.998726,0.1281718,-3.996671
44,False,4.063498,0.1165971,-4.061825
45,False,3.845155,0.1212874,-3.843242
46,False,4.01192,0.3569475,-3.996009
47,False,3.954937,-0.3593846,-3.938574
48,False,3.984447,0.2027092,-3.979288
49,False,4.007122,0.2301344,-4.000508
50,False,4.235663,-0.007803603,-4.235656
