Launch number,Target hit,Error,Drop point X,Drop point Y
1,False,0.4053675,-0.06874098,-0.3994966
2,False,1.20425,-0.01157274,-1.204194
3,True,0.1345233,0.004945729,-0.1344323
4,False,0.3936175,-0.2768457,-0.2798057
5,False,1.073236,-0.01051845,-1.073184
6,True,0.1934309,-0.1658497,-0.09954596
7,True,0.09865151,-0.09762997,0.01416016
8,True,0.101892,0.01391819,-0.1009369
9,True,0.1015166,-0.08532016,-0.05500984
10,False,0.3891571,-0.2281556,-0.315259
11,False,0.4824195,-0.06209554,0.4784064
12,False,0.5941035,0.5411794,0.24512
13,True,0.2965962,-0.2218461,0.1968594
14,False,0.6012985,0.1024418,0.5925078
15,False,0.7306252,-0.2383177,-0.6906648
16,False,1.122965,0.1183935,-1.116706
17,False,0.9236941,0.09535179,0.9187593
18,False,2.415523,-0.3533583,-2.389538
19,True,0.2968923,-0.2353746,0.1809525
20,False,0.9359479,-0.3837591,-0.8536553
21,False,1.428055,0.5202734,1.329908
22,True,0.1381347,-0.1043788,0.09047794
23,False,1.105375,-0.09891932,-1.10094
24,True,0.2700882,0.0641993,-0.2623472
25,False,4.841976,-0.3045386,-4.832389
26,True,0.2696673,0.07071248,-0.260231
27,False,10.06357,-1.05582,10.00803
28,False,0.5046445,-0.2683511,-0.4273801
29,True,0.2465273,-0.2414183,0.04992914
30,False,0.3257867,-0.3257233,0.006428242
31,False,0.5183727,-0.4977071,-0.1449065
32,False,0.3086919,-0.2237822,-0.2126317
33,False,0.4599333,-0.1925489,-0.4176884
34,False,0.3986297,0.03303176,-0.3972588
35,True,0.3118441,-0.01659301,0.3114023
36,False,0.5477495,0.3332492,0.4347119
37,True,0.1186593,0.05962471,0.102591
38,False,0.827195,-0.0613363,0.8249178
39,False,0.5125077,0.151154,0.4897108
40,False,1.534157,0.08334263,1.531891
41,False,0.7854326,-0.6769146,0.3983603
42,False,0.4438188,-0.08814579,-0.4349775
43,False,0.6100737,-0.2277216,0.5659795
44,False,0.5830942,-0.09084798,0.5759735
45,False,0.6732039,0.5978503,-0.3094811
46,True,0.1733074,0.06854014,-0.1591783
47,False,1.001159,0.1922555,0.9825263
48,True,0.04147602,-0.03528334,-0.02180243
49,True,0.1684058,0.022412,-0.1669078
50,False,0.6218981,-0.08106951,0.6165915
