Launch counter,Elapsed time,Absolute time,Enhancement mode,Target mode,Support rate,RedBall initial position X,RedBall initial position Y,RedBall initial position Z,Target position X,Target position Y,Target position Z,Target rotation X,Target rotation Y,Target rotation Z,Real velocity X,Real velocity Y,Real velocity Z,Real velocity magnitude,Velocity force X,Velocity force Y,Velocity force Z,Direction force X,Direction force Y,Direction force Z,Enhanced velocity X,Enhanced velocity Y,Enhanced velocity Z,Enhanced velocity magnitude,Angular velocity X,Angular velocity Y,Angular velocity Z,Direction error,Enhanced direction error
1,9.317966,17:22:21:542,None,Ground,0,0.157609,0.9425615,-0.1287006,0,0,3.5,270,180,0,0.2262172,1.388345,3.648465,3.910239,,,,,,,0.2262172,1.388345,3.648465,3.910239,-1.811202,-0.3129845,-0.397006,,
2,15.7833,17:22:28:1,None,Ground,0,0.09121859,0.8666784,0.07946044,0,0,3.5,270,180,0,-0.6604235,1.806827,6.915995,7.178563,,,,,,,-0.6604235,1.806827,6.915995,7.178563,-12.79036,-1.183118,-0.2465945,,
3,24.11643,17:22:36:333,None,Ground,0,0.002605796,0.9742196,-0.09314662,0,0,3.5,270,180,0,-0.5101189,3.255302,5.545304,6.450396,,,,,,,-0.5101189,3.255302,5.545304,6.450396,-10.17396,-2.580674,-2.418895,,
4,39.38595,17:22:51:604,None,Ground,0,0.01255262,0.9431294,-0.1559628,0,0,3.5,270,180,0,0.04456171,2.506211,3.921746,4.654371,,,,,,,0.04456171,2.506211,3.921746,4.654371,-5.982382,-1.271927,-0.2407188,,
5,43.08981,17:22:55:330,None,Ground,0,0.04595149,0.9749516,-0.08019114,0,0,3.5,270,180,0,-0.2292482,2.01632,8.159292,8.407863,,,,,,,-0.2292482,2.01632,8.159292,8.407863,-4.375469,-0.7506666,-0.602523,,
6,45.93865,17:22:58:155,None,Ground,0,-0.06557155,0.9167894,-0.1923625,0,0,3.5,270,180,0,0.02957512,1.806828,2.07718,2.753213,,,,,,,0.02957512,1.806828,2.07718,2.753213,-2.010609,-0.4067814,0.1494175,,
7,49.15331,17:23:1:373,None,Ground,0,0.05413997,0.9375902,-0.09067851,0,0,3.5,270,180,0,0.02776413,2.527941,4.107841,4.823445,,,,,,,0.02776413,2.527941,4.107841,4.823445,-7.580224,-1.800758,-0.5508291,,
8,52.40969,17:23:4:630,None,Ground,0,0.02407372,0.9446144,-0.06333178,0,0,3.5,270,180,0,-0.05163013,1.848595,3.206777,3.701809,,,,,,,-0.05163013,1.848595,3.206777,3.701809,-3.498024,-1.134253,-0.3278494,,
9,56.34792,17:23:8:566,None,Ground,0,0.03379512,0.9218705,-0.07584262,0,0,3.5,270,180,0,-0.1504775,2.278197,3.916759,4.533633,,,,,,,-0.1504775,2.278197,3.916759,4.533633,-2.556484,-1.001839,-0.0112459,,
10,59.351,17:23:11:568,None,Ground,0,0.01456833,0.9031009,-0.0844124,0,0,3.5,270,180,0,-0.4361878,2.037895,3.85048,4.378295,,,,,,,-0.4361878,2.037895,3.85048,4.378295,-5.291687,-0.8860528,-0.7779222,,
11,62.4279,17:23:14:645,None,Ground,0,0.02126145,0.9026947,-0.04852289,0,0,3.5,270,180,0,-0.5722154,2.311444,4.826505,5.381947,,,,,,,-0.5722154,2.311444,4.826505,5.381947,-5.868028,-0.07261159,-0.2979015,,
12,68.01674,17:23:20:234,None,Ground,0,0.04525769,0.8906134,-0.06878483,0,0,3.5,270,180,0,-0.2568552,1.933078,5.213142,5.565934,,,,,,,-0.2568552,1.933078,5.213142,5.565934,-8.425061,-1.678736,-0.3404739,,
13,72.44804,17:23:24:665,None,Ground,0,0.03301477,0.9436605,-0.03703266,0,0,3.5,270,180,0,-0.3706469,2.627634,4.425761,5.160348,,,,,,,-0.3706469,2.627634,4.425761,5.160348,-6.985545,-1.33659,-0.2793806,,
14,75.68019,17:23:27:896,None,Ground,0,0.003024817,0.9631809,-0.05627942,0,0,3.5,270,180,0,-0.3897437,3.019403,4.291233,5.261499,,,,,,,-0.3897437,3.019403,4.291233,5.261499,-7.379715,-2.807717,-0.4466484,,
15,78.64508,17:23:30:865,None,Ground,0,0.01891315,0.906574,-0.05915082,0,0,3.5,270,180,0,-0.3480424,2.050297,3.985744,4.495665,,,,,,,-0.3480424,2.050297,3.985744,4.495665,-5.565909,-0.9846845,-0.4420575,,
16,81.22911,17:23:33:446,None,Ground,0,0.02418566,0.9092006,-0.08114392,0,0,3.5,270,180,0,-0.3876638,2.124089,4.132782,4.662823,,,,,,,-0.3876638,2.124089,4.132782,4.662823,-4.586709,-0.3763304,-0.2138487,,
17,83.77193,17:23:35:990,None,Ground,0,0.04436159,0.950983,-0.02012861,0,0,3.5,270,180,0,-0.215921,2.855485,4.85502,5.636633,,,,,,,-0.215921,2.855485,4.85502,5.636633,-9.403519,-1.4174,0.2402303,,
18,86.39668,17:23:38:614,None,Ground,0,-0.004700661,0.930737,-0.03979617,0,0,3.5,270,180,0,-0.501358,2.519431,4.107523,4.844651,,,,,,,-0.501358,2.519431,4.107523,4.844651,-7.251229,-0.1738004,-1.125931,,
19,89.07404,17:23:41:291,None,Ground,0,0.05926347,0.8970283,-0.1343441,0,0,3.5,270,180,0,0.2383555,2.101097,3.758894,4.312853,,,,,,,0.2383555,2.101097,3.758894,4.312853,-6.845542,-0.8377767,0.2590089,,
20,90.52505,17:23:42:740,None,Ground,0,0.06124628,0.9240239,-0.1629487,0,0,3.5,270,180,0,0.1035624,1.242981,1.119893,1.676272,,,,,,,0.1035624,1.242981,1.119893,1.676272,-4.50127,-0.09197828,0.3538957,,
21,93.03896,17:23:45:256,None,Ground,0,0.03819704,0.9003318,-0.07255709,0,0,3.5,270,180,0,-0.106065,2.29417,4.89398,5.406062,,,,,,,-0.106065,2.29417,4.89398,5.406062,-7.225968,-0.08049369,0.504267,,
22,96.32801,17:23:48:544,None,Ground,0,0.03808498,0.9015867,-0.03840518,0,0,3.5,270,180,0,-0.2330645,2.302128,5.155554,5.651004,,,,,,,-0.2330645,2.302128,5.155554,5.651004,-6.803746,-0.709276,0.009652138,,
23,98.81815,17:23:51:35,None,Ground,0,0.03235555,0.9125495,-0.04661101,0,0,3.5,270,180,0,-0.06363945,2.415765,4.684768,5.271339,,,,,,,-0.06363945,2.415765,4.684768,5.271339,-4.627506,0.3342071,-0.4978307,,
