Launch number,Target hit,Error,Drop point X,Drop point Y
1,False,0.3730615,0.1117034,-0.3559456
2,True,0.2758815,0.2321237,-0.1490946
3,False,0.4876188,0.3537238,-0.3356361
4,False,0.4761041,0.3564565,-0.3156166
5,False,0.67675,0.2512829,-0.6283689
6,False,1.838253,-0.1247251,1.834017
7,False,0.3550279,0.3381423,-0.1081877
8,False,1.250603,-0.1108504,1.245681
9,True,0.2741381,-0.1317706,-0.2403917
10,True,0.2806687,-0.008178158,-0.2805495
