Launch number,Target hit,Error,Drop point X,Drop point Y
1,False,0.5504419,-0.1345084,-0.5337543
2,True,0.218386,-0.08052923,-0.2029963
3,True,0.1376242,-0.1108925,-0.08150625
4,True,0.2904312,-0.2853174,0.05426121
5,True,0.1884337,-0.1464999,-0.1185117
6,True,0.2865844,-0.1763359,-0.2259121
7,True,0.2825519,-0.1139114,-0.2585726
8,False,0.6316463,-0.04430269,-0.6300907
9,True,0.2282104,-0.1777508,-0.1431246
10,True,0.2221787,-0.1153795,-0.1898708
11,True,0.243749,-0.1093953,-0.2178216
12,False,0.5152142,-0.1631104,-0.4887133
13,True,0.1164295,-0.06940417,-0.09348202
14,True,0.1092376,-0.1092359,-0.000597477
15,False,0.3386912,-0.1184309,-0.3173103
16,True,0.2478424,-0.03588535,-0.2452307
17,False,0.5363536,-0.07508685,-0.5310717
18,True,0.2388466,-0.1528252,-0.1835542
19,True,0.1063137,-0.0859632,-0.06255341
20,True,0.2162468,-0.06270507,-0.2069559
21,False,0.3117618,-0.1318654,-0.2825012
22,True,0.08520757,-0.01138835,0.08444309
23,False,0.3389356,-0.1304578,-0.3128228
24,True,0.1053411,-0.01506988,0.1042576
25,True,0.1074823,-0.1040747,0.02684975
