Launch number,Target hit,Error,Drop point X,Drop point Y
1,False,0.5462245,0.06691569,-0.5421102
2,False,1.008133,0.1288878,-0.9998598
3,False,0.8261014,0.1811962,-0.8059847
4,True,0.2758151,0.02675164,-0.2745147
5,True,0.1853934,0.1394544,-0.1221604
6,False,0.8638362,0.07066578,-0.8609409
7,False,0.3632839,-0.05268893,-0.3594427
8,True,0.274465,0.00569156,-0.274406
9,True,0.1063228,0.006238006,-0.1061397
10,True,0.2814006,-0.005739867,-0.281342
11,True,0.2728576,0.0288782,-0.2713251
12,True,0.1127362,-0.01936182,0.1110611
13,True,0.2363116,-0.09364877,0.2169633
14,True,0.08585908,-0.03846131,0.07676268
15,False,0.70498,-0.01313406,-0.7048576
16,True,0.06555033,0.06363431,-0.01573277
17,True,0.3052256,-0.01940216,0.3046083
18,True,0.273363,0.02804421,-0.2719207
19,False,0.3826708,-0.0105617,-0.382525
20,False,0.452513,-0.01776528,-0.4521642
21,True,0.03456396,0.01675744,-0.03023005
22,False,0.4007377,0.09682714,-0.388864
23,False,0.3441367,-0.03211803,-0.3426347
24,True,0.1202464,-0.1071301,-0.05461073
25,True,0.2833778,-0.009851514,-0.2832065
26,True,0.2703193,0.06143513,-0.2632456
27,False,0.4527177,-0.03220113,-0.451571
28,True,0.08794075,-0.06281935,0.06154108
29,False,0.3965379,0.02955614,-0.3954349
30,False,0.3165008,-0.08353556,-0.3052778
31,True,0.1459863,-0.03030122,-0.142807
32,True,0.04791538,-0.01617129,-0.04510403
33,False,0.4322467,3.853784E-07,-0.4322467
34,True,0.2771605,0.02063194,-0.2763915
35,True,0.21296,-0.05767826,0.2050004
36,True,0.04610897,-0.0331033,-0.03209686
37,True,0.005963555,0.003832458,-0.004569054
