1,stud1,A,10,M,36
2,stud2,A,11,F,29
3,stud3,B,22,M,30
4,stud4,B,33,M,23
5,stud5,A,44,F,29
6,stud6,C,33,F,25
7,stud7,C,22,F,22
8,stud8,C,11,M,25
9,stud9,A,67,F,24
10,stud10,B,62,M,20
11,stud11,D,97,M,18
12,stud12,C,46,F,26
13,stud13,D,76,M,31
14,stud14,B,36,F,29
15,stud15,A,77,F,45
16,stud16,C,26,M,31
17,stud17,B,87,M,45
18,stud18,A,19,F,42
19,stud19,D,56,F,33
20,stud20,B,68,F,45
21,stud21,C,97,M,25
22,stud22,A,10,F,39
23,stud23,A,11,M,42
24,stud24,A,22,M,22
25,stud25,B,33,F,18
26,stud26,B,44,F,18
27,stud27,A,33,M,41
28,stud28,C,22,M,18
29,stud29,C,11,F,29
30,stud30,C,67,F,20
31,stud31,A,62,F,34
32,stud32,B,97,M,42
33,stud33,D,46,F,26
34,stud34,C,76,M,27
35,stud35,D,36,M,36
36,stud36,B,77,F,38
37,stud37,A,26,M,23
38,stud38,C,87,F,20
39,stud39,B,19,F,32
40,stud40,A,56,M,33
41,stud41,D,68,M,39
42,stud42,B,97,F,23
43,stud43,C,10,F,18
44,stud44,A,11,F,21
45,stud45,A,22,M,30
46,stud46,A,33,F,37
47,stud47,B,44,M,40
48,stud48,B,33,M,19
49,stud49,A,22,F,26
50,stud50,C,11,F,26
51,stud51,C,67,M,23
52,stud52,C,62,M,21
53,stud53,A,97,F,34
54,stud54,B,46,F,18
55,stud55,D,76,F,42
56,stud56,C,36,M,18
57,stud57,D,77,F,20
58,stud58,B,26,M,44
59,stud59,A,87,M,32
60,stud60,C,19,F,43
61,stud61,B,56,M,28
62,stud62,A,68,F,45
63,stud63,D,97,F,24
64,stud64,B,10,M,31
65,stud65,C,11,M,18
66,stud66,A,22,F,43
67,stud67,A,33,F,42
68,stud68,A,44,F,29
69,stud69,B,33,M,43
70,stud70,B,22,F,35
71,stud71,A,11,M,18
72,stud72,C,67,M,28
73,stud73,C,62,F,31
74,stud74,C,97,F,19
75,stud75,A,46,M,23
76,stud76,B,76,M,38
77,stud77,D,36,F,40
78,stud78,C,77,F,30
79,stud79,D,26,F,35
80,stud80,B,87,M,39
81,stud81,A,19,F,41
82,stud82,C,56,M,18
83,stud83,B,68,M,40
84,stud84,A,97,F,18
85,stud85,D,11,M,45
86,stud86,B,22,F,30
87,stud87,C,33,F,24
88,stud88,A,44,M,33
89,stud89,A,33,M,22
90,stud90,A,22,F,32
91,stud91,B,11,F,18
92,stud92,B,67,F,38
93,stud93,A,62,M,40
94,stud94,C,97,F,18
95,stud95,C,46,M,40
96,stud96,C,76,M,40
97,stud97,A,36,F,25
98,stud98,B,77,F,23
99,stud99,D,26,M,37
100,stud100,C,87,M,25
101,stud101,D,19,F,21
102,stud102,B,56,F,30
103,stud103,A,68,F,36
104,stud104,C,97,M,24
105,stud105,B,10,F,36
106,stud106,A,11,M,21
107,stud107,D,65,M,35
108,stud108,B,78,F,19
109,stud109,C,87,M,28