{
  "type": "service_account",
  "project_id": "fern-1550560518235",
  "private_key_id": "11ce28966deec0d535b908b3e506e2b2597dc842",
  "private_key": "-----BEGIN PRIVATE KEY-----\nMIIEvgIBADANBgkqhkiG9w0BAQEFAASCBKgwggSkAgEAAoIBAQChqksDaXXx+5et\nLD9bPYvr9bfznCkWq4nhe5+rh3VIJY6L6zTuscjkDeHuYwtT70gZIk6hXf+o0gAg\nqESUAFKFKCxS423bhR0OMC/fBSp6ejHTDXp8Wrx1SfMvpFFDmnUMz5yQ36VCZQ+T\noF5FtG4K9zRFqgC2u9lyLF6iL3ngRHKZbt27NZNS17FRoX/j6D+cMVYNcx/tbgsc\nve+GlnMrJtvsQfMK2N9Dzw3YTqUzebu69//tPolDxCijS4SXPM2mLpSpUS6nC+/J\n1tC3UfkMLA0EgCcD22xYxcEOTtOl76LlovuzFWnxqkrrukejpkVqxFK9jvthm+lm\n2bI8mgBPAgMBAAECggEACCHvHHCpixmbI44xG7pot7SIjfE3oe58L63Oi6Gd/+9K\nZfXYQlUK5D9h3mJOIhP3SQhlneQtexp2q4M7e+8uN4jx/d4iBc6C9oFBueg3yanW\n/Xp/7xHeHs+wXkpXqjJyxp5fuRapvhbOZfXweB+KVPPi8HQ2YqWS2+r+fGMuBYmS\nBB/eXQ2w3P+TZlKiuS/DmZjAvj4c7FxFRJXLU/DoYfTyH0NempchPuDgqvNMf3Sc\naluf7dmUODm/EnzQvWhJd2v94BCp6CnlXdyYQ4ZGVeKWxCKtHWiq6GT9I7xQ4++X\nelFOe1I1DuxW5IY9DdOZC6hZgs1yqu3MLzYyO8ja9QKBgQDj1+01crHwTn7wasNf\n8OJmM9Nbo0N5rkpasfpgJ4PFoKjpUIccyia7VMnXCfN1BCZhn6GIq+VQRCXmVtED\nnDtddtPAadnaq0qJdPPT/6yFA2iVmI0yPvF5cmVkHs1z3LKgAOMLOgsPbq8P5HlD\n6ipH/dVl7DhbdB1jgWckzvM5GwKBgQC1pL754wVlmAeAHE0fTZcFIraaPspx/XVG\n0un6UPytf+6SwjtpA8zGMjrkiTljc/+xnv2clMUqAFUnbTDi+9TxBDXbgPlbCYB+\npFoN2xqFnA8cq39QwJUUEI+9b/svSXC4WzjUnMIBfQk/cGh7DhXgd8/+herSlASX\nIkhkghRc3QKBgQCCVFFr8V+3hi82dturVa8rpxmPoaRHRlth5czCk9fchDoau+WN\nolTlc2rBhv+sP+N0lEtiUnGpqFHFoIOO/R84J3CY7/OeEb1hQ3T2H5ofvANnDww1\nYavfPICi9LuxOt0yiU9WbK1G9plNDfQP1TK6W4hl9OmH5rOo56yIcZjPYQKBgHEQ\nB9ORDLXtCJYkh5i5egw3TEP8W5TSeCJKfFtT98OjAwQUpFg8hkTD1UaVZ8RQ2tJb\nrW6+Z286X8a3v5s5t5UB0ug7gnq5EmNBt9AyFnMd7YYh9ZB1HxYrLN10i3wmkWQf\nW+NzY4r7ojr7o/0cil97FFtQThcfDTBppXfyQ+x9AoGBAKhNhBL2D3NTMhGCOlY+\n7uXtriIqUO9sZ8/HkkztqtWcuMySstYANNdX6IqKpDvtU7xu9Qn0lH2B4hDZ6wWn\n1qjzwLHOUQmKlB3F0sVUW3ldVjjZQ/uY/w6CBW4kCRfx94RUSPPO2nuOj9Nx6eV7\n+MWPkA5FHEB/Yc12zyIKDMqS\n-----END PRIVATE KEY-----\n",
  "client_email": "firebase-adminsdk-zi4up@fern-1550560518235.iam.gserviceaccount.com",
  "client_id": "113758720756910132519",
  "auth_uri": "https://accounts.google.com/o/oauth2/auth",
  "token_uri": "https://oauth2.googleapis.com/token",
  "auth_provider_x509_cert_url": "https://www.googleapis.com/oauth2/v1/certs",
  "client_x509_cert_url": "https://www.googleapis.com/robot/v1/metadata/x509/firebase-adminsdk-zi4up%40fern-1550560518235.iam.gserviceaccount.com"
}
