<?xml version="1.0" encoding="UTF-8" standalone="no"?>
<svg xmlns="http://www.w3.org/2000/svg" xmlns:xlink="http://www.w3.org/1999/xlink" style="isolation:isolate" viewBox="0 0 768 768" width="64" height="64">
    <g transform="translate(-128, -112)">
        <path d=" M 217.693 258.281 C 230.253 256.772 243.037 256 256 256 C 360.636 256 453.61 306.33 512 384.091 C 570.39 306.33 663.364 256 768 256 C 780.963 256 793.747 256.772 806.307 258.281 C 822.847 296.878 832 339.379 832 384 C 832 560.613 688.613 704 512 704 C 335.387 704 192 560.613 192 384 C 192 339.379 201.153 296.878 217.693 258.281 Z " fill="none" vector-effect="non-scaling-stroke" stroke-width="12" stroke="rgb(255,255,255)" stroke-opacity="0.875" stroke-linejoin="miter" stroke-linecap="square" stroke-miterlimit="3"/>
        <path d="M 512 384 A 320 320, 0, 0, 0, 512 768 A 320 320, 0, 0, 0, 512 384 Z" fill="rgb(255,255,255)" vector-effect="non-scaling-stroke" stroke-width="12" stroke="rgb(255,255,255)" stroke-linejoin="miter" stroke-linecap="square" stroke-miterlimit="3"/>
    </g>
</svg>