{
  "kind": "youtube#searchListResponse",
  "etag": "mNYK4jUvzgwrIyBdoaGsrL6sQPM",
  "nextPageToken": "CDIQAA",
  "regionCode": "IN",
  "pageInfo": {
    "totalResults": 1000000,
    "resultsPerPage": 50
  },
  "items": [
    {
      "kind": "youtube#searchResult",
      "etag": "5nzFPrKJZEH3IXsQbQkj1kK2gvY",
      "id": {
        "kind": "youtube#video",
        "videoId": "XY-q3AYDVSM"
      },
      "snippet": {
        "publishedAt": "2020-12-12T04:30:02Z",
        "channelId": "UCWIXQbDTUZ68Ve7NHVRM14g",
        "title": "Kishan Raval - Ek Mulakat - Full Video - New Gujarati Song - Keshar Music",
        "description": "Enjoy the official video of new gujarati song ek mulakat by Kishan Rawal featuring Samarth Sharma, Neha Suthar music by Shankar Prajapati also lyrics penned ...",
        "thumbnails": {
          "default": {
            "url": "https://i.ytimg.com/vi/XY-q3AYDVSM/default.jpg",
            "width": 120,
            "height": 90
          },
          "medium": {
            "url": "https://i.ytimg.com/vi/XY-q3AYDVSM/mqdefault.jpg",
            "width": 320,
            "height": 180
          },
          "high": {
            "url": "https://i.ytimg.com/vi/XY-q3AYDVSM/hqdefault.jpg",
            "width": 480,
            "height": 360
          }
        },
        "channelTitle": "Keshar Music",
        "liveBroadcastContent": "none",
        "publishTime": "2020-12-12T04:30:02Z"
      }
    },
    {
      "kind": "youtube#searchResult",
      "etag": "WD3VOAffGwFkiYJVO6MabGYqak8",
      "id": {
        "kind": "youtube#video",
        "videoId": "lOCkbV3OL_M"
      },
      "snippet": {
        "publishedAt": "2020-10-18T01:30:02Z",
        "channelId": "UCgvKGKLkN9BJ1DvU2opQMnA",
        "title": "Umesh Barot &amp; Trusha Rami ||  Bhammariyado (ભમ્મરીયાળો) || New Gujarati Song 2020 @POP SKOPE MUSIC",
        "description": "PopSkope Music Present.... દરોજ અવનવા સોંગ જોવા માટે અત્યારે જ અમારી ચેનલ ને સબસ્ક્રાઈબ કરો.",
        "thumbnails": {
          "default": {
            "url": "https://i.ytimg.com/vi/lOCkbV3OL_M/default.jpg",
            "width": 120,
            "height": 90
          },
          "medium": {
            "url": "https://i.ytimg.com/vi/lOCkbV3OL_M/mqdefault.jpg",
            "width": 320,
            "height": 180
          },
          "high": {
            "url": "https://i.ytimg.com/vi/lOCkbV3OL_M/hqdefault.jpg",
            "width": 480,
            "height": 360
          }
        },
        "channelTitle": "POP SKOPE MUSIC",
        "liveBroadcastContent": "none",
        "publishTime": "2020-10-18T01:30:02Z"
      }
    },
    {
      "kind": "youtube#searchResult",
      "etag": "lDnWZfSdBvNdtfhd4W-uYTBgfAo",
      "id": {
        "kind": "youtube#video",
        "videoId": "7YG_JAdyWjU"
      },
      "snippet": {
        "publishedAt": "2020-09-26T01:30:00Z",
        "channelId": "UC15sUwufvfo5Z62KBZVzHRQ",
        "title": "Jode Rejo Raj ||Farida Mir||Aditya Gadhvi ||New Gujarati Video Song 2020 ||Ram Audio",
        "description": "AIRTEL હેલોટ્યુન માટે ડાયરેક્ટ ડાયલ કરો Jode Rejo Raj Tame - 5432117492643 Chomasani Jadiyu Pade - 5432117493876 Jode Kem Rahu ...",
        "thumbnails": {
          "default": {
            "url": "https://i.ytimg.com/vi/7YG_JAdyWjU/default.jpg",
            "width": 120,
            "height": 90
          },
          "medium": {
            "url": "https://i.ytimg.com/vi/7YG_JAdyWjU/mqdefault.jpg",
            "width": 320,
            "height": 180
          },
          "high": {
            "url": "https://i.ytimg.com/vi/7YG_JAdyWjU/hqdefault.jpg",
            "width": 480,
            "height": 360
          }
        },
        "channelTitle": "Ram Audio",
        "liveBroadcastContent": "none",
        "publishTime": "2020-09-26T01:30:00Z"
      }
    },
    {
      "kind": "youtube#searchResult",
      "etag": "3kRPSNjtcAF8KpwU_pSEAYpRdNY",
      "id": {
        "kind": "youtube#video",
        "videoId": "qStmNN_wqhQ"
      },
      "snippet": {
        "publishedAt": "2021-04-15T22:13:54Z",
        "channelId": "UCfvCHVcXRzTBm4WW1zkgIuQ",
        "title": "16 अप्रैल चौथा नवरात्रा:इस वंदना को सुनने से मां कुष्मांडा प्रसन्न होकर सभी मनोकामनाएं पूर्ण होती",
        "description": "16 अप्रैल चौथा नवरात्रा:इस वंदना को सुनने से मां कुष्मांडा प्रसन्न होकर सभी मनोकामनाएं पूर्ण होती #navratri​ ...",
        "thumbnails": {
          "default": {
            "url": "https://i.ytimg.com/vi/qStmNN_wqhQ/default_live.jpg",
            "width": 120,
            "height": 90
          },
          "medium": {
            "url": "https://i.ytimg.com/vi/qStmNN_wqhQ/mqdefault_live.jpg",
            "width": 320,
            "height": 180
          },
          "high": {
            "url": "https://i.ytimg.com/vi/qStmNN_wqhQ/hqdefault_live.jpg",
            "width": 480,
            "height": 360
          }
        },
        "channelTitle": "Bhakti Dhaam",
        "liveBroadcastContent": "live",
        "publishTime": "2021-04-15T22:13:54Z"
      }
    },
    {
      "kind": "youtube#searchResult",
      "etag": "HaB8C2TAew8XuHoqVLGFivSRGM8",
      "id": {
        "kind": "youtube#video",
        "videoId": "1_fbmkEKL3k"
      },
      "snippet": {
        "publishedAt": "2019-01-18T23:59:39Z",
        "channelId": "UCpW8eUcMQyXf0uYodNFgh3A",
        "title": "Non-stop Hit/New Urban Gujarati Love Songs 2019 #Top10  | Gujarati Romantic Songs | Audio Junkbox",
        "description": "Hello there ! Here is the non-stop top 10 urban Gujarati love songs. If you like the video, kindly consider to subscribe the channel and hit the like button. Please ...",
        "thumbnails": {
          "default": {
            "url": "https://i.ytimg.com/vi/1_fbmkEKL3k/default.jpg",
            "width": 120,
            "height": 90
          },
          "medium": {
            "url": "https://i.ytimg.com/vi/1_fbmkEKL3k/mqdefault.jpg",
            "width": 320,
            "height": 180
          },
          "high": {
            "url": "https://i.ytimg.com/vi/1_fbmkEKL3k/hqdefault.jpg",
            "width": 480,
            "height": 360
          }
        },
        "channelTitle": "DJ4 Charity",
        "liveBroadcastContent": "none",
        "publishTime": "2019-01-18T23:59:39Z"
      }
    },
    {
      "kind": "youtube#searchResult",
      "etag": "4e_pSwsyPEUUvEXH421-dKf5A7c",
      "id": {
        "kind": "youtube#video",
        "videoId": "0VFgA1QYcmM"
      },
      "snippet": {
        "publishedAt": "2020-06-12T11:30:43Z",
        "channelId": "UCwk8waXYDxXOFHP9VTMkf8w",
        "title": "Top 10 Best Gujarati Songs Collection | Gujarati Folk songs | Gujarati Album | MILAN",
        "description": "Playlist: 00:00 Radha ne Shyam mali Jashe 03:41 Gori Radha ne Kalo Kaan 06:35 Mane Roopani Zanjari Ghadav 09:11 Sapna Vinani Raat 14:15 Vahal no ...",
        "thumbnails": {
          "default": {
            "url": "https://i.ytimg.com/vi/0VFgA1QYcmM/default.jpg",
            "width": 120,
            "height": 90
          },
          "medium": {
            "url": "https://i.ytimg.com/vi/0VFgA1QYcmM/mqdefault.jpg",
            "width": 320,
            "height": 180
          },
          "high": {
            "url": "https://i.ytimg.com/vi/0VFgA1QYcmM/hqdefault.jpg",
            "width": 480,
            "height": 360
          }
        },
        "channelTitle": "MILAN SAPARIYA",
        "liveBroadcastContent": "none",
        "publishTime": "2020-06-12T11:30:43Z"
      }
    },
    {
      "kind": "youtube#searchResult",
      "etag": "S220Nn1QRpdG0VKWm2EORnx2WUU",
      "id": {
        "kind": "youtube#video",
        "videoId": "xCbHL2uYUYc"
      },
      "snippet": {
        "publishedAt": "2020-12-19T01:30:08Z",
        "channelId": "UC1sSs3PUmjf7vvq_dAfHkBg",
        "title": "Jignesh Barot | KUDRAT | કુદરત | HD Video | Latest Gujarati Song 2020",
        "description": "Jignesh Barot & Tejpalsinh Chavda Sathal Present ... \" Jignesh Barot . KUDRAT . કુદરત \" Jignesh Barot | KUDRAT | કુદરત | HD Video | Latest Gujarati Song ...",
        "thumbnails": {
          "default": {
            "url": "https://i.ytimg.com/vi/xCbHL2uYUYc/default.jpg",
            "width": 120,
            "height": 90
          },
          "medium": {
            "url": "https://i.ytimg.com/vi/xCbHL2uYUYc/mqdefault.jpg",
            "width": 320,
            "height": 180
          },
          "high": {
            "url": "https://i.ytimg.com/vi/xCbHL2uYUYc/hqdefault.jpg",
            "width": 480,
            "height": 360
          }
        },
        "channelTitle": "JIGNESH BAROT",
        "liveBroadcastContent": "none",
        "publishTime": "2020-12-19T01:30:08Z"
      }
    },
    {
      "kind": "youtube#searchResult",
      "etag": "LPcWGxcBm6DAPqsnkGb3hO8zJwU",
      "id": {
        "kind": "youtube#video",
        "videoId": "Onk143t6erg"
      },
      "snippet": {
        "publishedAt": "2020-09-05T01:30:01Z",
        "channelId": "UC15sUwufvfo5Z62KBZVzHRQ",
        "title": "Tamaru Dil Khoi Nakhsho ||Rakesh Barot ||New Gujarati Video Song 2020 ||Ram Audio",
        "description": "AIRTEL હેલોટ્યુન માટે ડાયરેક્ટ ડાયલ કરો Tamaru Dil Khoi Nakhsho - 5432117467110 Chhorao Ne Om Na Vatavso - 5432117467129 Gori ...",
        "thumbnails": {
          "default": {
            "url": "https://i.ytimg.com/vi/Onk143t6erg/default.jpg",
            "width": 120,
            "height": 90
          },
          "medium": {
            "url": "https://i.ytimg.com/vi/Onk143t6erg/mqdefault.jpg",
            "width": 320,
            "height": 180
          },
          "high": {
            "url": "https://i.ytimg.com/vi/Onk143t6erg/hqdefault.jpg",
            "width": 480,
            "height": 360
          }
        },
        "channelTitle": "Ram Audio",
        "liveBroadcastContent": "none",
        "publishTime": "2020-09-05T01:30:01Z"
      }
    },
    {
      "kind": "youtube#searchResult",
      "etag": "yZ5YbaWhpeXNLJzjX_azDMY7lhI",
      "id": {
        "kind": "youtube#video",
        "videoId": "7a5C6I8l7Fk"
      },
      "snippet": {
        "publishedAt": "2019-08-31T12:31:48Z",
        "channelId": "UCZRIvleceNUxAQpVQdQwLAg",
        "title": "New Gujarati DJ Remix Song | Kinjal Dave | Jignesh Kaviraj | Geeta Rabari Vijay Suvada Rakesh Barot",
        "description": "Raghav Digital Presents latest & superhit brand new dj remix of most popular gujarati garba gana video song of 2018 & 2019 that featuring Kinjal Dave | Jignesh ...",
        "thumbnails": {
          "default": {
            "url": "https://i.ytimg.com/vi/7a5C6I8l7Fk/default.jpg",
            "width": 120,
            "height": 90
          },
          "medium": {
            "url": "https://i.ytimg.com/vi/7a5C6I8l7Fk/mqdefault.jpg",
            "width": 320,
            "height": 180
          },
          "high": {
            "url": "https://i.ytimg.com/vi/7a5C6I8l7Fk/hqdefault.jpg",
            "width": 480,
            "height": 360
          }
        },
        "channelTitle": "Raghav Digital",
        "liveBroadcastContent": "none",
        "publishTime": "2019-08-31T12:31:48Z"
      }
    },
    {
      "kind": "youtube#searchResult",
      "etag": "LeJrhNZ7W20DA3JsB6MmaI8UnHs",
      "id": {
        "kind": "youtube#video",
        "videoId": "ZlhNmsFxQqI"
      },
      "snippet": {
        "publishedAt": "2021-04-14T01:30:03Z",
        "channelId": "UC15sUwufvfo5Z62KBZVzHRQ",
        "title": "Pahela Batave Fuldu Pachhi Todi Nakhe Daldu ||Kamlesh Chhatraliya||New Gujarati Song 2021||Ram Audio",
        "description": "Kamlesh Chhatraliya New Song 2021 @Ram Audio Gaana https://bit.ly/3tjX17W JioSaavn https://bit.ly/3deg7a4 iTunes https://apple.co/3s9VfFa Amazon Music ...",
        "thumbnails": {
          "default": {
            "url": "https://i.ytimg.com/vi/ZlhNmsFxQqI/default.jpg",
            "width": 120,
            "height": 90
          },
          "medium": {
            "url": "https://i.ytimg.com/vi/ZlhNmsFxQqI/mqdefault.jpg",
            "width": 320,
            "height": 180
          },
          "high": {
            "url": "https://i.ytimg.com/vi/ZlhNmsFxQqI/hqdefault.jpg",
            "width": 480,
            "height": 360
          }
        },
        "channelTitle": "Ram Audio",
        "liveBroadcastContent": "none",
        "publishTime": "2021-04-14T01:30:03Z"
      }
    },
    {
      "kind": "youtube#searchResult",
      "etag": "rf0Z3jgg5_NSQsqPwJLrPBtqEBs",
      "id": {
        "kind": "youtube#video",
        "videoId": "wbSlCz3TfNo"
      },
      "snippet": {
        "publishedAt": "2020-09-26T03:30:06Z",
        "channelId": "UCWRRnzfu8C2_KodPwLGXUIw",
        "title": "Tane Yaad Che ke Bhuli Gayi ( FULL SONG ) || #Rakesh Barot || Gujarati Latest Song 2020",
        "description": "Album :- Tane Yaad Che ke Bhuli Gayi Singer :- Rakesh Barot Song :- Tane Yaad Che ke Bhuli Gayi Lyrics :- Manu Rabari Music Director :- Mayur Nadiya ...",
        "thumbnails": {
          "default": {
            "url": "https://i.ytimg.com/vi/wbSlCz3TfNo/default.jpg",
            "width": 120,
            "height": 90
          },
          "medium": {
            "url": "https://i.ytimg.com/vi/wbSlCz3TfNo/mqdefault.jpg",
            "width": 320,
            "height": 180
          },
          "high": {
            "url": "https://i.ytimg.com/vi/wbSlCz3TfNo/hqdefault.jpg",
            "width": 480,
            "height": 360
          }
        },
        "channelTitle": "Wave Music Gujarati",
        "liveBroadcastContent": "none",
        "publishTime": "2020-09-26T03:30:06Z"
      }
    },
    {
      "kind": "youtube#searchResult",
      "etag": "yH2iMIUY-YhwKXlR1Ah-FhQ9yPw",
      "id": {
        "kind": "youtube#video",
        "videoId": "soC3FJMqlxM"
      },
      "snippet": {
        "publishedAt": "2021-01-25T02:30:03Z",
        "channelId": "UCuB7zkQVpcPKzHYJn45vM9w",
        "title": "Nakki Maru Vavajodu Aave - Kaushik Bharwad | Full Video Song | Latest Gujarati Superhit Song 2021",
        "description": "Nakki Maru Vavajodu Aave - Kaushik Bharwad | Full Video Song | Latest Gujarati Superhit Song 2021 ▻Subscribe Now For More Videos ...",
        "thumbnails": {
          "default": {
            "url": "https://i.ytimg.com/vi/soC3FJMqlxM/default.jpg",
            "width": 120,
            "height": 90
          },
          "medium": {
            "url": "https://i.ytimg.com/vi/soC3FJMqlxM/mqdefault.jpg",
            "width": 320,
            "height": 180
          },
          "high": {
            "url": "https://i.ytimg.com/vi/soC3FJMqlxM/hqdefault.jpg",
            "width": 480,
            "height": 360
          }
        },
        "channelTitle": "RDC Gujarati",
        "liveBroadcastContent": "none",
        "publishTime": "2021-01-25T02:30:03Z"
      }
    },
    {
      "kind": "youtube#searchResult",
      "etag": "4lWtS2PdpAGb4IzgiGnc7mub-nM",
      "id": {
        "kind": "youtube#video",
        "videoId": "TmKVfJKAIVk"
      },
      "snippet": {
        "publishedAt": "2021-01-22T01:30:04Z",
        "channelId": "UCLCchnxwukA1uRDYP3mPETg",
        "title": "Chhori Re Gujarat Ni | Twinkal Patel | Om Baraiya | New Gujarati Song 2021 | Rudra Originals",
        "description": "Rudra Originals in association with Twinkal Patel Official presents CHHORI RE GUJARAT NI featuring Om Baraiya & Twinkal Patel. Listen it on - ♫ iTunes: ...",
        "thumbnails": {
          "default": {
            "url": "https://i.ytimg.com/vi/TmKVfJKAIVk/default.jpg",
            "width": 120,
            "height": 90
          },
          "medium": {
            "url": "https://i.ytimg.com/vi/TmKVfJKAIVk/mqdefault.jpg",
            "width": 320,
            "height": 180
          },
          "high": {
            "url": "https://i.ytimg.com/vi/TmKVfJKAIVk/hqdefault.jpg",
            "width": 480,
            "height": 360
          }
        },
        "channelTitle": "Rudra Originals",
        "liveBroadcastContent": "none",
        "publishTime": "2021-01-22T01:30:04Z"
      }
    },
    {
      "kind": "youtube#searchResult",
      "etag": "a4mXutydp_nLc1DEzp5RuxSWC4E",
      "id": {
        "kind": "youtube#video",
        "videoId": "nqFy2xDKASk"
      },
      "snippet": {
        "publishedAt": "2021-04-03T03:30:15Z",
        "channelId": "UCElnQ94YCWlwW-Bi6Jy5hpA",
        "title": "Aryan Barot Song | જખ્મ | Jakhm | New Gujarati Sad Song | Hit Gujarati Bewafa Song",
        "description": "Watch Aryan Barot in latest Gujarati bewafa & Sad song \"Jakhm (જખ્મ)\", A song written by Vishnusinh vaghela and music is by Ranjit Nadiya, Exclusively on ...",
        "thumbnails": {
          "default": {
            "url": "https://i.ytimg.com/vi/nqFy2xDKASk/default.jpg",
            "width": 120,
            "height": 90
          },
          "medium": {
            "url": "https://i.ytimg.com/vi/nqFy2xDKASk/mqdefault.jpg",
            "width": 320,
            "height": 180
          },
          "high": {
            "url": "https://i.ytimg.com/vi/nqFy2xDKASk/hqdefault.jpg",
            "width": 480,
            "height": 360
          }
        },
        "channelTitle": "Bansidhar Studio - Official",
        "liveBroadcastContent": "none",
        "publishTime": "2021-04-03T03:30:15Z"
      }
    },
    {
      "kind": "youtube#searchResult",
      "etag": "fN2lFy6ATXVzt9Loqyy1kMsB_kU",
      "id": {
        "kind": "youtube#video",
        "videoId": "e_ukEJIrCQU"
      },
      "snippet": {
        "publishedAt": "2021-03-16T01:45:01Z",
        "channelId": "UCBUlrhmOjVLOpbgHAUJceaw",
        "title": "Juda Thai Ne Jivata Kem Na Sikhvadyu - Jignesh Barot - HD Video - Jigar Studio",
        "description": "Song Name: Juda Thai Ne Jivata Kem Na Sikhvadyu Singer & Artist: Jignesh Barot Artists: Neha Suthar, Nirav Brahmbhatt, Piyush Patel Music & Melody BGM: ...",
        "thumbnails": {
          "default": {
            "url": "https://i.ytimg.com/vi/e_ukEJIrCQU/default.jpg",
            "width": 120,
            "height": 90
          },
          "medium": {
            "url": "https://i.ytimg.com/vi/e_ukEJIrCQU/mqdefault.jpg",
            "width": 320,
            "height": 180
          },
          "high": {
            "url": "https://i.ytimg.com/vi/e_ukEJIrCQU/hqdefault.jpg",
            "width": 480,
            "height": 360
          }
        },
        "channelTitle": "Jigar Studio",
        "liveBroadcastContent": "none",
        "publishTime": "2021-03-16T01:45:01Z"
      }
    },
    {
      "kind": "youtube#searchResult",
      "etag": "gHPI99JJdOiZvkrE8XpJIsfcIV4",
      "id": {
        "kind": "youtube#video",
        "videoId": "Y7SI5u-h8AY"
      },
      "snippet": {
        "publishedAt": "2020-12-22T14:40:01Z",
        "channelId": "UC7b-kvFgpqIt5X4TZnTRLbw",
        "title": "Sachu Kahishu To Badnam Thasho · Vijay Suvada · New Latest Gujarati Song 2020",
        "description": "Dunia Ni Same Khota Dilasa Na Aapsho \"Sachu Kahishu To Badnam Thasho\" sung by Vijay Suvada. The song depicts a tale of an intense love story followed ...",
        "thumbnails": {
          "default": {
            "url": "https://i.ytimg.com/vi/Y7SI5u-h8AY/default.jpg",
            "width": 120,
            "height": 90
          },
          "medium": {
            "url": "https://i.ytimg.com/vi/Y7SI5u-h8AY/mqdefault.jpg",
            "width": 320,
            "height": 180
          },
          "high": {
            "url": "https://i.ytimg.com/vi/Y7SI5u-h8AY/hqdefault.jpg",
            "width": 480,
            "height": 360
          }
        },
        "channelTitle": "Karma Vision",
        "liveBroadcastContent": "none",
        "publishTime": "2020-12-22T14:40:01Z"
      }
    },
    {
      "kind": "youtube#searchResult",
      "etag": "uGP7TfRWpkwXSq2tJ-u566qKHLU",
      "id": {
        "kind": "youtube#video",
        "videoId": "35mYQ8bqp1A"
      },
      "snippet": {
        "publishedAt": "2017-04-17T05:54:52Z",
        "channelId": "UCZRIvleceNUxAQpVQdQwLAg",
        "title": "Rona Ser Ma (Full Video) | GEETA RABARI | LATEST GUJARATI SONGS 2017 | RAGHAV DIGITAL",
        "description": "For Ringtones → Vodafone Subscribers Dial 5379642313 → Airtel Subscribers Dial 5432116279708 → Reliance Subscribers SMS CT 9642313 to 51234 ...",
        "thumbnails": {
          "default": {
            "url": "https://i.ytimg.com/vi/35mYQ8bqp1A/default.jpg",
            "width": 120,
            "height": 90
          },
          "medium": {
            "url": "https://i.ytimg.com/vi/35mYQ8bqp1A/mqdefault.jpg",
            "width": 320,
            "height": 180
          },
          "high": {
            "url": "https://i.ytimg.com/vi/35mYQ8bqp1A/hqdefault.jpg",
            "width": 480,
            "height": 360
          }
        },
        "channelTitle": "Raghav Digital",
        "liveBroadcastContent": "none",
        "publishTime": "2017-04-17T05:54:52Z"
      }
    },
    {
      "kind": "youtube#searchResult",
      "etag": "3dkqD0QVxfPzGmf34r8t6OxK4YU",
      "id": {
        "kind": "youtube#video",
        "videoId": "wKrR-9WOxlw"
      },
      "snippet": {
        "publishedAt": "2019-01-13T16:02:06Z",
        "channelId": "UCZRIvleceNUxAQpVQdQwLAg",
        "title": "Baby Ne Bournvita Pivdavu | New GUJARATI SUPERHIT SONG 2019 | Raghav Digital | Umesh Barot",
        "description": "Raghav Digital Presents latest Gujarati Superhit Song \" Baby Ne Bournvita Pivadavu , Baby Mood Ma Nathi \" Singer : Umesh Barot Lyrics : Rajan Rayka, Dhaval ...",
        "thumbnails": {
          "default": {
            "url": "https://i.ytimg.com/vi/wKrR-9WOxlw/default.jpg",
            "width": 120,
            "height": 90
          },
          "medium": {
            "url": "https://i.ytimg.com/vi/wKrR-9WOxlw/mqdefault.jpg",
            "width": 320,
            "height": 180
          },
          "high": {
            "url": "https://i.ytimg.com/vi/wKrR-9WOxlw/hqdefault.jpg",
            "width": 480,
            "height": 360
          }
        },
        "channelTitle": "Raghav Digital",
        "liveBroadcastContent": "none",
        "publishTime": "2019-01-13T16:02:06Z"
      }
    },
    {
      "kind": "youtube#searchResult",
      "etag": "JzoFJaXsDLPi7C5DdY_-SKwaWKE",
      "id": {
        "kind": "youtube#video",
        "videoId": "XN5MYcku-wQ"
      },
      "snippet": {
        "publishedAt": "2020-10-07T04:30:03Z",
        "channelId": "UCfOF7Jw4GfLK9BvAlZ9Vvww",
        "title": "Kinjal Dave - Killol - કિલ્લોલ - Nonstop Trantali Garba 2020 - New Gujarati Song - KD Digital",
        "description": "KD Digital Present ... Killol - Nonstop Trantali Garba Songs :- 1 :- Chand 00:12 2 :- Aarasur Ma Amba Kare Killol 01:08 3 :- Poch Ito No Pavagadh 03:46 4 :- Sachi ...",
        "thumbnails": {
          "default": {
            "url": "https://i.ytimg.com/vi/XN5MYcku-wQ/default.jpg",
            "width": 120,
            "height": 90
          },
          "medium": {
            "url": "https://i.ytimg.com/vi/XN5MYcku-wQ/mqdefault.jpg",
            "width": 320,
            "height": 180
          },
          "high": {
            "url": "https://i.ytimg.com/vi/XN5MYcku-wQ/hqdefault.jpg",
            "width": 480,
            "height": 360
          }
        },
        "channelTitle": "KD Digital",
        "liveBroadcastContent": "none",
        "publishTime": "2020-10-07T04:30:03Z"
      }
    },
    {
      "kind": "youtube#searchResult",
      "etag": "i70OdaFJnfl2xTOHXd4rZmDOk3c",
      "id": {
        "kind": "youtube#video",
        "videoId": "MckjL2Y8GmY"
      },
      "snippet": {
        "publishedAt": "2018-07-12T02:47:20Z",
        "channelId": "UCuB7zkQVpcPKzHYJn45vM9w",
        "title": "RAJAL BAROT - Gujarati No Craze | FULL VIDEO | New Gujarati Song 2018 | RDC Gujarati",
        "description": "RAJAL BAROT - Gujarati No Craze | FULL VIDEO | New Gujarati Song 2018 | RDC Gujarati Song also available on :- JioMusic ...",
        "thumbnails": {
          "default": {
            "url": "https://i.ytimg.com/vi/MckjL2Y8GmY/default.jpg",
            "width": 120,
            "height": 90
          },
          "medium": {
            "url": "https://i.ytimg.com/vi/MckjL2Y8GmY/mqdefault.jpg",
            "width": 320,
            "height": 180
          },
          "high": {
            "url": "https://i.ytimg.com/vi/MckjL2Y8GmY/hqdefault.jpg",
            "width": 480,
            "height": 360
          }
        },
        "channelTitle": "RDC Gujarati",
        "liveBroadcastContent": "none",
        "publishTime": "2018-07-12T02:47:20Z"
      }
    },
    {
      "kind": "youtube#searchResult",
      "etag": "a0igIwBpdz8OsoVyvOThsmxj2l0",
      "id": {
        "kind": "youtube#video",
        "videoId": "U7kn53GBTRY"
      },
      "snippet": {
        "publishedAt": "2021-03-05T01:30:02Z",
        "channelId": "UCCrN-lIfKQhqpt-xCTR5z-g",
        "title": "Kana Mane Dwarika Dekhad | Kairavi Buch | Bhavin Bhanushali | New Gujarati Song 2021",
        "description": "મિત્રો, અમારી નજરે દ્વારકા તમને કેવું લાગ્યું? Comment માં અમને કહો  ❤️ . મિત્રો, અમારું સોંગ \"કાના મને દ્વારિકા ...",
        "thumbnails": {
          "default": {
            "url": "https://i.ytimg.com/vi/U7kn53GBTRY/default.jpg",
            "width": 120,
            "height": 90
          },
          "medium": {
            "url": "https://i.ytimg.com/vi/U7kn53GBTRY/mqdefault.jpg",
            "width": 320,
            "height": 180
          },
          "high": {
            "url": "https://i.ytimg.com/vi/U7kn53GBTRY/hqdefault.jpg",
            "width": 480,
            "height": 360
          }
        },
        "channelTitle": "Kairavi Buch",
        "liveBroadcastContent": "none",
        "publishTime": "2021-03-05T01:30:02Z"
      }
    },
    {
      "kind": "youtube#searchResult",
      "etag": "nuyVlOQWy1OrIy-9ud79C5m0wLk",
      "id": {
        "kind": "youtube#video",
        "videoId": "ldEpGXHmRdQ"
      },
      "snippet": {
        "publishedAt": "2020-10-03T08:27:24Z",
        "channelId": "UC4pwyWgPDJ5mKg1k_f7z7aQ",
        "title": "Latest Gujarati songs and garba mashup 2020",
        "description": "Garba #Gujarat best Gujarati song videos. Must watch.",
        "thumbnails": {
          "default": {
            "url": "https://i.ytimg.com/vi/ldEpGXHmRdQ/default.jpg",
            "width": 120,
            "height": 90
          },
          "medium": {
            "url": "https://i.ytimg.com/vi/ldEpGXHmRdQ/mqdefault.jpg",
            "width": 320,
            "height": 180
          },
          "high": {
            "url": "https://i.ytimg.com/vi/ldEpGXHmRdQ/hqdefault.jpg",
            "width": 480,
            "height": 360
          }
        },
        "channelTitle": "City’s Best Food Hunter",
        "liveBroadcastContent": "none",
        "publishTime": "2020-10-03T08:27:24Z"
      }
    },
    {
      "kind": "youtube#searchResult",
      "etag": "voW3MdR41shIwZEoRRShYHju75o",
      "id": {
        "kind": "youtube#video",
        "videoId": "PJoQlpGWRZc"
      },
      "snippet": {
        "publishedAt": "2021-01-10T14:00:04Z",
        "channelId": "UCfOF7Jw4GfLK9BvAlZ9Vvww",
        "title": "Kinjal Dave - Parne Maro Viro - Amdavadi Man - New Gujarati Song - KD Digital",
        "description": "Singer :- Kinjal Dave Producer :- Lalit Dave Music :- Mayur Nadiya Lyrics :- Manoj Prajapati, Rajveersinh Vaghela Starring :- Amdavadi Man, Shivani Aswar ...",
        "thumbnails": {
          "default": {
            "url": "https://i.ytimg.com/vi/PJoQlpGWRZc/default.jpg",
            "width": 120,
            "height": 90
          },
          "medium": {
            "url": "https://i.ytimg.com/vi/PJoQlpGWRZc/mqdefault.jpg",
            "width": 320,
            "height": 180
          },
          "high": {
            "url": "https://i.ytimg.com/vi/PJoQlpGWRZc/hqdefault.jpg",
            "width": 480,
            "height": 360
          }
        },
        "channelTitle": "KD Digital",
        "liveBroadcastContent": "none",
        "publishTime": "2021-01-10T14:00:04Z"
      }
    },
    {
      "kind": "youtube#searchResult",
      "etag": "cRXcnQM2ct5fBaCIrgxpunw7GUI",
      "id": {
        "kind": "youtube#video",
        "videoId": "mYNOStfgYjM"
      },
      "snippet": {
        "publishedAt": "2021-01-13T02:30:53Z",
        "channelId": "UCjEXVxz85__ljhVt477jtLw",
        "title": "Sapanu To Sapanu Rahi Gayu - Full HD Video | Rohit Thakor | Latest Gujarati Sad Song 2021",
        "description": "Rohit_Thakor_Official Song: Mari Janune Kok Biju Lai Gayu- Full HD Video Singer: Rohit Thakor Artist: Rohit Thakor, Shreya Dave, Nishith Nayak Lyrics: ...",
        "thumbnails": {
          "default": {
            "url": "https://i.ytimg.com/vi/mYNOStfgYjM/default.jpg",
            "width": 120,
            "height": 90
          },
          "medium": {
            "url": "https://i.ytimg.com/vi/mYNOStfgYjM/mqdefault.jpg",
            "width": 320,
            "height": 180
          },
          "high": {
            "url": "https://i.ytimg.com/vi/mYNOStfgYjM/hqdefault.jpg",
            "width": 480,
            "height": 360
          }
        },
        "channelTitle": "Rohit Thakor Official",
        "liveBroadcastContent": "none",
        "publishTime": "2021-01-13T02:30:53Z"
      }
    },
    {
      "kind": "youtube#searchResult",
      "etag": "6ifpWefUB0g6n14zENhy7xdG9p4",
      "id": {
        "kind": "youtube#video",
        "videoId": "1Ns9QDVZ8pQ"
      },
      "snippet": {
        "publishedAt": "2020-12-13T01:45:00Z",
        "channelId": "UCWRRnzfu8C2_KodPwLGXUIw",
        "title": "Umer 18 Ni ( FULL VIDEO ) || ઉંમર ૧૮ ની || RAKESH BAROT || latest GUJARATI song || NAVA GEET",
        "description": "SONG - Umer 18 Ni (ઉંમર ૧૮ ની ) Present - Vitthal Ajani Singer - Rakesh Barot Lyrics - Raghuveersinh Kaviraj Music - Sashi kapadiya Choreographer ...",
        "thumbnails": {
          "default": {
            "url": "https://i.ytimg.com/vi/1Ns9QDVZ8pQ/default.jpg",
            "width": 120,
            "height": 90
          },
          "medium": {
            "url": "https://i.ytimg.com/vi/1Ns9QDVZ8pQ/mqdefault.jpg",
            "width": 320,
            "height": 180
          },
          "high": {
            "url": "https://i.ytimg.com/vi/1Ns9QDVZ8pQ/hqdefault.jpg",
            "width": 480,
            "height": 360
          }
        },
        "channelTitle": "Wave Music Gujarati",
        "liveBroadcastContent": "none",
        "publishTime": "2020-12-13T01:45:00Z"
      }
    },
    {
      "kind": "youtube#searchResult",
      "etag": "nbsYgfQSQkW8Z4lbprdaDXVVi98",
      "id": {
        "kind": "youtube#video",
        "videoId": "UbO4BTSqi4o"
      },
      "snippet": {
        "publishedAt": "2018-07-08T01:34:06Z",
        "channelId": "UCpZVXyR7lix525VPi3Vc5mg",
        "title": "Gujarati No Craze | RAJAL BAROT | ગુજરાતી નો CRAZE | Produce &amp; Present By Studio Saraswati Junagadh",
        "description": "Producer : MANOJ N JOBANPUTRA. Singer & Acting : RAJAL BAROT. Lyrics & Compose : VIJAYSINH GOL. Music : DHAVAL KAPADIYA. Camera - Editor ...",
        "thumbnails": {
          "default": {
            "url": "https://i.ytimg.com/vi/UbO4BTSqi4o/default.jpg",
            "width": 120,
            "height": 90
          },
          "medium": {
            "url": "https://i.ytimg.com/vi/UbO4BTSqi4o/mqdefault.jpg",
            "width": 320,
            "height": 180
          },
          "high": {
            "url": "https://i.ytimg.com/vi/UbO4BTSqi4o/hqdefault.jpg",
            "width": 480,
            "height": 360
          }
        },
        "channelTitle": "Studio Saraswati Official",
        "liveBroadcastContent": "none",
        "publishTime": "2018-07-08T01:34:06Z"
      }
    },
    {
      "kind": "youtube#searchResult",
      "etag": "Et2imMRCW5ivgm01yBM3KsC5__U",
      "id": {
        "kind": "youtube#video",
        "videoId": "R_ExedQgcWY"
      },
      "snippet": {
        "publishedAt": "2021-01-14T04:30:48Z",
        "channelId": "UCvrD1eyGgo8O9JcTraCvYBg",
        "title": "Prem Kyare Karwana | પ્રેમ ક્યારે કરવાના | Rakesh Barot | Latest Gujarati Song 2021",
        "description": "After popular releases like \"Kona Re Bharose\", \"Mahelo Ki Raani\", \"Kum Kum Paglke\" and more, Rakesh Barot is here with his latest release Prem Kyare ...",
        "thumbnails": {
          "default": {
            "url": "https://i.ytimg.com/vi/R_ExedQgcWY/default.jpg",
            "width": 120,
            "height": 90
          },
          "medium": {
            "url": "https://i.ytimg.com/vi/R_ExedQgcWY/mqdefault.jpg",
            "width": 320,
            "height": 180
          },
          "high": {
            "url": "https://i.ytimg.com/vi/R_ExedQgcWY/hqdefault.jpg",
            "width": 480,
            "height": 360
          }
        },
        "channelTitle": "Saregama Gujarati",
        "liveBroadcastContent": "none",
        "publishTime": "2021-01-14T04:30:48Z"
      }
    },
    {
      "kind": "youtube#searchResult",
      "etag": "J1jv3yNjYYhtWSZqtbLsaEHG0EY",
      "id": {
        "kind": "youtube#video",
        "videoId": "0Iv9KROOjz8"
      },
      "snippet": {
        "publishedAt": "2020-10-08T01:30:01Z",
        "channelId": "UCgvKGKLkN9BJ1DvU2opQMnA",
        "title": "Gaman Santhal : Kankotri || કંકોતરી || Yuvraj Suvada || Priyanka Nadiadwala | New Gujarati Song 2020",
        "description": "Pop skope Music Present.... દરોજ અવનવા સોંગ જોવા માટે અત્યારે જ અમારી ચેનલ ને સબસ્ક્રાઈબ કરો.",
        "thumbnails": {
          "default": {
            "url": "https://i.ytimg.com/vi/0Iv9KROOjz8/default.jpg",
            "width": 120,
            "height": 90
          },
          "medium": {
            "url": "https://i.ytimg.com/vi/0Iv9KROOjz8/mqdefault.jpg",
            "width": 320,
            "height": 180
          },
          "high": {
            "url": "https://i.ytimg.com/vi/0Iv9KROOjz8/hqdefault.jpg",
            "width": 480,
            "height": 360
          }
        },
        "channelTitle": "POP SKOPE MUSIC",
        "liveBroadcastContent": "none",
        "publishTime": "2020-10-08T01:30:01Z"
      }
    },
    {
      "kind": "youtube#searchResult",
      "etag": "Tp7-84wANk99wjahoANffVg5RcI",
      "id": {
        "kind": "youtube#video",
        "videoId": "KZhLAdci308"
      },
      "snippet": {
        "publishedAt": "2021-04-15T01:30:03Z",
        "channelId": "UCvrD1eyGgo8O9JcTraCvYBg",
        "title": "Din Gojaro | દિન ગોઝારો | Rakesh Barot | Full Audio | Latest Gujarati Bewafa Song 2021",
        "description": "Rakesh Barot is back with his redefining voice in his latest song \"Din Gojaro\"!! Full video will be out on 18th, April. Song Credits: Singer - Rakesh Barot Artist ...",
        "thumbnails": {
          "default": {
            "url": "https://i.ytimg.com/vi/KZhLAdci308/default.jpg",
            "width": 120,
            "height": 90
          },
          "medium": {
            "url": "https://i.ytimg.com/vi/KZhLAdci308/mqdefault.jpg",
            "width": 320,
            "height": 180
          },
          "high": {
            "url": "https://i.ytimg.com/vi/KZhLAdci308/hqdefault.jpg",
            "width": 480,
            "height": 360
          }
        },
        "channelTitle": "Saregama Gujarati",
        "liveBroadcastContent": "none",
        "publishTime": "2021-04-15T01:30:03Z"
      }
    },
    {
      "kind": "youtube#searchResult",
      "etag": "JuxuoeDZpXvTwDQqy12guAOp_yU",
      "id": {
        "kind": "youtube#video",
        "videoId": "WkIueE6oQ-0"
      },
      "snippet": {
        "publishedAt": "2021-02-02T02:30:01Z",
        "channelId": "UCuB7zkQVpcPKzHYJn45vM9w",
        "title": "Rohit Thakor - Mari Janune Kok Biju Lai Gayu | New Gujarati Sad Song | Full HD Video | @RDC Gujarati",
        "description": "Rohit Thakor - Mari Janune Kok Biju Lai Gayu | New Gujarati Sad Song | Full HD Video | @RDC Gujarati ​ ▻Subscribe Now For More Videos ...",
        "thumbnails": {
          "default": {
            "url": "https://i.ytimg.com/vi/WkIueE6oQ-0/default.jpg",
            "width": 120,
            "height": 90
          },
          "medium": {
            "url": "https://i.ytimg.com/vi/WkIueE6oQ-0/mqdefault.jpg",
            "width": 320,
            "height": 180
          },
          "high": {
            "url": "https://i.ytimg.com/vi/WkIueE6oQ-0/hqdefault.jpg",
            "width": 480,
            "height": 360
          }
        },
        "channelTitle": "RDC Gujarati",
        "liveBroadcastContent": "none",
        "publishTime": "2021-02-02T02:30:01Z"
      }
    },
    {
      "kind": "youtube#searchResult",
      "etag": "1uvQghyUpdIVctC6XASlPU9IiZY",
      "id": {
        "kind": "youtube#video",
        "videoId": "YkIWEmg1m68"
      },
      "snippet": {
        "publishedAt": "2019-05-28T17:02:44Z",
        "channelId": "UCmAkJ5mzukCzD1uzMpoaJOg",
        "title": "Gujarati Love Mashup 2019 | Audio Wing Project ft | Santvani | Shweta | Bhargav | Aakash",
        "description": "Audio Wing Project Presents hit Gujarati songs Love Mashup. Hit Like Share and Subscribe Karaoke track : https://www.youtube.com/watch?v=7QJYQ4vpwCs ...",
        "thumbnails": {
          "default": {
            "url": "https://i.ytimg.com/vi/YkIWEmg1m68/default.jpg",
            "width": 120,
            "height": 90
          },
          "medium": {
            "url": "https://i.ytimg.com/vi/YkIWEmg1m68/mqdefault.jpg",
            "width": 320,
            "height": 180
          },
          "high": {
            "url": "https://i.ytimg.com/vi/YkIWEmg1m68/hqdefault.jpg",
            "width": 480,
            "height": 360
          }
        },
        "channelTitle": "Audio Wing Music",
        "liveBroadcastContent": "none",
        "publishTime": "2019-05-28T17:02:44Z"
      }
    },
    {
      "kind": "youtube#searchResult",
      "etag": "-juEONJoTXDKL3Gr54FSWoudkyk",
      "id": {
        "kind": "youtube#playlist",
        "playlistId": "PLxDvyCZDEb1OZEchuNWH9Q4odT6ld2XzK"
      },
      "snippet": {
        "publishedAt": "2018-01-10T04:38:01Z",
        "channelId": "UCq-llAg-CnS8o_3X4PwH9jA",
        "title": "urban gujarati songs",
        "description": "",
        "thumbnails": {
          "default": {
            "url": "https://i.ytimg.com/vi/TxidFkYHDfI/default.jpg",
            "width": 120,
            "height": 90
          },
          "medium": {
            "url": "https://i.ytimg.com/vi/TxidFkYHDfI/mqdefault.jpg",
            "width": 320,
            "height": 180
          },
          "high": {
            "url": "https://i.ytimg.com/vi/TxidFkYHDfI/hqdefault.jpg",
            "width": 480,
            "height": 360
          }
        },
        "channelTitle": "amit kunapara",
        "liveBroadcastContent": "none",
        "publishTime": "2018-01-10T04:38:01Z"
      }
    },
    {
      "kind": "youtube#searchResult",
      "etag": "tNSZeVySOYgmnviw0tD_oYH1PJI",
      "id": {
        "kind": "youtube#video",
        "videoId": "Jv8KRwF1zQs"
      },
      "snippet": {
        "publishedAt": "2020-04-01T04:29:11Z",
        "channelId": "UCV-l3a6kn4443HWJxPv4pVQ",
        "title": "Moti Veraana | New Navratri Song 2020 | Songs of Faith | Amit Trivedi feat. Osman Mir | AT Azaad",
        "description": "This Navratri, experience the Garba vibes with 'Moti Veraana', the first song from the album Songs of Faith! This is an original Gujarati composition about ...",
        "thumbnails": {
          "default": {
            "url": "https://i.ytimg.com/vi/Jv8KRwF1zQs/default.jpg",
            "width": 120,
            "height": 90
          },
          "medium": {
            "url": "https://i.ytimg.com/vi/Jv8KRwF1zQs/mqdefault.jpg",
            "width": 320,
            "height": 180
          },
          "high": {
            "url": "https://i.ytimg.com/vi/Jv8KRwF1zQs/hqdefault.jpg",
            "width": 480,
            "height": 360
          }
        },
        "channelTitle": "AT Azaad",
        "liveBroadcastContent": "none",
        "publishTime": "2020-04-01T04:29:11Z"
      }
    },
    {
      "kind": "youtube#searchResult",
      "etag": "23J8AuS5F87lisUkqewzpAe3i6k",
      "id": {
        "kind": "youtube#video",
        "videoId": "7xQ11Rh6lA0"
      },
      "snippet": {
        "publishedAt": "2020-02-21T03:11:04Z",
        "channelId": "UCDBuix1wrQWcAK1qTIGIECw",
        "title": "GHOOMARIYU | Twinkal Patel | Om Baraiya | SadiSong | WEDDING SPECIAL | New Gujarati Song | JENS",
        "description": "ઘુંમ્મરીયુ રે ઘુંમ્મરીયુ...વરની માને બોલાવો રે..ઘુંમ્મરીયુ રે ઘુંમ્મરીયુ.. અમારૂ એક બિલાડી જાડી નામના સોન્ગ ની ...",
        "thumbnails": {
          "default": {
            "url": "https://i.ytimg.com/vi/7xQ11Rh6lA0/default.jpg",
            "width": 120,
            "height": 90
          },
          "medium": {
            "url": "https://i.ytimg.com/vi/7xQ11Rh6lA0/mqdefault.jpg",
            "width": 320,
            "height": 180
          },
          "high": {
            "url": "https://i.ytimg.com/vi/7xQ11Rh6lA0/hqdefault.jpg",
            "width": 480,
            "height": 360
          }
        },
        "channelTitle": "Twinkal Patel Official",
        "liveBroadcastContent": "none",
        "publishTime": "2020-02-21T03:11:04Z"
      }
    },
    {
      "kind": "youtube#searchResult",
      "etag": "n1SX1hgSotEmnA4xdRU948VfgXM",
      "id": {
        "kind": "youtube#video",
        "videoId": "Ip-3jeM6lnE"
      },
      "snippet": {
        "publishedAt": "2020-07-18T01:30:13Z",
        "channelId": "UC15sUwufvfo5Z62KBZVzHRQ",
        "title": "Tara Naina No Mane Rang Lagyo | Twinkal Patel |Om Baraiya |Jen&#39;s |New Gujarati Song 2020 | Ram Audio",
        "description": "Set as Caller Tune: IDEA ડાઇલર ટ્યુન માટે ડાયરેક્ટ ડાયલ કરો ----- Tara Nenano Mane Rang Lagyo - 53712056411 Me To Joban Ni Aankhyu Ma ...",
        "thumbnails": {
          "default": {
            "url": "https://i.ytimg.com/vi/Ip-3jeM6lnE/default.jpg",
            "width": 120,
            "height": 90
          },
          "medium": {
            "url": "https://i.ytimg.com/vi/Ip-3jeM6lnE/mqdefault.jpg",
            "width": 320,
            "height": 180
          },
          "high": {
            "url": "https://i.ytimg.com/vi/Ip-3jeM6lnE/hqdefault.jpg",
            "width": 480,
            "height": 360
          }
        },
        "channelTitle": "Ram Audio",
        "liveBroadcastContent": "none",
        "publishTime": "2020-07-18T01:30:13Z"
      }
    },
    {
      "kind": "youtube#searchResult",
      "etag": "xYFw9HBpgTeJLsoh25Cr5S58Dnk",
      "id": {
        "kind": "youtube#video",
        "videoId": "yei71FyyRjQ"
      },
      "snippet": {
        "publishedAt": "2021-02-02T01:30:12Z",
        "channelId": "UC1sSs3PUmjf7vvq_dAfHkBg",
        "title": "Jignesh Barot | Mena Rani Manma Vashi | મેના રાણી મનમાં વસી | HD Video | New Gujarati Song 2021",
        "description": "Jignesh Barot & Tejpalsinh Chavda Sathal Present ... \" Jignesh Barot . Mena Rani Manma Vashi . મેના રાણી મનમાં વસી \" Jignesh Barot | Mena Rani ...",
        "thumbnails": {
          "default": {
            "url": "https://i.ytimg.com/vi/yei71FyyRjQ/default.jpg",
            "width": 120,
            "height": 90
          },
          "medium": {
            "url": "https://i.ytimg.com/vi/yei71FyyRjQ/mqdefault.jpg",
            "width": 320,
            "height": 180
          },
          "high": {
            "url": "https://i.ytimg.com/vi/yei71FyyRjQ/hqdefault.jpg",
            "width": 480,
            "height": 360
          }
        },
        "channelTitle": "JIGNESH BAROT",
        "liveBroadcastContent": "none",
        "publishTime": "2021-02-02T01:30:12Z"
      }
    },
    {
      "kind": "youtube#searchResult",
      "etag": "DYMrM-BjhV1KRg6scLxn2Y9q_28",
      "id": {
        "kind": "youtube#video",
        "videoId": "ZY7n5lYJ_I0"
      },
      "snippet": {
        "publishedAt": "2021-04-08T05:30:12Z",
        "channelId": "UCvrD1eyGgo8O9JcTraCvYBg",
        "title": "Premika Parni Ji | પ્રેમિકા પરણી જી | Rakesh Barot | Full Video | Latest Gujarati Song 2021",
        "description": "Superstar Rakesh Barot is back to entertain you with his new comedy romantic song \"Premika Parni Ji\" Song Credits: Singer - Rakesh Barot Artist - Rakesh Barot ...",
        "thumbnails": {
          "default": {
            "url": "https://i.ytimg.com/vi/ZY7n5lYJ_I0/default.jpg",
            "width": 120,
            "height": 90
          },
          "medium": {
            "url": "https://i.ytimg.com/vi/ZY7n5lYJ_I0/mqdefault.jpg",
            "width": 320,
            "height": 180
          },
          "high": {
            "url": "https://i.ytimg.com/vi/ZY7n5lYJ_I0/hqdefault.jpg",
            "width": 480,
            "height": 360
          }
        },
        "channelTitle": "Saregama Gujarati",
        "liveBroadcastContent": "none",
        "publishTime": "2021-04-08T05:30:12Z"
      }
    },
    {
      "kind": "youtube#searchResult",
      "etag": "-3c12KmVi6cJUU8tdkpHBt7jodM",
      "id": {
        "kind": "youtube#video",
        "videoId": "tHJ-D98nNi8"
      },
      "snippet": {
        "publishedAt": "2020-05-26T01:30:04Z",
        "channelId": "UC15sUwufvfo5Z62KBZVzHRQ",
        "title": "Tamne Khabro Chhe Ke Nahi ||Rakesh Barot ||New Gujarati Song 2020 ||Ram Audio",
        "description": "Song:Tamne Khabro Chhe Ke Nahi Title:Tamne Khabro Chhe Ke Nahi Singer:Rakesh Barot Artist:Rakesh Barot,Sweta Sen Music:Ajay Vagheshwari ...",
        "thumbnails": {
          "default": {
            "url": "https://i.ytimg.com/vi/tHJ-D98nNi8/default.jpg",
            "width": 120,
            "height": 90
          },
          "medium": {
            "url": "https://i.ytimg.com/vi/tHJ-D98nNi8/mqdefault.jpg",
            "width": 320,
            "height": 180
          },
          "high": {
            "url": "https://i.ytimg.com/vi/tHJ-D98nNi8/hqdefault.jpg",
            "width": 480,
            "height": 360
          }
        },
        "channelTitle": "Ram Audio",
        "liveBroadcastContent": "none",
        "publishTime": "2020-05-26T01:30:04Z"
      }
    },
    {
      "kind": "youtube#searchResult",
      "etag": "pR1oPY6WmC3WPcT3SmZyNHrehps",
      "id": {
        "kind": "youtube#video",
        "videoId": "Y_mY3QrdWYA"
      },
      "snippet": {
        "publishedAt": "2017-07-29T06:23:32Z",
        "channelId": "UCuB7zkQVpcPKzHYJn45vM9w",
        "title": "LERI LALA | KINJAL DAVE | FULL VIDEO | Latest Gujarati DJ Song 2017 | RDC Gujarati",
        "description": "♢Song: Ame Gujarati Leri Lala ♢Singer : Kinjal Dave ♢Lyrics : Manu Rabari ♢Music : Mayur Nadiya ♢Director : Raju Patel (Jay Vision Ahd.) ♢Producer : Manoj N.",
        "thumbnails": {
          "default": {
            "url": "https://i.ytimg.com/vi/Y_mY3QrdWYA/default.jpg",
            "width": 120,
            "height": 90
          },
          "medium": {
            "url": "https://i.ytimg.com/vi/Y_mY3QrdWYA/mqdefault.jpg",
            "width": 320,
            "height": 180
          },
          "high": {
            "url": "https://i.ytimg.com/vi/Y_mY3QrdWYA/hqdefault.jpg",
            "width": 480,
            "height": 360
          }
        },
        "channelTitle": "RDC Gujarati",
        "liveBroadcastContent": "none",
        "publishTime": "2017-07-29T06:23:32Z"
      }
    },
    {
      "kind": "youtube#searchResult",
      "etag": "Lu3RpfwuY6pDYYshjQs5UD3BN5g",
      "id": {
        "kind": "youtube#video",
        "videoId": "8o0yLb3AXqM"
      },
      "snippet": {
        "publishedAt": "2020-12-10T12:40:05Z",
        "channelId": "UCwk8waXYDxXOFHP9VTMkf8w",
        "title": "Best Gujarati Folk Songs | Folk 2.0 | Gujarati Album | MILAN",
        "description": "Playlist: 00:05 Mor Bani Thangat Kare 04:03 Dhuni Re Dhakhavi 07:40 Ranglo 11:56 Saybo Re Govadiyo 15:37 Piya Ghar Aavenge 21:50 Ae ri Sakhi Mangal ...",
        "thumbnails": {
          "default": {
            "url": "https://i.ytimg.com/vi/8o0yLb3AXqM/default.jpg",
            "width": 120,
            "height": 90
          },
          "medium": {
            "url": "https://i.ytimg.com/vi/8o0yLb3AXqM/mqdefault.jpg",
            "width": 320,
            "height": 180
          },
          "high": {
            "url": "https://i.ytimg.com/vi/8o0yLb3AXqM/hqdefault.jpg",
            "width": 480,
            "height": 360
          }
        },
        "channelTitle": "MILAN SAPARIYA",
        "liveBroadcastContent": "none",
        "publishTime": "2020-12-10T12:40:05Z"
      }
    },
    {
      "kind": "youtube#searchResult",
      "etag": "KVRQNEnjyDE3qCgLCeeUtdhejxc",
      "id": {
        "kind": "youtube#video",
        "videoId": "GwRpbxBj3ts"
      },
      "snippet": {
        "publishedAt": "2021-04-04T02:30:44Z",
        "channelId": "UC9LtDjkMtiya-Jzhm5lxcSg",
        "title": "Dhaval Barot - Prem Karnara Juda Padi  Gaya | New Gujarati Song 2021 | Hd Video | @Rn Music",
        "description": "Rn Music Present.... Dhaval Barot - Prem Karnara Juda Padi Gaya | New Gujarati Song 2021 | Hd Video | @Rn Music Song :- Prem Karnara Juda Padi Gaya ...",
        "thumbnails": {
          "default": {
            "url": "https://i.ytimg.com/vi/GwRpbxBj3ts/default.jpg",
            "width": 120,
            "height": 90
          },
          "medium": {
            "url": "https://i.ytimg.com/vi/GwRpbxBj3ts/mqdefault.jpg",
            "width": 320,
            "height": 180
          },
          "high": {
            "url": "https://i.ytimg.com/vi/GwRpbxBj3ts/hqdefault.jpg",
            "width": 480,
            "height": 360
          }
        },
        "channelTitle": "Rn Music",
        "liveBroadcastContent": "none",
        "publishTime": "2021-04-04T02:30:44Z"
      }
    },
    {
      "kind": "youtube#searchResult",
      "etag": "XHxm7THM8RiiWY6le-_BPgmsoc4",
      "id": {
        "kind": "youtube#video",
        "videoId": "2R_MEScVE9c"
      },
      "snippet": {
        "publishedAt": "2020-10-31T01:30:01Z",
        "channelId": "UCxEjIcW9n0JsTSCGQDufi9A",
        "title": "Geeta Rabari : O Mara Kana (ઓ મારા કાના) || New Gujarati Song 2020 || @Geeta Ben Rabari Official",
        "description": "Geeta Rabari Official Present New Gujarati Song \"O Mara Kana\" Sung By Geeta Rabari. Song Credits :- Titel : O Mara Kana Singer : Geeta Rabari Lyrics : Rajan ...",
        "thumbnails": {
          "default": {
            "url": "https://i.ytimg.com/vi/2R_MEScVE9c/default.jpg",
            "width": 120,
            "height": 90
          },
          "medium": {
            "url": "https://i.ytimg.com/vi/2R_MEScVE9c/mqdefault.jpg",
            "width": 320,
            "height": 180
          },
          "high": {
            "url": "https://i.ytimg.com/vi/2R_MEScVE9c/hqdefault.jpg",
            "width": 480,
            "height": 360
          }
        },
        "channelTitle": "Geeta Ben Rabari Official",
        "liveBroadcastContent": "none",
        "publishTime": "2020-10-31T01:30:01Z"
      }
    },
    {
      "kind": "youtube#searchResult",
      "etag": "BIFUjp1ObkkmThvcOWK0cU6FBlI",
      "id": {
        "kind": "youtube#video",
        "videoId": "7-mzve2Y_Jk"
      },
      "snippet": {
        "publishedAt": "2019-07-08T01:40:16Z",
        "channelId": "UCBUlrhmOjVLOpbgHAUJceaw",
        "title": "Bewafa Kehta Pehla So Var Vicharaje - Jignesh Kaviraj - Latest Gujarati Sad Song 2019",
        "description": "Song Name: Bewafa Kehta Pehla So Var Vicharaje Singer & Artist: Jignesh Kaviraj Lyrics & Composer: Rajan Rayka, Dhaval Motan Music & Background: Jitu ...",
        "thumbnails": {
          "default": {
            "url": "https://i.ytimg.com/vi/7-mzve2Y_Jk/default.jpg",
            "width": 120,
            "height": 90
          },
          "medium": {
            "url": "https://i.ytimg.com/vi/7-mzve2Y_Jk/mqdefault.jpg",
            "width": 320,
            "height": 180
          },
          "high": {
            "url": "https://i.ytimg.com/vi/7-mzve2Y_Jk/hqdefault.jpg",
            "width": 480,
            "height": 360
          }
        },
        "channelTitle": "Jigar Studio",
        "liveBroadcastContent": "none",
        "publishTime": "2019-07-08T01:40:16Z"
      }
    },
    {
      "kind": "youtube#searchResult",
      "etag": "3H-SjJwPgmxg1YhR08Zq0xCd4TM",
      "id": {
        "kind": "youtube#video",
        "videoId": "yvOxNHpl3TI"
      },
      "snippet": {
        "publishedAt": "2020-06-28T02:00:07Z",
        "channelId": "UCuB7zkQVpcPKzHYJn45vM9w",
        "title": "Rakesh Barot - Tamne Khabro Chhe Ke Nahi | Video Song | Latest Gujarati Song 2020 | @RDC Gujarati",
        "description": "Rakesh Barot - Tamne Khabro Chhe Ke Nahi | Video Song | Latest Gujarati Song 2020 | @RDC Gujarati ▻Subscribe Now For More Videos ...",
        "thumbnails": {
          "default": {
            "url": "https://i.ytimg.com/vi/yvOxNHpl3TI/default.jpg",
            "width": 120,
            "height": 90
          },
          "medium": {
            "url": "https://i.ytimg.com/vi/yvOxNHpl3TI/mqdefault.jpg",
            "width": 320,
            "height": 180
          },
          "high": {
            "url": "https://i.ytimg.com/vi/yvOxNHpl3TI/hqdefault.jpg",
            "width": 480,
            "height": 360
          }
        },
        "channelTitle": "RDC Gujarati",
        "liveBroadcastContent": "none",
        "publishTime": "2020-06-28T02:00:07Z"
      }
    },
    {
      "kind": "youtube#searchResult",
      "etag": "m8She0wSSwbBRIqOaAoMrpLtXdM",
      "id": {
        "kind": "youtube#video",
        "videoId": "09ltoZ7axDo"
      },
      "snippet": {
        "publishedAt": "2020-12-31T10:30:00Z",
        "channelId": "UCuB7zkQVpcPKzHYJn45vM9w",
        "title": "KUDRAT (female version) - Kajal Maheriya | Jignesh Barot | Neha Suthar | New Gujarati Song",
        "description": "KUDRAT (female version) - Kajal Maheriya | Jignesh Barot | Neha Suthar | New Gujarati Song ▻Subscribe Now For More Videos ...",
        "thumbnails": {
          "default": {
            "url": "https://i.ytimg.com/vi/09ltoZ7axDo/default.jpg",
            "width": 120,
            "height": 90
          },
          "medium": {
            "url": "https://i.ytimg.com/vi/09ltoZ7axDo/mqdefault.jpg",
            "width": 320,
            "height": 180
          },
          "high": {
            "url": "https://i.ytimg.com/vi/09ltoZ7axDo/hqdefault.jpg",
            "width": 480,
            "height": 360
          }
        },
        "channelTitle": "RDC Gujarati",
        "liveBroadcastContent": "none",
        "publishTime": "2020-12-31T10:30:00Z"
      }
    },
    {
      "kind": "youtube#searchResult",
      "etag": "hPEcDxMLhJ9R-Fv6YcYyE3Vh0_0",
      "id": {
        "kind": "youtube#video",
        "videoId": "fo-KESTqP1w"
      },
      "snippet": {
        "publishedAt": "2020-12-20T01:30:06Z",
        "channelId": "UCyt_AgWdwEH1zolMOVwQzRA",
        "title": "Nakki Maru Vavajodu Aave | Kaushik Bharwad | Latest New Gujarati Dosti Special Song 2020",
        "description": "NEW_SHYAM_AUDIO OFFICIAL Presents... Best Friendship Special DJ Gujarati Songs 2020 Nakki Maru Vavajodu Aave | Kaushik Bharwad | Latest New ...",
        "thumbnails": {
          "default": {
            "url": "https://i.ytimg.com/vi/fo-KESTqP1w/default.jpg",
            "width": 120,
            "height": 90
          },
          "medium": {
            "url": "https://i.ytimg.com/vi/fo-KESTqP1w/mqdefault.jpg",
            "width": 320,
            "height": 180
          },
          "high": {
            "url": "https://i.ytimg.com/vi/fo-KESTqP1w/hqdefault.jpg",
            "width": 480,
            "height": 360
          }
        },
        "channelTitle": "NEW SHYAM AUDIO OFFICIAL",
        "liveBroadcastContent": "none",
        "publishTime": "2020-12-20T01:30:06Z"
      }
    },
    {
      "kind": "youtube#searchResult",
      "etag": "cHfRAPvfMTo7v4zdXmi1q8jF8jc",
      "id": {
        "kind": "youtube#video",
        "videoId": "S-74PNMEtFk"
      },
      "snippet": {
        "publishedAt": "2021-01-14T03:20:31Z",
        "channelId": "UC5lpUDz5Xf_CWs2ToFZwgyg",
        "title": "Vijay Suvada : Parne Mari Janu ( પરણે મારી જાનું) New Gujarati Song 2021 || HD Video || Misu Digital",
        "description": "MISU Digital (YOGEN PATEL) Present...... Vijay Suvada | Parne Mari Janu | પરણે મારી જાનું | HD VIDEO | New Gujarati Song 2021 | Misu Digital Misu ...",
        "thumbnails": {
          "default": {
            "url": "https://i.ytimg.com/vi/S-74PNMEtFk/default.jpg",
            "width": 120,
            "height": 90
          },
          "medium": {
            "url": "https://i.ytimg.com/vi/S-74PNMEtFk/mqdefault.jpg",
            "width": 320,
            "height": 180
          },
          "high": {
            "url": "https://i.ytimg.com/vi/S-74PNMEtFk/hqdefault.jpg",
            "width": 480,
            "height": 360
          }
        },
        "channelTitle": "MISU Digital",
        "liveBroadcastContent": "none",
        "publishTime": "2021-01-14T03:20:31Z"
      }
    },
    {
      "kind": "youtube#searchResult",
      "etag": "z4TXW5EYHQjlTCEr-I5ofUEo3Cw",
      "id": {
        "kind": "youtube#video",
        "videoId": "QvVyQ0vbNhs"
      },
      "snippet": {
        "publishedAt": "2021-03-19T03:30:31Z",
        "channelId": "UC7b-kvFgpqIt5X4TZnTRLbw",
        "title": "Mari Jaan · Shital Thakor · Love Song · New Gujarati Song 2021 · Karma Vision",
        "description": "Presenting new Gujarati video song \"MARI JAAN\" in the voice of Shital Thakor, penned by Kamlesh Thakor \"Sultan\" and Vijay Thakor, Music arrangement by Sur ...",
        "thumbnails": {
          "default": {
            "url": "https://i.ytimg.com/vi/QvVyQ0vbNhs/default.jpg",
            "width": 120,
            "height": 90
          },
          "medium": {
            "url": "https://i.ytimg.com/vi/QvVyQ0vbNhs/mqdefault.jpg",
            "width": 320,
            "height": 180
          },
          "high": {
            "url": "https://i.ytimg.com/vi/QvVyQ0vbNhs/hqdefault.jpg",
            "width": 480,
            "height": 360
          }
        },
        "channelTitle": "Karma Vision",
        "liveBroadcastContent": "none",
        "publishTime": "2021-03-19T03:30:31Z"
      }
    },
    {
      "kind": "youtube#searchResult",
      "etag": "pq7pQBzxoOfQbw0hY1gwev51Na4",
      "id": {
        "kind": "youtube#video",
        "videoId": "kAsl6jzj4uI"
      },
      "snippet": {
        "publishedAt": "2018-12-29T01:15:00Z",
        "channelId": "UCpZVXyR7lix525VPi3Vc5mg",
        "title": "GEETA RABARI | Koni Pade Entry | ગીતા રબારી | કોની પડે એન્ટ્રી | Latest Gujarati Song 2019",
        "description": "Produce & Present By STUDIO SARASWATI - Junagadh. Producer MANOJ N JOBANPUTRA. Singer & Acting : GEETA RABARI. Lyrics & Compose : VIJAYSINH ...",
        "thumbnails": {
          "default": {
            "url": "https://i.ytimg.com/vi/kAsl6jzj4uI/default.jpg",
            "width": 120,
            "height": 90
          },
          "medium": {
            "url": "https://i.ytimg.com/vi/kAsl6jzj4uI/mqdefault.jpg",
            "width": 320,
            "height": 180
          },
          "high": {
            "url": "https://i.ytimg.com/vi/kAsl6jzj4uI/hqdefault.jpg",
            "width": 480,
            "height": 360
          }
        },
        "channelTitle": "Studio Saraswati Official",
        "liveBroadcastContent": "none",
        "publishTime": "2018-12-29T01:15:00Z"
      }
    },
    {
      "kind": "youtube#searchResult",
      "etag": "frChZHCfI4mXRgDWMh0qqjfyNdw",
      "id": {
        "kind": "youtube#video",
        "videoId": "FMda_k6WNqc"
      },
      "snippet": {
        "publishedAt": "2021-03-08T05:30:01Z",
        "channelId": "UC6wE1QldDPmYWwGyuudy3Tg",
        "title": "યાદો તમારી Yaado Tamari | Umesh Barot | Amit Barot | Rajvinder Singh | New Gujarati Song 2021",
        "description": "Presenting a brand new Gujarati heart touching sad song \"Yaado Tamari\" sung by Umesh Barot. To Stream & Download Full Song: Gaana ...",
        "thumbnails": {
          "default": {
            "url": "https://i.ytimg.com/vi/FMda_k6WNqc/default.jpg",
            "width": 120,
            "height": 90
          },
          "medium": {
            "url": "https://i.ytimg.com/vi/FMda_k6WNqc/mqdefault.jpg",
            "width": 320,
            "height": 180
          },
          "high": {
            "url": "https://i.ytimg.com/vi/FMda_k6WNqc/hqdefault.jpg",
            "width": 480,
            "height": 360
          }
        },
        "channelTitle": "Zee Music Gujarati",
        "liveBroadcastContent": "none",
        "publishTime": "2021-03-08T05:30:01Z"
      }
    }
  ]
}