<svg width="100" height="100" viewBox="0 0 100 100" fill="none" xmlns="http://www.w3.org/2000/svg">
<path d="M45.4903 17.7342L45.4893 17.7352C44.4593 18.7652 43.3025 20.1366 42.8874 20.797L42.8868 20.7979L42.1056 22.0284L42.0257 22.1542L41.8771 22.1438L39.9252 22.0071C39.925 22.0071 39.9247 22.0071 39.9245 22.0071C33.0993 21.5639 26.7223 24.7447 23.1008 30.3696L23.0995 30.3715C22.6554 31.0474 22.1159 32.0118 21.8886 32.5233L21.8884 32.5237L21.4782 33.4417L21.4185 33.5754L21.2726 33.5887L19.7687 33.7254L19.7672 33.7255C17.2656 33.9372 14.8798 34.6874 12.6659 35.977C11.8744 36.4484 10.78 37.4007 9.75257 38.4645C8.72565 39.5279 7.79053 40.6769 7.30768 41.5288C4.24792 46.9944 4.47944 53.3779 7.92296 58.5528L7.9231 58.553C11.0717 63.295 16.1013 65.705 22.5714 65.5312L22.5719 65.5312C23.7566 65.5016 24.3273 65.4817 24.6797 65.4071C24.8452 65.3721 24.9517 65.3267 25.0472 65.2656C25.1492 65.2004 25.2464 65.1128 25.3951 64.974C26.7713 63.6685 26.3703 61.631 24.6591 60.996L24.6583 60.9957C24.6082 60.9769 24.4957 60.9517 24.3155 60.9261C24.1418 60.9014 23.9228 60.8788 23.6722 60.8595C23.1713 60.8209 22.5527 60.7967 21.9336 60.7967C20.5002 60.7967 19.2062 60.6794 18.4145 60.4764L18.4141 60.4763C13.4614 59.1982 9.90624 54.6466 9.90624 49.5702C9.90624 44.9718 12.8435 40.7798 17.2138 39.1029C18.386 38.6382 19.0654 38.5394 21.3755 38.4415C22.2482 38.4023 22.8915 38.3721 23.3875 38.3113C23.8837 38.2505 24.2047 38.1617 24.4439 38.0215C24.6765 37.8851 24.8539 37.6869 25.0355 37.361C25.221 37.0284 25.4001 36.5834 25.646 35.9637C26.5568 33.5882 27.5535 32.0718 29.301 30.4236C30.8316 28.9726 32.5428 27.9579 34.4905 27.302L34.492 27.3015C35.4109 26.9986 36.7153 26.8112 37.9938 26.7521C39.2709 26.693 40.5543 26.7604 41.4291 26.9842L41.4297 26.9844C42.5921 27.2847 43.4038 27.3484 43.9981 27.1899C44.5702 27.0374 44.9745 26.6689 45.3031 26.0026L45.304 26.0008C48.4681 19.7122 54.2728 15.9614 60.936 15.9217H60.9375C63.5468 15.9217 65.3965 16.2792 67.6949 17.25L67.6951 17.2501C72.8498 19.431 76.7323 24.1862 77.8815 29.7343C78.1217 30.8955 78.1797 32.1097 78.1406 34.1843L78.1406 34.1848C78.121 35.1237 78.1191 35.8325 78.1712 36.3828C78.2234 36.9333 78.3277 37.2968 78.5003 37.5608C78.669 37.8189 78.9208 38.0089 79.3259 38.1753C79.7373 38.3443 80.2856 38.4807 81.0293 38.6422C84.0769 39.2995 86.5568 40.9561 88.1577 43.3776C89.4504 45.3267 89.9349 46.7567 90.0348 49.0108C90.2142 52.2843 89.094 55.1852 86.7785 57.4812C84.4582 59.8212 81.8511 60.7967 78.0664 60.7967C77.4473 60.7967 76.8287 60.8209 76.3278 60.8595C76.0771 60.8788 75.8582 60.9014 75.6845 60.9261C75.5043 60.9517 75.3917 60.9769 75.3417 60.9957L75.3409 60.996C73.6295 61.6311 73.2286 63.6688 74.6052 64.9743C74.7538 65.113 74.8509 65.2004 74.9528 65.2656C75.0483 65.3267 75.1548 65.3721 75.3203 65.4071C75.6726 65.4817 76.2434 65.5016 77.4281 65.5312L77.429 65.5312C82.819 65.6858 86.9475 64.1432 90.2514 60.7816L90.2516 60.7814C96.7517 54.1851 96.2298 43.2426 89.1771 37.4195C87.7919 36.2845 85.8261 35.1675 84.2365 34.6313L84.2346 34.6306L83.219 34.2791L83.0627 34.225L83.0514 34.0599L82.9146 32.0678L82.9145 32.0664C82.7016 28.6985 82.0063 26.056 80.6361 23.335L80.6355 23.3337C77.7973 17.6188 72.6422 13.4663 66.3828 11.8239C65.2252 11.5274 63.5164 11.3284 61.8085 11.2579C60.0995 11.1874 58.4177 11.2468 57.3125 11.4564C52.5571 12.3649 48.8333 14.3525 45.4903 17.7342Z" fill="#C0C0C0" stroke="#111111" stroke-width="0.5"/>
<path d="M34.2654 52.4825L34.2654 52.4823C34.5367 52.3261 34.9727 52.232 35.4347 52.2227C35.8956 52.2134 36.3312 52.2894 36.6021 52.4282C36.699 52.4809 36.8496 52.5985 37.0109 52.7551C37.1705 52.9101 37.3239 53.087 37.4287 53.2442L37.4296 53.2456L37.8359 53.8462V67.7149C37.8359 68.1953 37.836 68.6602 37.836 69.1099C37.8366 75.8353 37.8368 79.1931 37.7072 80.9485C37.6376 81.892 37.5321 82.3267 37.3979 82.5676C37.2875 82.7657 37.1576 82.8415 36.9041 82.9893C36.8738 83.007 36.8417 83.0257 36.8077 83.0458C36.6088 83.1603 36.3477 83.242 35.4847 83.288C34.6238 83.334 33.2056 83.3438 30.7227 83.3438H25.0781H24.9189L24.8516 83.4881L24.3059 84.6575C24.3057 84.6579 24.3055 84.6583 24.3053 84.6587C23.1745 87.0134 20.797 88.584 18.0315 88.7544L18.0298 88.7546C14.717 88.9817 11.9393 87.3413 10.4393 84.2846L34.2654 52.4825ZM34.2654 52.4825L34.2583 52.4863M34.2654 52.4825L34.2583 52.4863M34.2583 52.4863C34.1426 52.548 33.9873 52.6703 33.8366 52.8256C33.6866 52.9801 33.5581 53.1499 33.4853 53.2955L33.4816 53.3029M34.2583 52.4863L33.4816 53.3029M33.4816 53.3029L33.4774 53.3101M33.4816 53.3029L33.4774 53.3101M33.4774 53.3101C33.4163 53.4143 33.3601 53.5507 33.3134 53.885C33.266 54.2248 33.2308 54.7508 33.204 55.6254C33.1504 57.3718 33.1309 60.4682 33.1016 66.1536C33.1016 66.1536 33.1016 66.1537 33.1016 66.1537L33.043 78.5169L33.0418 78.7657M33.4774 53.3101L33.0418 78.7657M33.0418 78.7657H32.793M33.0418 78.7657H32.793M32.793 78.7657H28.9258H25.0391H24.882M32.793 78.7657H24.882M24.882 78.7657L24.8138 78.6241M24.882 78.7657L24.8138 78.6241M24.8138 78.6241L24.3061 77.5697C24.0464 77.0317 23.4004 76.1375 22.8733 75.6292L22.8733 75.6293M24.8138 78.6241L22.8733 75.6293M22.8733 75.6293L22.8701 75.6261M22.8733 75.6293L22.8701 75.6261M22.8701 75.6261C20.278 73.034 16.2499 72.638 13.2444 74.6415M22.8701 75.6261L13.2444 74.6415M13.2444 74.6415C11.9169 75.5329 11.1456 76.4345 10.422 77.9766C10.1909 78.4774 10.0704 78.7898 10.0026 79.2076C9.93315 79.636 9.91797 80.1822 9.91797 81.1524C9.91797 82.1331 9.93325 82.6729 10.0047 83.0902C10.0742 83.4958 10.1979 83.792 10.4393 84.2845L13.2444 74.6415ZM19.7002 83.0745L19.6997 83.0751C19.1057 83.7524 18.3845 84.1197 17.6268 84.1416C16.8707 84.1634 16.1156 83.8402 15.453 83.2089C14.9231 82.7093 14.5911 82.2006 14.4879 81.6316C14.3846 81.0623 14.5179 80.4741 14.8343 79.8311L14.8343 79.8311L14.8356 79.8284C15.2106 79.0888 15.7655 78.5589 16.4265 78.2891C17.0882 78.019 17.8373 78.0174 18.5842 78.3013C20.594 79.0502 21.1352 81.4284 19.7002 83.0745Z" fill="#C0C0C0" stroke="#111111" stroke-width="0.5"/>
<path d="M48.7446 52.4979L48.7444 52.498C48.7196 52.5133 48.6957 52.528 48.6727 52.5421C48.408 52.7046 48.2629 52.7937 48.1472 52.9683C48.0197 53.1608 47.9164 53.4822 47.8463 54.1661C47.7107 55.4896 47.7107 58.0036 47.7109 63.1205L47.7109 63.6133V73.5352V73.6865L47.5767 73.7567L46.3072 74.4207L46.3072 74.4208L46.3053 74.4217C43.2476 75.9883 41.6571 79.5798 42.5078 82.946C43.1339 85.374 44.4909 87.033 46.7877 88.1339L46.7884 88.1343C47.372 88.4164 47.7023 88.5544 48.1131 88.6285C48.5336 88.7043 49.0468 88.7148 49.9999 88.7148C51.0051 88.7148 51.5083 88.7088 51.9392 88.6199C52.3628 88.5325 52.7247 88.363 53.4416 87.9997L53.4416 87.9996L53.4443 87.9983C59.0279 85.2538 59.1693 77.2346 53.6943 74.4216L53.6926 74.4207L52.4231 73.7567L52.289 73.6865V73.5352V63.6133C52.289 63.2802 52.289 62.9576 52.2891 62.6452C52.2896 57.8272 52.2898 55.4238 52.1585 54.1417C52.0884 53.4579 51.9839 53.1392 51.8544 52.9489C51.7367 52.776 51.588 52.6877 51.3158 52.526C51.2923 52.512 51.2679 52.4975 51.2425 52.4824C50.9421 52.3167 50.4689 52.2228 49.9767 52.2251C49.4811 52.2274 49.0211 52.327 48.7446 52.4979ZM47.4609 63.6133V73.5352L48.6132 52.2852C48.4136 52.4082 48.2486 52.5024 48.1122 52.6277C47.4474 53.2381 47.4609 54.5871 47.4609 63.6133ZM47.4433 79.5955L47.4436 79.595C47.9904 78.7118 49.0421 78.0703 49.9999 78.0703C50.2181 78.0703 50.4874 78.1207 50.7416 78.1951C50.9967 78.2699 51.258 78.3751 51.4582 78.4975C52.7627 79.2929 53.1621 80.6943 52.8544 81.8909C52.5462 83.089 51.5239 84.0977 49.9999 84.0977C47.7208 84.0977 46.2437 81.5448 47.4433 79.5955Z" fill="#C0C0C0" stroke="#111111" stroke-width="0.5"/>
<path d="M62.5703 53.2455L62.5712 53.2441C62.676 53.0869 62.8294 52.91 62.989 52.755C63.1497 52.599 63.2996 52.4818 63.3966 52.4288C63.901 52.1779 64.5206 52.1348 65.1008 52.2787C65.6823 52.423 66.2005 52.749 66.5113 53.206C66.6401 53.3994 66.7369 53.607 66.7935 55.3207C66.8495 57.0154 66.869 60.126 66.8983 66.0559L66.9569 78.5168L66.9581 78.7656H67.2069H71.0937H74.9804H75.1361L75.2048 78.6257L75.732 77.5519L62.5703 53.2455ZM62.5703 53.2455L62.164 53.8461V67.7148C62.164 68.1952 62.1639 68.6601 62.1639 69.1098C62.1633 75.8352 62.1631 79.193 62.2927 80.9483C62.3623 81.8919 62.4678 82.3266 62.602 82.5675C62.7124 82.7656 62.8423 82.8414 63.0958 82.9892C63.1261 83.0069 63.1582 83.0256 63.1923 83.0457C63.3911 83.1602 63.6522 83.2418 64.5152 83.2879C65.3762 83.3339 66.7943 83.3437 69.2772 83.3437H74.9022H75.0557M62.5703 53.2455L75.0557 83.3437M75.0557 83.3437L75.1252 83.4805M75.0557 83.3437L75.1252 83.4805M75.1252 83.4805L75.7688 84.7483C75.7689 84.7485 75.7691 84.7488 75.7692 84.7491C78.2253 89.4898 84.8645 90.2132 88.3647 86.1264L88.3659 86.125M75.1252 83.4805L88.3659 86.125M88.3659 86.125C88.7413 85.6933 89.2957 84.8527 89.5795 84.2661C89.8109 83.784 89.9302 83.4924 89.9974 83.0887C90.0667 82.6732 90.0819 82.1328 90.0819 81.1523C90.0819 80.1196 90.0713 79.589 89.9911 79.1678C89.9131 78.7575 89.7679 78.4445 89.4645 77.8476L89.4632 77.8449M88.3659 86.125L89.4632 77.8449M89.4632 77.8449C89.1053 77.1194 88.8173 76.6311 88.4687 76.2058M89.4632 77.8449L88.4687 76.2058M83.0963 84.0927C82.0718 84.2997 81.0422 83.8294 80.3488 83.1022C79.6561 82.3758 79.2481 81.3385 79.5458 80.3571L79.5458 80.3571L79.5469 80.3537C80.1561 78.4421 82.1742 77.5305 83.9072 78.4711C84.4408 78.7546 84.8833 79.2618 85.1669 79.8238C85.4499 80.3845 85.5903 81.031 85.4803 81.6071C85.3895 82.135 85.0256 82.705 84.5918 83.1565C84.1581 83.608 83.6072 83.9903 83.0963 84.0927ZM83.0963 84.0927L83.0468 83.8476L83.0958 84.0928C83.096 84.0927 83.0961 84.0927 83.0963 84.0927ZM88.4687 76.2058C88.1202 75.7807 87.703 75.4085 87.0744 74.925M88.4687 76.2058L87.0744 74.925M87.0744 74.925C86.0939 74.1781 84.7395 73.7069 83.3284 73.5591C81.9178 73.4114 80.4754 73.5895 79.3232 74.1138C78.6413 74.4316 77.9021 74.9652 77.2503 75.5884C76.5978 76.2122 76.0475 76.9117 75.7321 77.5515L87.0744 74.925Z" fill="#C0C0C0" stroke="#111111" stroke-width="0.5"/>
</svg>
