[[
[
 {
    "acvVersion": "1.0"
  },
{
  "vsId": 0,
  "algorithm": "Big Numbers",
  "isSample": true,
  "revision": "1.0",
  "testGroups": [
    {
      "tgId": 1,
      "tests": [
        {
          "tcId": 1,
          "operation": {"invMod": {"a": "000F91", "modulo": "0011"}}
        },
        {
          "tcId": 2,
          "operation": {"invMod": {"a": "0107", "modulo": "0005"}}
        }
        ]
	}
	]
}],

[
 {
    "acvVersion": "1.0"
  },
  {
  "vsId": 0,
  "algorithm": "Big Numbers",
  "isSample": true,
  "revision": "1.0",
  "testGroups": [
    {
      "tgId": 1,
      "answers": [
        {
          "tcId": 1,
          "operationAnswer": {"invMod": {"result": "0005"}}
        },
        {
          "tcId": 2,
          "operationAnswer": {"invMod": {"result": "0005"}}
        }
        ]
        }]
}
]
]
]
