<?xml version="1.0" encoding="UTF-8" standalone="no"?>
<svg
   viewBox="0 0 124.00001 124"
   version="1.1"
   id="svg8"
   sodipodi:docname="docker.svg"
   width="124"
   height="124"
   inkscape:version="1.2.2 (1:1.2.2+202212051552+b0a8486541)"
   xmlns:inkscape="http://www.inkscape.org/namespaces/inkscape"
   xmlns:sodipodi="http://sodipodi.sourceforge.net/DTD/sodipodi-0.dtd"
   xmlns="http://www.w3.org/2000/svg"
   xmlns:svg="http://www.w3.org/2000/svg"
   xmlns:rdf="http://www.w3.org/1999/02/22-rdf-syntax-ns#"
   xmlns:cc="http://creativecommons.org/ns#"
   xmlns:dc="http://purl.org/dc/elements/1.1/">
  <defs
     id="defs12" />
  <sodipodi:namedview
     id="namedview10"
     pagecolor="#ffffff"
     bordercolor="#000000"
     borderopacity="0.25"
     inkscape:showpageshadow="2"
     inkscape:pageopacity="0.0"
     inkscape:pagecheckerboard="0"
     inkscape:deskcolor="#d1d1d1"
     showgrid="false"
     inkscape:zoom="2.8667082"
     inkscape:cx="173.71842"
     inkscape:cy="92.440522"
     inkscape:window-width="1920"
     inkscape:window-height="1007"
     inkscape:window-x="0"
     inkscape:window-y="0"
     inkscape:window-maximized="1"
     inkscape:current-layer="svg8" />
  <title
     id="title2">Docker logo</title>
  <path
     d="m 116.79062,52.245 c -2.57,-1.79 -8.47,-2.45 -13.08,-1.56 -0.54,-4.46 -3,-8.37 -7.290002,-11.83 l -2.47,-1.79 -1.72,2.57 a 21.15,21.15 0 0 0 -2.89,12.5 14.91,14.91 0 0 0 2.25,6.81 17.87,17.87 0 0 1 -8.68,2 H 5.4006176 l -0.21,0.89 c -0.75,4.46 -0.75,18.41 8.0000004,29.12 6.65,8.15 16.51,12.27 29.48,12.27 28.09,0 48.89,-13.5 58.640002,-37.94 3.86,0.11 12.11,0 16.3,-8.37 0.11,-0.22 0.32,-0.67 1.07,-2.34 l 0.43,-0.89 -2.36,-1.45 z M 67.360618,20.775 h -11.79 v 11.16 h 11.79 z m 0,13.39 h -11.79 v 11.16 h 11.79 z m -13.94,0 h -11.79 v 11.16 h 11.79 z m -13.94,0 h -11.78 v 11.16 h 11.79 v -11.16 z m -13.94,13.39 h -11.78 v 11.16 h 11.79 v -11.16 z m 13.94,0 h -11.78 v 11.16 h 11.79 v -11.16 z m 13.94,0 h -11.79 v 11.16 h 11.79 z m 13.94,0 h -11.79 v 11.16 h 11.79 z m 13.94,0 h -11.79 v 11.16 h 11.79 z"
     style="fill:#2496ed"
     id="path6" />
  <metadata
     id="metadata295">
    <rdf:RDF>
      <cc:Work
         rdf:about="">
        <dc:title>Docker logo</dc:title>
      </cc:Work>
    </rdf:RDF>
  </metadata>
</svg>
