<?xml version="1.0" encoding="UTF-8" standalone="no"?>
<!-- Generator: Adobe Illustrator 21.0.2, SVG Export Plug-In . SVG Version: 6.00 Build 0)  -->

<svg
   version="1.1"
   id="Layer_1"
   x="0px"
   y="0px"
   viewBox="0 0 310.50031 34.037388"
   xml:space="preserve"
   sodipodi:docname="nepenthes.svg"
   inkscape:version="1.2.2 (1:1.2.2+202212051552+b0a8486541)"
   width="310.50031"
   height="34.037388"
   xmlns:inkscape="http://www.inkscape.org/namespaces/inkscape"
   xmlns:sodipodi="http://sodipodi.sourceforge.net/DTD/sodipodi-0.dtd"
   xmlns="http://www.w3.org/2000/svg"
   xmlns:svg="http://www.w3.org/2000/svg"><defs
   id="defs46">
	

		
		
		
	
			
			
		</defs><sodipodi:namedview
   id="namedview44"
   pagecolor="#ffffff"
   bordercolor="#000000"
   borderopacity="0.25"
   inkscape:showpageshadow="2"
   inkscape:pageopacity="0.0"
   inkscape:pagecheckerboard="0"
   inkscape:deskcolor="#d1d1d1"
   showgrid="false"
   inkscape:zoom="3.554054"
   inkscape:cx="380.69202"
   inkscape:cy="17.022814"
   inkscape:window-width="1920"
   inkscape:window-height="1008"
   inkscape:window-x="0"
   inkscape:window-y="0"
   inkscape:window-maximized="1"
   inkscape:current-layer="Layer_1" />
<style
   type="text/css"
   id="style2">
	.st0{fill:none;}
	.st1{fill:#07BFDD;}
	.st2{fill:none;stroke:#07BFDD;stroke-width:5;stroke-miterlimit:10;}
	.st3{fill:none;stroke:#07BFDD;stroke-width:5;stroke-miterlimit:10;stroke-dasharray:9.3639,1.8728;}
</style>
<g
   id="g557"
   transform="translate(-31,-88.007051)"><g
     id="g24">
				<g
   id="g22">
					<path
   class="st1"
   d="M 53,120.8 36.6,97 v 23.8 H 31 V 88.9 h 6.8 l 16.3,23.7 V 88.9 h 5.6 v 31.9 H 53 Z"
   id="path6" />
					<path
   class="st1"
   d="m 71.2,88.9 h 21.4 v 5.6 H 76.8 v 7.6 h 11.6 v 5.6 H 76.8 v 7.5 h 15.9 v 5.6 H 71.2 Z"
   id="path8" />
					<path
   class="st1"
   d="m 116.9,88.9 c 5.7,0 10.3,4.6 10.3,10.3 0,5.7 -4.6,10.3 -10.3,10.3 h -7.2 v 11.3 h -5.6 V 88.9 Z m -7.2,5.5 v 9.4 h 7.2 c 2.6,0 4.7,-2.1 4.7,-4.7 0,-2.6 -2.1,-4.7 -4.7,-4.7 0,0 -7.2,0 -7.2,0 z"
   id="path10" />
					<path
   class="st1"
   d="m 138.7,88.9 h 21.4 v 5.6 h -15.9 v 7.6 h 11.6 v 5.6 h -11.6 v 7.5 h 15.9 v 5.6 h -21.4 z"
   id="path12" />
					<path
   class="st1"
   d="M 193.6,120.8 177.2,97 v 23.8 h -5.6 V 88.9 h 6.8 l 16.3,23.7 V 88.9 h 5.6 v 31.9 z"
   id="path14" />
					<path
   class="st1"
   d="m 236.7,88.9 v 5.6 H 227 v 26.2 h -5.6 V 94.5 h -9.6 v -5.6 z"
   id="path16" />
					<path
   class="st1"
   d="M 269.7,102.1 V 88.9 h 5.6 v 31.9 h -5.6 v -13.1 h -15.9 v 13.1 h -5.6 V 88.9 h 5.6 v 13.2 z"
   id="path18" />
					<path
   class="st1"
   d="m 286.8,88.9 h 21.4 v 5.6 h -15.9 v 7.6 h 11.6 v 5.6 h -11.6 v 7.5 h 15.9 v 5.6 h -21.4 z"
   id="path20" />
				</g>
			</g><g
     id="g538"><path
       class="st1"
       d="m 324.8,116.5 c -0.8,-0.5 -1.5,-1.3 -1.9,-2.2 -0.4,-1 -0.4,-2.1 -0.5,-3.2 -0.1,-1.2 -0.5,-2.1 -1.3,-3 -1.3,-1.4 -3,-1.4 -4.7,-1.2 0.4,0.5 0.9,1.1 1.2,1.7 0.5,1 -0.2,1.9 -0.2,2.9 0.1,1.6 1,3.2 2.3,4.2 -1.6,-0.9 -3.5,0.2 -4.7,1.3 -1.1,1.1 -2,2.1 -3.6,2.3 0.8,0.4 1.3,1.2 1.9,1.7 0.9,0.7 2,1.2 3.1,1 1.7,-0.3 2.4,-1.7 3.6,-2.7 1.9,-1.6 3.8,-1.2 4.8,1.1"
       id="path26" /><g
       id="g38">
			<g
   id="g36">
				<path
   class="st2"
   d="m 321,116.5 c 1.7,0.7 3.3,1.1 4.8,1.5"
   id="path30" />
				<path
   class="st3"
   d="m 327.6,118.3 c 6.7,0.8 11.4,-1.6 11.4,-5.8 0,-10 -18,-6 -18,-15 0,-4.7 5.5,-8.2 11.7,-6.6"
   id="path32" />
				<path
   class="st2"
   d="m 333.6,91.2 c 1.5,0.5 2.9,1.2 4.4,2.3"
   id="path34" />
			</g>
		</g></g></g>
</svg>
