// Jest Snapshot v1, https://goo.gl/fbAQLP

exports[`OAuthConnectButton.vue when the admin config is not okay should show message for admin user 1`] = `<div class="oauth-connect--message">Some Nepenthes Integration application settings are not working. Configure the Nepenthes Integration in: {htmlLink}</div>`;

exports[`OAuthConnectButton.vue when the admin config is not okay should show message for normal user 1`] = `<div class="oauth-connect--message">Some Nepenthes Integration application settings are not working. Please contact your Nextcloud administrator.</div>`;
