{
  "/system-admin-guide/": [
    {
      "text": "Emails and notifications",
      "link": "/system-admin-guide/emails-and-notifications/"
    },
    {
      "text": "Backup",
      "link": "/system-admin-guide/backup/"
    },
    {
      "text": "API and webhooks",
      "link": "/system-admin-guide/api-and-webhooks/"
    },
    {
      "text": "Frequently asked questions (FAQ) for system administration",
      "link": "/system-admin-guide/system-admin-guide-faq/"
    },
    {
      "text": "Initial setup of Nepenthes for administrators",
      "link": "/system-admin-guide/initial-setup/"
    },
    {
      "text": "File storages",
      "link": "/system-admin-guide/file-storages/"
    },
    {
      "text": "Manage custom fields",
      "link": "/system-admin-guide/custom-fields/",
      "items": [
        {
          "text": "Frequently asked questions (FAQ) for custom fields",
          "link": "/system-admin-guide/custom-fields/custom-fields-faq/"
        },
        {
          "text": "Manage and display custom fields in the project list",
          "link": "/system-admin-guide/custom-fields/custom-fields-projects/"
        }
      ]
    },
    {
      "text": "Time and costs",
      "link": "/system-admin-guide/time-and-costs/"
    },
    {
      "text": "Backlogs configuration",
      "link": "/system-admin-guide/backlogs/"
    },
    {
      "text": "System settings",
      "link": "/system-admin-guide/system-settings/",
      "items": [
        {
          "text": "Project system settings",
          "link": "/system-admin-guide/system-settings/project-system-settings/"
        },
        {
          "text": "Languages",
          "link": "/system-admin-guide/system-settings/languages/"
        },
        {
          "text": "General system settings",
          "link": "/system-admin-guide/system-settings/general-settings/"
        },
        {
          "text": "Repositories settings",
          "link": "/system-admin-guide/system-settings/repositories/"
        }
      ]
    },
    {
      "text": "Attachments in Nepenthes",
      "link": "/system-admin-guide/attachments/",
      "items": [
        {
          "text": "Virus scanning",
          "link": "/system-admin-guide/attachments/virus-scanning/"
        }
      ]
    },
    {
      "text": "Plugins",
      "link": "/system-admin-guide/plugins/"
    },
    {
      "text": "Calendar and dates",
      "link": "/system-admin-guide/calendars-and-dates/"
    },
    {
      "text": "Integrations and community plugins",
      "link": "/system-admin-guide/integrations/",
      "items": [
        {
          "text": "Excel synchronization with Nepenthes",
          "link": "/system-admin-guide/integrations/excel-synchronization/"
        },
        {
          "text": "OneDrive/SharePoint integration setup",
          "link": "/system-admin-guide/integrations/one-drive/",
          "items": [
            {
              "text": "Drive Guide",
              "link": "/system-admin-guide/integrations/one-drive/drive-guide/"
            }
          ]
        },
        {
          "text": "GitHub integration",
          "link": "/system-admin-guide/integrations/github-integration/"
        },
        {
          "text": "Frequently asked questions (FAQ) for integrations",
          "link": "/system-admin-guide/integrations/integrations-faq/"
        },
        {
          "text": "GitLab integration",
          "link": "/system-admin-guide/integrations/gitlab-integration/"
        },
        {
          "text": "Nextcloud integration setup",
          "link": "/system-admin-guide/integrations/nextcloud/"
        }
      ]
    },
    {
      "text": "Manage Enumerations",
      "link": "/system-admin-guide/enumerations/"
    },
    {
      "text": "Authentication",
      "link": "/system-admin-guide/authentication/",
      "items": [
        {
          "text": "OpenID providers",
          "link": "/system-admin-guide/authentication/openid-providers/"
        },
        {
          "text": "Authentication settings",
          "link": "/system-admin-guide/authentication/authentication-settings/"
        },
        {
          "text": "SAML",
          "link": "/system-admin-guide/authentication/saml/"
        },
        {
          "text": "Manage LDAP connections",
          "link": "/system-admin-guide/authentication/ldap-authentication/",
          "items": [
            {
              "text": "Synchronize LDAP and Nepenthes groups",
              "link": "/system-admin-guide/authentication/ldap-authentication/ldap-group-synchronization/"
            }
          ]
        },
        {
          "text": "Two-factor authentication (2FA)",
          "link": "/system-admin-guide/authentication/two-factor-authentication/"
        },
        {
          "text": "Kerberos integration",
          "link": "/system-admin-guide/authentication/kerberos/"
        },
        {
          "text": "OAuth applications",
          "link": "/system-admin-guide/authentication/oauth-applications/"
        },
        {
          "text": "Frequently asked questions (FAQ) for authentication",
          "link": "/system-admin-guide/authentication/authentication-faq/"
        },
        {
          "text": "reCAPTCHA configuration",
          "link": "/system-admin-guide/authentication/recaptcha/"
        }
      ]
    },
    {
      "text": "Announcement",
      "link": "/system-admin-guide/announcement/"
    },
    {
      "text": "Users and permissions",
      "link": "/system-admin-guide/users-permissions/",
      "items": [
        {
          "text": "Manage Groups",
          "link": "/system-admin-guide/users-permissions/groups/"
        },
        {
          "text": "Frequently asked questions (FAQ) for users and permissions",
          "link": "/system-admin-guide/users-permissions/users-permissions-faq/"
        },
        {
          "text": "User settings",
          "link": "/system-admin-guide/users-permissions/settings/"
        },
        {
          "text": "Placeholder users",
          "link": "/system-admin-guide/users-permissions/placeholder-users/"
        },
        {
          "text": "Manage users",
          "link": "/system-admin-guide/users-permissions/users/"
        },
        {
          "text": "Nepenthes Avatars",
          "link": "/system-admin-guide/users-permissions/avatars/"
        },
        {
          "text": "Roles and permissions",
          "link": "/system-admin-guide/users-permissions/roles-permissions/"
        }
      ]
    },
    {
      "text": "Set custom color theme and logo",
      "link": "/system-admin-guide/design/",
      "items": [
        {
          "text": "PDF Export Styling yml",
          "link": "/system-admin-guide/design/pdf-export-styles/"
        }
      ]
    },
    {
      "text": "Attribute help texts",
      "link": "/system-admin-guide/attribute-help-texts/"
    },
    {
      "text": "Manage work packages",
      "link": "/system-admin-guide/manage-work-packages/",
      "items": [
        {
          "text": "Frequently asked questions (FAQ) for work package settings",
          "link": "/system-admin-guide/manage-work-packages/work-packages-faq/"
        },
        {
          "text": "Manage work package status",
          "link": "/system-admin-guide/manage-work-packages/work-package-status/"
        },
        {
          "text": "Work package settings",
          "link": "/system-admin-guide/manage-work-packages/work-package-settings/"
        },
        {
          "text": "Manage work package workflows",
          "link": "/system-admin-guide/manage-work-packages/work-package-workflows/"
        },
        {
          "text": "Automated workflows with custom actions ",
          "link": "/system-admin-guide/manage-work-packages/custom-actions/"
        },
        {
          "text": "Manage work package types",
          "link": "/system-admin-guide/manage-work-packages/work-package-types/"
        }
      ]
    },
    {
      "text": "Colors",
      "link": "/system-admin-guide/colors/"
    },
    {
      "text": "System information",
      "link": "/system-admin-guide/information/"
    }
  ],
  "/installation-and-operations/": [
    {
      "text": "Nepenthes BIM edition",
      "link": "/installation-and-operations/bim-edition/"
    },
    {
      "text": "Operating Nepenthes",
      "link": "/installation-and-operations/operation/",
      "items": [
        {
          "text": "Upgrading your Nepenthes installation",
          "link": "/installation-and-operations/operation/upgrading/"
        },
        {
          "text": "Frequently asked questions (FAQ) for Operation",
          "link": "/installation-and-operations/operation/faq/"
        },
        {
          "text": "Restoring an Nepenthes backup",
          "link": "/installation-and-operations/operation/restoring/",
          "items": [
            {
              "text": "Restoring a deleted project",
              "link": "/installation-and-operations/operation/restoring/restoring-a-deleted-project/"
            }
          ]
        },
        {
          "text": "Process control for your Nepenthes installation",
          "link": "/installation-and-operations/operation/control/"
        },
        {
          "text": "(Re)configuring Nepenthes",
          "link": "/installation-and-operations/operation/reconfiguring/"
        },
        {
          "text": "Monitoring your Nepenthes installation",
          "link": "/installation-and-operations/operation/monitoring/"
        },
        {
          "text": "Backing up your Nepenthes installation",
          "link": "/installation-and-operations/operation/backing-up/"
        }
      ]
    },
    {
      "text": "Frequently asked questions (FAQ) for installation and operation",
      "link": "/installation-and-operations/installation-faq/"
    },
    {
      "text": "Guides for infrequent operations",
      "link": "/installation-and-operations/misc/",
      "items": [
        {
          "text": "Migrating your packaged Nepenthes installation to another environment",
          "link": "/installation-and-operations/misc/migration/"
        },
        {
          "text": "Custom OpenID Connect providers",
          "link": "/installation-and-operations/misc/custom-openid-connect-providers/"
        }
      ]
    },
    {
      "text": "System requirements",
      "link": "/installation-and-operations/system-requirements/"
    },
    {
      "text": "Nepenthes advanced configuration",
      "link": "/installation-and-operations/configuration/",
      "items": [
        {
          "text": "Configuring a custom web server",
          "link": "/installation-and-operations/configuration/server/"
        },
        {
          "text": "Configuring SSL",
          "link": "/installation-and-operations/configuration/ssl/"
        },
        {
          "text": "Adding plugins (DEB/RPM packages)",
          "link": "/installation-and-operations/configuration/plugins/"
        },
        {
          "text": "Configuring a custom database server",
          "link": "/installation-and-operations/configuration/database/"
        },
        {
          "text": "Environment variables",
          "link": "/installation-and-operations/configuration/environment/"
        },
        {
          "text": "Configuring inbound emails",
          "link": "/installation-and-operations/configuration/incoming-emails/"
        },
        {
          "text": "Configuring outbound emails",
          "link": "/installation-and-operations/configuration/outbound-emails/"
        },
        {
          "text": "Repository Integration in Nepenthes",
          "link": "/installation-and-operations/configuration/repositories/"
        }
      ]
    },
    {
      "text": "Installing Nepenthes",
      "link": "/installation-and-operations/installation/",
      "items": [
        {
          "text": "Install Nepenthes with Docker",
          "link": "/installation-and-operations/installation/docker/"
        },
        {
          "text": "Kubernetes",
          "link": "/installation-and-operations/installation/kubernetes/"
        },
        {
          "text": "Nepenthes in Univention App Center",
          "link": "/installation-and-operations/installation/univention/"
        },
        {
          "text": "Instruction for specific platforms",
          "link": "/installation-and-operations/installation/misc/"
        },
        {
          "text": "Synology",
          "link": "/installation-and-operations/installation/synology/"
        },
        {
          "text": "Install Nepenthes with DEB/RPM packages",
          "link": "/installation-and-operations/installation/packaged/"
        },
        {
          "text": "Manual installation guide",
          "link": "/installation-and-operations/installation/manual/"
        }
      ]
    }
  ],
  "/user-guide/": [
    {
      "text": "Keyboard Shortcuts and Access Keys",
      "link": "/user-guide/keyboard-shortcuts-access-keys/"
    },
    {
      "text": "Calendar",
      "link": "/user-guide/calendar/",
      "items": [
        {
          "text": "Frequently asked questions (FAQ) for calendar",
          "link": "/user-guide/calendar/calendar-faq/"
        }
      ]
    },
    {
      "text": "Team planner",
      "link": "/user-guide/team-planner/"
    },
    {
      "text": "Repository for source code control",
      "link": "/user-guide/repository/"
    },
    {
      "text": "Forums",
      "link": "/user-guide/forums/"
    },
    {
      "text": "Manage projects",
      "link": "/user-guide/projects/",
      "items": [
        {
          "text": "Project lists",
          "link": "/user-guide/projects/project-lists/"
        },
        {
          "text": "Project templates",
          "link": "/user-guide/projects/project-templates/"
        },
        {
          "text": "Frequently asked questions (FAQ) for projects",
          "link": "/user-guide/projects/projects-faq/"
        },
        {
          "text": "Project status",
          "link": "/user-guide/projects/project-status/"
        },
        {
          "text": "Project settings",
          "link": "/user-guide/projects/project-settings/",
          "items": [
            {
              "text": "Manage a repository",
              "link": "/user-guide/projects/project-settings/repository/"
            },
            {
              "text": "Manage activities for time tracking",
              "link": "/user-guide/projects/project-settings/activities-time-tracking/"
            },
            {
              "text": "File storages",
              "link": "/user-guide/projects/project-settings/file-storages/"
            },
            {
              "text": "Enable custom fields in projects",
              "link": "/user-guide/projects/project-settings/custom-fields/"
            },
            {
              "text": "Enable modules in a project",
              "link": "/user-guide/projects/project-settings/modules/"
            },
            {
              "text": "Manage project information",
              "link": "/user-guide/projects/project-settings/project-information/"
            },
            {
              "text": "Manage work package categories",
              "link": "/user-guide/projects/project-settings/work-package-categories/"
            },
            {
              "text": "project-attributes",
              "items": [
                {
                  "link": "/user-guide/projects/project-settings/project-attributes/README.md",
                  "text": "Project attributes"
                }
              ]
            },
            {
              "text": "Manage versions",
              "link": "/user-guide/projects/project-settings/versions/"
            },
            {
              "text": "Work package types",
              "link": "/user-guide/projects/project-settings/work-package-types/"
            },
            {
              "text": "Required disk storage",
              "link": "/user-guide/projects/project-settings/required-disk-storage/"
            },
            {
              "text": "Backlogs settings",
              "link": "/user-guide/projects/project-settings/backlogs-settings/"
            }
          ]
        }
      ]
    },
    {
      "text": "Time tracking and cost reporting",
      "link": "/user-guide/time-and-costs/",
      "items": [
        {
          "text": "Cost tracking",
          "link": "/user-guide/time-and-costs/cost-tracking/"
        },
        {
          "text": "Time tracking",
          "link": "/user-guide/time-and-costs/time-tracking/",
          "items": [
            {
              "text": "Time tracking with Toggl Track",
              "link": "/user-guide/time-and-costs/time-tracking/toggl-integration/"
            },
            {
              "text": "Time Tracker for Nepenthes",
              "link": "/user-guide/time-and-costs/time-tracking/time-tracker-integration/"
            },
            {
              "text": "Time tracking with TimeCamp",
              "link": "/user-guide/time-and-costs/time-tracking/timecamp-integration/"
            }
          ]
        },
        {
          "text": "Frequently asked questions (FAQ) for Time and costs",
          "link": "/user-guide/time-and-costs/time-and-costs-faq/"
        },
        {
          "text": "Time and cost reporting",
          "link": "/user-guide/time-and-costs/reporting/"
        },
        {
          "text": "Progress tracking",
          "link": "/user-guide/time-and-costs/progress-tracking/"
        }
      ]
    },
    {
      "text": "Product roadmap release planning",
      "link": "/user-guide/roadmap/"
    },
    {
      "text": "Gantt charts",
      "link": "/user-guide/gantt-chart/",
      "items": [
        {
          "text": "Automatic and manual scheduling modes",
          "link": "/user-guide/gantt-chart/scheduling/"
        },
        {
          "text": "Frequently asked questions (FAQ) for Gantt chart",
          "link": "/user-guide/gantt-chart/gantt-chart-faq/"
        }
      ]
    },
    {
      "text": "Project overview",
      "link": "/user-guide/project-overview/",
      "items": [
        {
          "text": "Frequently asked questions (FAQ) for project overview",
          "link": "/user-guide/project-overview/project-overview-faq/"
        }
      ]
    },
    {
      "text": "Search features",
      "link": "/user-guide/search/"
    },
    {
      "text": "Project News",
      "link": "/user-guide/news/"
    },
    {
      "text": "Documents",
      "link": "/user-guide/documents/"
    },
    {
      "text": "Manage members",
      "link": "/user-guide/members/"
    },
    {
      "text": "Work packages",
      "link": "/user-guide/work-packages/",
      "items": [
        {
          "text": "Frequently asked questions (FAQ) for work packages",
          "link": "/user-guide/work-packages/work-packages-faq/"
        },
        {
          "text": "Baseline comparison",
          "link": "/user-guide/work-packages/baseline-comparison/"
        },
        {
          "text": "Edit work packages",
          "link": "/user-guide/work-packages/edit-work-package/"
        },
        {
          "text": "Add work packages to meetings",
          "link": "/user-guide/work-packages/add-work-packages-to-meetings/"
        },
        {
          "text": "Export work packages",
          "link": "/user-guide/work-packages/exporting/"
        },
        {
          "text": "Work package table configuration",
          "link": "/user-guide/work-packages/work-package-table-configuration/"
        },
        {
          "text": "Work package relations and hierarchies",
          "link": "/user-guide/work-packages/work-package-relations-hierarchies/"
        },
        {
          "text": "Set and change dates and duration of work packages",
          "link": "/user-guide/work-packages/set-change-dates/"
        },
        {
          "text": "Copy, change project or delete a work package",
          "link": "/user-guide/work-packages/copy-move-delete/"
        },
        {
          "text": "Work packages views",
          "link": "/user-guide/work-packages/work-package-views/"
        },
        {
          "text": "Share work packages",
          "link": "/user-guide/work-packages/share-work-packages/"
        },
        {
          "text": "Create Work packages",
          "link": "/user-guide/work-packages/create-work-package/"
        }
      ]
    },
    {
      "text": "File Management",
      "link": "/user-guide/file-management/",
      "items": [
        {
          "text": "File Management FAQs",
          "link": "/user-guide/file-management/file-management-faq/"
        },
        {
          "text": "Nextcloud integration",
          "link": "/user-guide/file-management/nextcloud-integration/"
        },
        {
          "text": "OneDrive/SharePoint integration",
          "link": "/user-guide/file-management/one-drive-integration/"
        }
      ]
    },
    {
      "text": "Notifications",
      "link": "/user-guide/notifications/",
      "items": [
        {
          "text": "Notification settings",
          "link": "/user-guide/notifications/notification-settings/"
        }
      ]
    },
    {
      "text": "Backlogs (Scrum)",
      "link": "/user-guide/backlogs-scrum/",
      "items": [
        {
          "text": "Frequently asked questions (FAQ) for Backlogs",
          "link": "/user-guide/backlogs-scrum/backlogs-faq/"
        },
        {
          "text": "Create a new sprint",
          "link": "/user-guide/backlogs-scrum/manage-sprints/"
        },
        {
          "text": "Task board view",
          "link": "/user-guide/backlogs-scrum/taskboard/"
        },
        {
          "text": "Working with Backlogs",
          "link": "/user-guide/backlogs-scrum/work-with-backlogs/"
        }
      ]
    },
    {
      "text": "Boards for Agile Project Management ",
      "link": "/user-guide/agile-boards/",
      "items": [
        {
          "text": "Frequently asked questions (FAQ) for Agile boards",
          "link": "/user-guide/agile-boards/agile-boards-faq/"
        }
      ]
    },
    {
      "text": "Budgets",
      "link": "/user-guide/budgets/"
    },
    {
      "text": "Rich text (WYSIWYG) editor in Nepenthes",
      "link": "/user-guide/wysiwyg/"
    },
    {
      "text": "Activity",
      "link": "/user-guide/activity/"
    },
    {
      "text": "Application Home page",
      "link": "/user-guide/home/",
      "items": [
        {
          "text": "Global modules",
          "link": "/user-guide/home/global-modules/"
        }
      ]
    },
    {
      "text": "Wiki",
      "link": "/user-guide/wiki/",
      "items": [
        {
          "text": "More wiki functions",
          "link": "/user-guide/wiki/more-wiki-functions/"
        },
        {
          "text": "Create and edit a wiki page",
          "link": "/user-guide/wiki/create-edit-wiki/"
        },
        {
          "text": "Frequently asked questions (FAQ) for wiki",
          "link": "/user-guide/wiki/wiki-faq/"
        },
        {
          "text": "Wiki project menu",
          "link": "/user-guide/wiki/wiki-menu/"
        }
      ]
    },
    {
      "text": "Meeting management",
      "link": "/user-guide/meetings/",
      "items": [
        {
          "text": "Dynamic meetings management",
          "link": "/user-guide/meetings/dynamic-meetings/"
        },
        {
          "text": "Frequently asked questions (FAQ) for meetings",
          "link": "/user-guide/meetings/meetings-faq/"
        },
        {
          "text": "Classic meetings",
          "link": "/user-guide/meetings/classic-meetings/"
        }
      ]
    }
  ],
  "/development/": [
    {
      "text": "Report a bug",
      "link": "/development/report-a-bug/"
    },
    {
      "text": "Integrating with external file storage provider",
      "link": "/development/file-storage-integration/"
    },
    {
      "text": "Nepenthes development setup via docker",
      "link": "/development/development-environment-docker/"
    },
    {
      "text": "Nepenthes development setup on Debian / Ubuntu",
      "link": "/development/development-environment-ubuntu/"
    },
    {
      "text": "Frequently asked questions (FAQ) for development",
      "link": "/development/faq/"
    },
    {
      "text": "Help translate Nepenthes to your language",
      "link": "/development/translate-openproject/",
      "items": [
        {
          "text": "Fair language for Nepenthes",
          "link": "/development/translate-openproject/fair-language/"
        }
      ]
    },
    {
      "text": "Set up a development SAML idP",
      "link": "/development/saml/"
    },
    {
      "text": "Accessibility checklist",
      "link": "/development/accessibility-checklist/"
    },
    {
      "text": "Packaging of Nepenthes with packager.io",
      "link": "/development/packaging/"
    },
    {
      "text": "Nepenthes development setup via docker (MacOS)",
      "link": "/development/development-environment-docker-macos/"
    },
    {
      "text": "Nepenthes development setup on Mac OS X",
      "link": "/development/development-environment-osx/"
    },
    {
      "text": "Application profiling",
      "link": "/development/profiling/"
    },
    {
      "text": "Create an OmniAuth plugin",
      "link": "/development/create-omniauth-plugin/"
    },
    {
      "text": "Testing Nepenthes",
      "link": "/development/running-tests/"
    },
    {
      "text": "Code review guidelines",
      "link": "/development/code-review-guidelines/"
    },
    {
      "text": "Contribute to the Nepenthes documentation",
      "link": "/development/contribution-documentation/",
      "items": [
        {
          "text": "Documentation process for internal team members",
          "link": "/development/contribution-documentation/documentation-process-internal-contributor/"
        },
        {
          "text": "Documentation style guide",
          "link": "/development/contribution-documentation/documentation-style-guide/"
        },
        {
          "text": "Get support for your contribution",
          "link": "/development/contribution-documentation/contribution-support/"
        },
        {
          "text": "Documentation process",
          "link": "/development/contribution-documentation/documentation-process/"
        }
      ]
    },
    {
      "text": "Nepenthes First Look",
      "link": "/development/first-look/"
    },
    {
      "text": "Nepenthes development style guide",
      "link": "/development/style-guide/",
      "items": [
        {
          "text": "Nepenthes development style guide - frontend",
          "link": "/development/style-guide/frontend/"
        }
      ]
    },
    {
      "text": "Development at GitHub",
      "link": "/development/git-workflow/"
    },
    {
      "text": "Releases",
      "link": "/development/releases/"
    },
    {
      "text": "Create an Nepenthes plugin",
      "link": "/development/create-openproject-plugin/"
    },
    {
      "text": "Developing Nepenthes locally with HTTPS",
      "link": "/development/localhost-ssl/"
    },
    {
      "text": "Design System and Component Libraries",
      "link": "/development/design-system/"
    },
    {
      "text": "Nepenthes development concepts",
      "link": "/development/concepts/",
      "items": [
        {
          "text": "Development concept: Inline editing",
          "link": "/development/concepts/inline-editing/"
        },
        {
          "text": "Resource schemas",
          "link": "/development/concepts/resource-schemas/"
        },
        {
          "text": "Development concept: Resource changesets",
          "link": "/development/concepts/resource-changesets/"
        },
        {
          "text": "Development concept: HAL resources",
          "link": "/development/concepts/hal-resources/"
        },
        {
          "text": "Using  Stimulus",
          "link": "/development/concepts/stimulus/"
        },
        {
          "text": "Development concept: Permissions",
          "link": "/development/concepts/permissions/"
        },
        {
          "text": "Secure coding Guidelines",
          "link": "/development/concepts/secure-coding/"
        },
        {
          "text": "Development concept: State management",
          "link": "/development/concepts/state-management/"
        },
        {
          "text": "WYSIWYG editor",
          "link": "/development/concepts/wysiwyg-editor/"
        },
        {
          "text": "Dynamically generated forms",
          "link": "/development/concepts/dynamic-forms/"
        },
        {
          "text": "Query",
          "link": "/development/concepts/queries/"
        },
        {
          "text": "Development concept: Translations",
          "link": "/development/concepts/translations/"
        },
        {
          "text": null,
          "link": "/development/concepts/application-architecture/"
        }
      ]
    },
    {
      "text": null,
      "link": "/development/environments/"
    },
    {
      "text": "Submit a feature idea",
      "link": "/development/submit-feature-idea/"
    },
    {
      "text": "Set up a development kerberos server",
      "link": "/development/kerberos/"
    },
    {
      "text": "Application architecture",
      "link": "/development/application-architecture/"
    },
    {
      "text": "Set up a development LDAP server",
      "link": "/development/ldap/"
    }
  ],
  "/blog/": [
    {
      "link": "/blog/nepenthes-0-1-0.md",
      "text": "Nepenthes 0.1.0"
    }
  ],
  "/security-and-privacy/": [
    {
      "text": "Statement on security",
      "link": "/security-and-privacy/statement-on-security/"
    }
  ],
  "/use-cases/": [
    {
      "text": "Implementing Scaled Agile Framework (SAFe) in Nepenthes",
      "link": "/use-cases/safe-framework/"
    },
    {
      "text": "Use Case: Portfolio management and custom reporting options",
      "link": "/use-cases/portfolio-management/"
    },
    {
      "text": "Use Case: Resource management",
      "link": "/use-cases/resource-management/"
    }
  ],
  "/api/": [
    {
      "text": "Frequently asked questions (FAQ) for API",
      "link": "/api/faq/"
    },
    {
      "text": "API Version 3",
      "link": "/api/apiv3/",
      "items": [
        {
          "text": "API v3 client libraries",
          "link": "/api/apiv3/client-libraries/"
        },
        {
          "text": "API v3 usage example",
          "link": "/api/apiv3/example/"
        }
      ]
    },
    {
      "text": "bcf",
      "items": [
        {
          "link": "/api/bcf/bcf-rest-api.md",
          "text": "BCF REST API"
        }
      ]
    }
  ],
  "/getting-started/": [
    {
      "text": "Introduction to Work Packages",
      "link": "/getting-started/work-packages-introduction/"
    },
    {
      "text": "My account",
      "link": "/getting-started/my-account/"
    },
    {
      "text": "My Activity",
      "link": "/getting-started/my-activity/"
    },
    {
      "text": "Projects introduction",
      "link": "/getting-started/projects/"
    },
    {
      "text": "Introduction to Gantt charts",
      "link": "/getting-started/gantt-chart-introduction/"
    },
    {
      "text": "Invite members",
      "link": "/getting-started/invite-members/"
    },
    {
      "text": "Sign in and registration",
      "link": "/getting-started/sign-in-registration/"
    },
    {
      "text": "Introduction to agile boards",
      "link": "/getting-started/boards-introduction/"
    },
    {
      "text": "My Page",
      "link": "/getting-started/my-page/"
    },
    {
      "text": "Introduction to Nepenthes",
      "link": "/getting-started/openproject-introduction/"
    }
  ],
  "/bim-guide/": [
    {
      "text": "Revit add-in (BIM feature)",
      "link": "/bim-guide/revit-add-in/"
    },
    {
      "text": "IFC viewer (BIM feature)",
      "link": "/bim-guide/ifc-viewer/"
    },
    {
      "text": "BIM issue management (BIM feature)",
      "link": "/bim-guide/bim-issue-management/"
    }
  ]
}