module github.com/goharbor/harbor/src

go 1.21

require (
	github.com/FZambia/sentinel v1.1.0
	github.com/Masterminds/semver v1.5.0
	github.com/aliyun/alibaba-cloud-sdk-go v0.0.0-20190726115642-cd293c93fd97
	github.com/asaskevich/govalidator v0.0.0-20210307081110-f21760c49a8d
	github.com/aws/aws-sdk-go v1.48.10
	github.com/beego/beego/v2 v2.0.6
	github.com/beego/i18n v0.0.0-20140604031826-e87155e8f0c0
	github.com/bmatcuk/doublestar v1.1.1
	github.com/casbin/casbin v1.9.1
	github.com/cenkalti/backoff/v4 v4.2.1
	github.com/cloudevents/sdk-go/v2 v2.13.0
	github.com/coreos/go-oidc/v3 v3.7.0
	github.com/dghubble/sling v1.1.0
	github.com/distribution/distribution/v3 v3.0.0-alpha.1
	github.com/distribution/reference v0.5.0
	github.com/docker/distribution v2.8.2+incompatible
	github.com/docker/libtrust v0.0.0-20160708172513-aabc10ec26b7
	github.com/go-asn1-ber/asn1-ber v1.5.1
	github.com/go-ldap/ldap/v3 v3.2.4
	github.com/go-openapi/errors v0.19.6
	github.com/go-openapi/loads v0.19.5
	github.com/go-openapi/runtime v0.19.20
	github.com/go-openapi/spec v0.19.8
	github.com/go-openapi/strfmt v0.19.5
	github.com/go-openapi/swag v0.19.14
	github.com/go-openapi/validate v0.19.10
	github.com/go-redis/redis/v8 v8.11.4
	github.com/gocarina/gocsv v0.0.0-20210516172204-ca9e8a8ddea8
	github.com/gocraft/work v0.5.1
	github.com/golang-jwt/jwt/v4 v4.5.0
	github.com/golang-migrate/migrate/v4 v4.16.2
	github.com/gomodule/redigo v2.0.0+incompatible
	github.com/google/uuid v1.3.1
	github.com/gorilla/csrf v1.6.2
	github.com/gorilla/handlers v1.5.2
	github.com/gorilla/mux v1.8.1
	github.com/graph-gophers/dataloader v5.0.0+incompatible
	github.com/jackc/pgconn v1.14.0
	github.com/jackc/pgx/v4 v4.18.1
	github.com/jpillora/backoff v1.0.0
	github.com/nfnt/resize v0.0.0-20180221191011-83c6a9932646
	github.com/olekukonko/tablewriter v0.0.5
	github.com/opencontainers/go-digest v1.0.0
	github.com/opencontainers/image-spec v1.1.0-rc2.0.20221005185240-3a7f492d3f1b
	github.com/pkg/errors v0.9.1
	github.com/prometheus/client_golang v1.17.0
	github.com/robfig/cron/v3 v3.0.1
	github.com/spf13/viper v1.8.1
	github.com/stretchr/testify v1.8.4
	github.com/tencentcloud/tencentcloud-sdk-go v1.0.62
	github.com/vmihailenco/msgpack/v5 v5.0.0-rc.2
	go.opentelemetry.io/contrib/instrumentation/github.com/gorilla/mux/otelmux v0.45.0
	go.opentelemetry.io/contrib/instrumentation/net/http/otelhttp v0.46.1
	go.opentelemetry.io/otel v1.21.0
	go.opentelemetry.io/otel/exporters/jaeger v1.0.0
	go.opentelemetry.io/otel/exporters/otlp/otlptrace/otlptracehttp v1.21.0
	go.opentelemetry.io/otel/sdk v1.21.0
	go.opentelemetry.io/otel/trace v1.21.0
	go.uber.org/ratelimit v0.2.0
	golang.org/x/crypto v0.17.0
	golang.org/x/net v0.18.0
	golang.org/x/oauth2 v0.13.0
	golang.org/x/sync v0.3.0
	golang.org/x/text v0.14.0
	golang.org/x/time v0.4.0
	gopkg.in/h2non/gock.v1 v1.0.16
	gopkg.in/yaml.v2 v2.4.0
	helm.sh/helm/v3 v3.11.3
	k8s.io/api v0.26.2
	k8s.io/apimachinery v0.26.2
	k8s.io/client-go v0.26.2
	sigs.k8s.io/yaml v1.4.0
)

require (
	cloud.google.com/go v0.110.7 // indirect
	cloud.google.com/go/compute v1.23.0 // indirect
	cloud.google.com/go/compute/metadata v0.2.3 // indirect
	cloud.google.com/go/iam v1.1.1 // indirect
	cloud.google.com/go/storage v1.30.1 // indirect
	github.com/Azure/azure-sdk-for-go/sdk/azcore v1.6.0 // indirect
	github.com/Azure/azure-sdk-for-go/sdk/azidentity v1.3.0 // indirect
	github.com/Azure/azure-sdk-for-go/sdk/internal v1.3.0 // indirect
	github.com/Azure/azure-sdk-for-go/sdk/storage/azblob v1.0.0 // indirect
	github.com/Azure/go-ntlmssp v0.0.0-20200615164410-66371956d46c // indirect
	github.com/AzureAD/microsoft-authentication-library-for-go v1.0.0 // indirect
	github.com/Knetic/govaluate v3.0.1-0.20171022003610-9aa49832a739+incompatible // indirect
	github.com/Masterminds/semver/v3 v3.2.0 // indirect
	github.com/Unknwon/goconfig v1.0.0 // indirect
	github.com/andres-erbsen/clock v0.0.0-20160526145045-9e14626cd129 // indirect
	github.com/beorn7/perks v1.0.1 // indirect
	github.com/cespare/xxhash/v2 v2.2.0 // indirect
	github.com/davecgh/go-spew v1.1.1 // indirect
	github.com/dgryski/go-rendezvous v0.0.0-20200823014737-9f7001d12a5f // indirect
	github.com/docker/go-metrics v0.0.1 // indirect
	github.com/felixge/httpsnoop v1.0.4 // indirect
	github.com/fsnotify/fsnotify v1.4.9 // indirect
	github.com/go-jose/go-jose/v3 v3.0.1 // indirect
	github.com/go-logr/logr v1.3.0 // indirect
	github.com/go-logr/stdr v1.2.2 // indirect
	github.com/go-openapi/analysis v0.19.10 // indirect
	github.com/go-openapi/jsonpointer v0.19.5 // indirect
	github.com/go-openapi/jsonreference v0.20.0 // indirect
	github.com/go-stack/stack v1.8.0 // indirect
	github.com/gogo/protobuf v1.3.2 // indirect
	github.com/golang/groupcache v0.0.0-20210331224755-41bb18bfe9da // indirect
	github.com/golang/protobuf v1.5.3 // indirect
	github.com/google/go-querystring v1.1.0 // indirect
	github.com/google/gofuzz v1.2.0 // indirect
	github.com/google/s2a-go v0.1.4 // indirect
	github.com/googleapis/enterprise-certificate-proxy v0.2.3 // indirect
	github.com/googleapis/gax-go/v2 v2.11.0 // indirect
	github.com/gorilla/securecookie v1.1.1 // indirect
	github.com/grpc-ecosystem/grpc-gateway/v2 v2.16.0 // indirect
	github.com/h2non/parth v0.0.0-20190131123155-b4df798d6542 // indirect
	github.com/hashicorp/errwrap v1.1.0 // indirect
	github.com/hashicorp/go-multierror v1.1.1 // indirect
	github.com/hashicorp/golang-lru v0.5.4 // indirect
	github.com/hashicorp/hcl v1.0.0 // indirect
	github.com/jackc/chunkreader/v2 v2.0.1 // indirect
	github.com/jackc/pgerrcode v0.0.0-20220416144525-469b46aa5efa // indirect
	github.com/jackc/pgio v1.0.0 // indirect
	github.com/jackc/pgpassfile v1.0.0 // indirect
	github.com/jackc/pgproto3/v2 v2.3.2 // indirect
	github.com/jackc/pgservicefile v0.0.0-20221227161230-091c0ba34f0a // indirect
	github.com/jackc/pgtype v1.14.0 // indirect
	github.com/jmespath/go-jmespath v0.4.0 // indirect
	github.com/josharian/intern v1.0.0 // indirect
	github.com/json-iterator/go v1.1.12 // indirect
	github.com/kylelemons/godebug v1.1.0 // indirect
	github.com/magiconair/properties v1.8.5 // indirect
	github.com/mailru/easyjson v0.7.6 // indirect
	github.com/mattn/go-runewidth v0.0.9 // indirect
	github.com/matttproud/golang_protobuf_extensions v1.0.4 // indirect
	github.com/mitchellh/mapstructure v1.4.3 // indirect
	github.com/modern-go/concurrent v0.0.0-20180306012644-bacd9c7ef1dd // indirect
	github.com/modern-go/reflect2 v1.0.2 // indirect
	github.com/opentracing/opentracing-go v1.2.0 // indirect
	github.com/pelletier/go-toml v1.9.3 // indirect
	github.com/pkg/browser v0.0.0-20210911075715-681adbf594b8 // indirect
	github.com/pmezard/go-difflib v1.0.0 // indirect
	github.com/prometheus/client_model v0.5.0 // indirect
	github.com/prometheus/common v0.44.0 // indirect
	github.com/prometheus/procfs v0.11.1 // indirect
	github.com/robfig/cron v1.2.0 // indirect
	github.com/shiena/ansicolor v0.0.0-20200904210342-c7312218db18 // indirect
	github.com/sirupsen/logrus v1.9.3 // indirect
	github.com/spf13/afero v1.6.0 // indirect
	github.com/spf13/cast v1.5.0 // indirect
	github.com/spf13/jwalterweatherman v1.1.0 // indirect
	github.com/spf13/pflag v1.0.5 // indirect
	github.com/stretchr/objx v0.5.0 // indirect
	github.com/subosito/gotenv v1.2.0 // indirect
	github.com/vmihailenco/tagparser v0.1.2 // indirect
	go.mongodb.org/mongo-driver v1.7.5 // indirect
	go.opencensus.io v0.24.0 // indirect
	go.opentelemetry.io/otel/exporters/otlp/otlptrace v1.21.0 // indirect
	go.opentelemetry.io/otel/metric v1.21.0 // indirect
	go.opentelemetry.io/proto/otlp v1.0.0 // indirect
	go.uber.org/atomic v1.7.0 // indirect
	go.uber.org/multierr v1.6.0 // indirect
	go.uber.org/zap v1.17.0 // indirect
	golang.org/x/sys v0.15.0 // indirect
	golang.org/x/term v0.15.0 // indirect
	golang.org/x/xerrors v0.0.0-20220907171357-04be3eba64a2 // indirect
	google.golang.org/api v0.126.0 // indirect
	google.golang.org/appengine v1.6.8 // indirect
	google.golang.org/genproto v0.0.0-20230822172742-b8732ec3820d // indirect
	google.golang.org/genproto/googleapis/api v0.0.0-20230822172742-b8732ec3820d // indirect
	google.golang.org/genproto/googleapis/rpc v0.0.0-20230822172742-b8732ec3820d // indirect
	google.golang.org/grpc v1.59.0 // indirect
	google.golang.org/protobuf v1.31.0 // indirect
	gopkg.in/inf.v0 v0.9.1 // indirect
	gopkg.in/ini.v1 v1.62.0 // indirect
	gopkg.in/yaml.v3 v3.0.1 // indirect
	k8s.io/klog/v2 v2.90.1 // indirect
	k8s.io/utils v0.0.0-20230220204549-a5ecb0141aa5 // indirect
	sigs.k8s.io/json v0.0.0-20220713155537-f223a00ba0e2 // indirect
	sigs.k8s.io/structured-merge-diff/v4 v4.2.3 // indirect
)

replace (
	github.com/Azure/go-autorest => github.com/Azure/go-autorest v14.2.0+incompatible
	github.com/docker/distribution => github.com/distribution/distribution v2.8.2+incompatible
	github.com/goharbor/harbor => ../
	github.com/gomodule/redigo => github.com/gomodule/redigo v1.8.8
)
