<?xml version="1.0" encoding="UTF-8" standalone="no"?>
<!-- Created with Inkscape (http://www.inkscape.org/) -->

<svg
   width="300mm"
   height="300mm"
   viewBox="0 0 300 300"
   version="1.1"
   id="svg5"
   inkscape:version="1.2.2 (1:1.2.2+202212051552+b0a8486541)"
   sodipodi:docname="icon.svg"
   inkscape:export-filename="casa-compat.png"
   inkscape:export-xdpi="96"
   inkscape:export-ydpi="96"
   xmlns:inkscape="http://www.inkscape.org/namespaces/inkscape"
   xmlns:sodipodi="http://sodipodi.sourceforge.net/DTD/sodipodi-0.dtd"
   xmlns="http://www.w3.org/2000/svg"
   xmlns:svg="http://www.w3.org/2000/svg">
  <sodipodi:namedview
     id="namedview7"
     pagecolor="#ffffff"
     bordercolor="#000000"
     borderopacity="0.25"
     inkscape:showpageshadow="2"
     inkscape:pageopacity="0.0"
     inkscape:pagecheckerboard="0"
     inkscape:deskcolor="#d1d1d1"
     inkscape:document-units="mm"
     showgrid="false"
     inkscape:zoom="0.40950144"
     inkscape:cx="445.66387"
     inkscape:cy="606.83547"
     inkscape:window-width="1920"
     inkscape:window-height="1008"
     inkscape:window-x="0"
     inkscape:window-y="0"
     inkscape:window-maximized="1"
     inkscape:current-layer="layer1" />
  <defs
     id="defs2">
    <filter
       style="color-interpolation-filters:sRGB;"
       inkscape:label="Drop Shadow"
       id="filter1698"
       x="-0.18680097"
       y="-0.1601579"
       width="1.3802805"
       height="1.3260418">
      <feFlood
         flood-opacity="0.498039"
         flood-color="rgb(0,0,0)"
         result="flood"
         id="feFlood1688" />
      <feComposite
         in="flood"
         in2="SourceGraphic"
         operator="in"
         result="composite1"
         id="feComposite1690" />
      <feGaussianBlur
         in="composite1"
         stdDeviation="11.6543"
         result="blur"
         id="feGaussianBlur1692" />
      <feOffset
         dx="1"
         dy="1"
         result="offset"
         id="feOffset1694" />
      <feComposite
         in="SourceGraphic"
         in2="offset"
         operator="over"
         result="composite2"
         id="feComposite1696" />
    </filter>
  </defs>
  <g
     inkscape:label="Ebene 1"
     inkscape:groupmode="layer"
     id="layer1">
    <rect
       style="fill:#333333;fill-opacity:1;stroke-width:0.252246"
       id="rect1650"
       width="300"
       height="300"
       x="0"
       y="0" />
    <radialGradient
       id="notoFaceInClouds0"
       cx="65.129"
       cy="68.094"
       r="53.237"
       gradientTransform="matrix(2.5253222,0,0,-2.5253222,-13.005216,320.35667)"
       gradientUnits="userSpaceOnUse">
      <stop
         offset=".5"
         stop-color="#FDE030"
         id="stop1960" />
      <stop
         offset=".919"
         stop-color="#F7C02B"
         id="stop1962" />
      <stop
         offset="1"
         stop-color="#F4A223"
         id="stop1964" />
    </radialGradient>
    <g
       id="g2158"
       transform="matrix(1.7290308,0,0,1.7290308,-163.80664,-211.28104)">
      <path
         fill="#fcc11a"
         d="m 144.35519,192.76045 c -7.74658,9.94902 -7.61638,27.64457 2.28925,36.40015 11.24009,9.94902 27.04785,9.85134 36.99687,0.69435 11.92362,-10.96887 11.24013,-29.23946 0.6944,-39.57906 -10.59999,-10.40468 -29.54328,-10.94719 -39.98052,2.48456"
         id="path2132"
         style="stroke-width:1.08495" />
      <path
         fill="#fee269"
         d="m 156.78873,189.34284 c -3.05955,-1.3562 -6.41204,2.33263 -7.87674,4.86057 -1.46469,2.52794 -2.82089,7.48619 0.29279,8.74471 3.11379,1.25856 5.34879,-0.8788 7.58382,-4.56762 2.235,-3.68887 3.49352,-7.47533 0,-9.03766"
         id="path2134"
         style="stroke-width:1.08495" />
      <path
         fill="#ffa722"
         d="m 164.76314,175.4663 c -0.73774,1.38871 -0.48822,2.452 0.97648,2.81002 1.47552,0.34733 10.65423,1.84442 11.42453,1.8878 1.1175,0.0652 1.54064,-0.7703 1.39958,-1.7576 -0.14106,-0.97648 -2.38688,-14.72282 -2.59302,-15.99221 -0.20626,-1.25856 -1.54064,-2.52794 -2.81002,-0.84624 -1.24769,1.70335 -7.84422,12.84581 -8.39755,13.89823 m 23.7713,9.53674 c -1.44296,0.4448 -1.39958,1.33446 -0.62928,2.45196 0.77034,1.1175 6.09744,9.25466 6.59653,9.81882 0.49908,0.56421 1.3345,0.70523 2.02885,-0.14106 0.6944,-0.84628 9.4608,-13.1171 10.10091,-13.8874 1.05242,-1.25856 0.42314,-2.59302 -1.19344,-2.16992 -1.23683,0.32559 -15.99221,3.65631 -16.90357,3.92756 m -54.69243,37.31151 c 0.97644,-1.61658 2.24583,-1.19348 3.15719,0.34732 0.62927,1.05238 5.8913,8.13713 6.37952,8.90747 0.48825,0.77029 0.70522,2.24582 -0.84625,2.59301 -1.54064,0.34733 -14.09354,3.64544 -16.05728,3.99264 -1.96378,0.34732 -3.08128,-1.19344 -1.82272,-2.87514 0.73774,-0.97648 8.62534,-12.05382 9.18954,-12.96518 m -2.669,-12.20574 c 1.79016,0.8029 2.63645,0.50995 3.01616,-0.7703 0.48826,-1.68166 1.96378,-9.39568 2.02886,-11.15332 0.0435,-1.13919 -0.4231,-2.24583 -2.16988,-1.96374 -1.75764,0.28212 -14.37562,2.02885 -15.9922,2.59301 -1.87697,0.65098 -1.73591,2.71239 -0.48822,3.36336 1.47552,0.78117 12.34676,7.36683 13.60528,7.93099 m 21.80756,-29.4456 c 1.009,-0.80286 0.70523,-1.96374 -0.20626,-2.59302 -0.91136,-0.62928 -12.17318,-8.77727 -13.60532,-9.88394 -1.25856,-0.97644 -2.81002,-0.62924 -2.38688,1.61658 0.30385,1.60576 3.89496,15.71013 4.13366,16.68656 0.28212,1.11754 1.1175,1.6817 2.1048,0.97648 0.9873,-0.70522 8.90746,-5.96725 9.95988,-6.80266"
         id="path2136"
         style="stroke-width:1.08495" />
      <path
         fill="#e2ebee"
         d="m 230.71739,231.74279 c 0,0 1.5732,-30.86691 -23.41328,-36.88841 -24.98644,-6.02149 -32.26645,18.21638 -32.26645,18.21638 0,0 -8.33243,-1.94209 -16.05732,4.48085 -6.06488,5.04502 -6.92199,12.61798 -6.92199,12.61798 0,0 -7.97441,-1.21513 -14.61432,5.22947 -4.80632,4.6653 -4.3398,10.65424 -4.3398,10.65424 l 9.67776,8.50601 98.35094,-2.65814 5.17526,-5.55493 c 0,0 0.82455,-6.16255 -4.92569,-10.7953 -5.75024,-4.64356 -10.66511,-3.80815 -10.66511,-3.80815"
         id="path2138"
         style="stroke-width:1.08495" />
      <path
         fill="#b9ced3"
         d="m 156.40901,243.73149 c 0,0 3.9167,4.42661 16.3394,4.13366 12.42267,-0.29278 15.6884,-3.54776 15.6884,-3.54776 0,0 5.44646,5.71768 21.18911,4.50255 15.74268,-1.21518 20.26692,-4.53511 20.26692,-4.53511 0,0 3.84071,2.7449 8.70133,2.82089 4.84974,0.0759 7.71402,-0.77034 7.71402,-0.77034 0,0 -0.50995,3.86244 -2.20248,6.33613 -1.69253,2.4737 -4.51342,4.36149 -8.97254,4.32897 -4.47003,-0.0328 -18.05362,0.0869 -31.84335,0.0652 -13.78977,-0.0205 -53.19521,0.20626 -59.02144,-0.0435 -4.43743,-0.18453 -7.65977,-2.79924 -9.14611,-5.01254 -2.37606,-3.53694 -1.98548,-7.26919 -1.98548,-7.26919 0,0 4.46999,3.50442 10.50231,3.24403 8.24567,-0.34732 12.76991,-4.25303 12.76991,-4.25303"
         id="path2140"
         style="stroke-width:1.08495" />
    </g>
  </g>
</svg>
