<svg version="1.1" viewBox="0 0 256 256" xmlns="http://www.w3.org/2000/svg">
 <title>Logo FreshRSS</title>
 <rect width="256" height="256" fill="#fff" stroke-width="2.68712"/>
 <g transform="matrix(.79652424 0 0 .79652424 26.044897 26.044897)">
  <circle cx="128" cy="128" r="33" fill="#0062be"/>
  <g fill="none" stroke="#0062be" stroke-width="24">
   <g stroke-opacity=".3">
    <path d="m12 128a116 116 0 1 1 116 116"/>
    <path d="m54 128a74 74 0 1 1 74 74"/>
   </g>
   <path d="m128 12a116 116 0 0 1 116 116"/>
   <path d="m128 54a74 74 0 0 1 74 74"/>
  </g>
 </g>
</svg>
