<svg version="1.1" viewBox="0 0 256 256" xmlns="http://www.w3.org/2000/svg" xmlns:xlink="http://www.w3.org/1999/xlink">
 <defs>
  <linearGradient id="linearGradient932" x2="256" y1="128" y2="128" gradientUnits="userSpaceOnUse">
   <stop stop-color="#252f4a" offset="0"/>
   <stop stop-color="#46547b" offset="1"/>
  </linearGradient>
 </defs>
 <rect width="256" height="256" fill="url(#linearGradient932)" stroke-width="27.8124"/>
 <g transform="matrix(3.2420273,0,0,3.2420273,83.593422,39.961689)" fill="#fff">
  <path d="m27.25 30.506-15.896 23.186a0.84088361 0.84088361 0 1 1-1.385-0.954l15.896-23.185a0.84060008 0.84060008 0 1 1 1.385 0.953zm-2.09-4.132-15.531 22.708a0.84088361 0.84088361 0 0 1-1.385-0.954l15.532-22.708a0.84088361 0.84088361 0 0 1 1.385 0.954zm-4.722-24.798-18.008 26.319h16.895l-1.136 1.68h-17.826a0.84 0.84 0 0 1-0.227-1.158l18.87-27.795a0.84 0.84 0 0 1 1.159-0.227c0.398 0.253 0.52 0.78 0.273 1.181z"/>
  <path d="m22.118 6.617-11.878 17.373h11.763l-1.158 1.68h-13.783l1.136-1.68 12.535-18.304a0.84 0.84 0 0 1 1.385 0.931z"/>
 </g>
</svg>
