<?xml version="1.0" encoding="UTF-8" standalone="no"?>
<!-- Created with Inkscape (http://www.inkscape.org/) -->

<svg
   width="300mm"
   height="300mm"
   viewBox="0 0 300 300"
   version="1.1"
   id="svg5"
   inkscape:version="1.2.2 (1:1.2.2+202212051552+b0a8486541)"
   sodipodi:docname="icon.svg"
   inkscape:export-filename="casa-compat.png"
   inkscape:export-xdpi="96"
   inkscape:export-ydpi="96"
   xmlns:inkscape="http://www.inkscape.org/namespaces/inkscape"
   xmlns:sodipodi="http://sodipodi.sourceforge.net/DTD/sodipodi-0.dtd"
   xmlns="http://www.w3.org/2000/svg"
   xmlns:svg="http://www.w3.org/2000/svg">
  <sodipodi:namedview
     id="namedview7"
     pagecolor="#ffffff"
     bordercolor="#000000"
     borderopacity="0.25"
     inkscape:showpageshadow="2"
     inkscape:pageopacity="0.0"
     inkscape:pagecheckerboard="0"
     inkscape:deskcolor="#d1d1d1"
     inkscape:document-units="mm"
     showgrid="false"
     inkscape:zoom="0.40950144"
     inkscape:cx="445.66387"
     inkscape:cy="606.83547"
     inkscape:window-width="1920"
     inkscape:window-height="1008"
     inkscape:window-x="0"
     inkscape:window-y="0"
     inkscape:window-maximized="1"
     inkscape:current-layer="layer1" />
  <defs
     id="defs2">
    <filter
       style="color-interpolation-filters:sRGB;"
       inkscape:label="Drop Shadow"
       id="filter1698"
       x="-0.18680097"
       y="-0.1601579"
       width="1.3802805"
       height="1.3260418">
      <feFlood
         flood-opacity="0.498039"
         flood-color="rgb(0,0,0)"
         result="flood"
         id="feFlood1688" />
      <feComposite
         in="flood"
         in2="SourceGraphic"
         operator="in"
         result="composite1"
         id="feComposite1690" />
      <feGaussianBlur
         in="composite1"
         stdDeviation="11.6543"
         result="blur"
         id="feGaussianBlur1692" />
      <feOffset
         dx="1"
         dy="1"
         result="offset"
         id="feOffset1694" />
      <feComposite
         in="SourceGraphic"
         in2="offset"
         operator="over"
         result="composite2"
         id="feComposite1696" />
    </filter>
  </defs>
  <g
     inkscape:label="Ebene 1"
     inkscape:groupmode="layer"
     id="layer1">
    <rect
       style="fill:#800000;fill-opacity:1;stroke-width:0.252246"
       id="rect1650"
       width="300"
       height="300"
       x="0"
       y="0" />
    <radialGradient
       id="notoFaceInClouds0"
       cx="65.129"
       cy="68.094"
       r="53.237"
       gradientTransform="matrix(2.5253222,0,0,-2.5253222,-13.005216,320.35667)"
       gradientUnits="userSpaceOnUse">
      <stop
         offset=".5"
         stop-color="#FDE030"
         id="stop1960" />
      <stop
         offset=".919"
         stop-color="#F7C02B"
         id="stop1962" />
      <stop
         offset="1"
         stop-color="#F4A223"
         id="stop1964" />
    </radialGradient>
    <path
       fill="currentColor"
       d="m 201.76,230.97621 31.05616,-31.05616 -31.05616,-31.05616 -7.24611,7.24651 18.63369,18.63369 h -42.44373 v 10.35193 h 42.18472 l -18.37468,18.63368 z m 0,20.70384 q -21.48048,0 -36.61516,-15.14484 -15.13466,-15.14523 -15.14483,-36.61516 0,-21.48049 15.14483,-36.61515 15.14524,-15.13468 36.61516,-15.14524 21.48049,0 36.62573,15.14524 15.14523,15.14483 15.13466,36.61515 0,21.48048 -15.14483,36.62533 -15.14524,15.14523 -36.61556,15.13467 m -80.22837,0 -4.14068,-33.12631 q -3.36483,-1.29506 -6.33566,-3.10659 -2.96966,-1.81153 -5.8282,-3.88129 l -30.797151,12.94009 -28.468357,-49.1722 26.656847,-20.18661 q -0.27388,-1.81151 -0.27388,-3.49002 v -6.98748 q 0,-1.68633 0.27388,-3.49786 L 45.961971,120.98519 74.430349,71.812968 105.22748,84.753058 q 2.84837,-2.06975 5.8282,-3.88128 2.98139,-1.81153 6.33565,-3.1066 l 4.14069,-33.1263 h 56.93635 l 4.14069,33.1263 q 3.36482,1.29507 6.34584,3.1066 2.98138,1.81153 5.81801,3.88128 l 30.79753,-12.94009 28.46798,49.172222 -19.15133,14.493 q -7.76413,-3.8813 -16.04552,-5.95262 -8.28177,-2.06975 -17.08118,-2.06975 -5.17595,0 -9.9587,0.91163 -4.78236,0.91163 -9.70987,2.19496 -4.91734,-8.54039 -13.32314,-13.58176 -8.40579,-5.04176 -18.25066,-5.05193 -15.01062,0 -25.62157,10.61093 -10.61092,10.61094 -10.61092,25.62118 0,9.83468 4.7933,18.11606 4.79292,8.28177 13.06413,13.19911 -1.55331,5.17597 -2.19496,10.74513 -0.64166,5.56958 -0.6534,10.99398 0.27388,14.493 5.82818,27.56771 5.56957,13.07428 15.91092,22.8984 z"
       id="path2202"
       style="fill:#ffffff;stroke-width:10.352" />
  </g>
</svg>
