<svg xmlns="http://www.w3.org/2000/svg" viewBox="-3730 6286 275.286 66.057">
  <defs>
    <style>
      .cls-1 {
        fill: #00aeef;
      }
    </style>
  </defs>
  <rect id="Rectangle_1586" data-name="Rectangle 1586" class="cls-1" width="275.286" height="66.057" rx="10" transform="translate(-3730 6286)"/>
</svg>
