<svg xmlns="http://www.w3.org/2000/svg" viewBox="-5878 8920.918 29.028 29.501">
  <defs>
    <style>
      .cls-1 {
        fill: #fff;
      }
    </style>
  </defs>
  <g id="Group_7171" data-name="Group 7171" transform="translate(-5878 8920.918)">
    <path id="Path_4096" data-name="Path 4096" class="cls-1" d="M-.007,14.78C-.262,7.186,6.364.152,14.009.05a14.735,14.735,0,0,1,10.6,3.619c-1.223,1.325-2.446,2.65-3.721,3.874-2.6-1.58-5.708-2.752-8.715-1.682a9.326,9.326,0,1,0,6.32,17.533,8.174,8.174,0,0,0,4.791-5.606c-2.8-.051-5.657,0-8.461-.1V12.639H28.943c.306,4.128-.306,8.512-3.007,11.824-3.67,4.689-10.4,6.116-15.9,4.23A14.63,14.63,0,0,1-.007,14.78Z" transform="translate(0.014 0.001)"/>
  </g>
</svg>
