<svg xmlns="http://www.w3.org/2000/svg" viewBox="-4017 5136 606.286 66.057">
  <defs>
    <style>
      .cls-1 {
        fill: #fff;
        stroke: #000;
      }

      .cls-2 {
        stroke: none;
      }

      .cls-3 {
        fill: none;
      }
    </style>
  </defs>
  <g id="Rectangle_1569" data-name="Rectangle 1569" class="cls-1" transform="translate(-4017 5136)">
    <rect class="cls-2" width="606.286" height="66.057" rx="10"/>
    <rect class="cls-3" x="0.5" y="0.5" width="605.286" height="65.057" rx="9.5"/>
  </g>
</svg>
