<svg xmlns="http://www.w3.org/2000/svg" viewBox="-5326 3583 121 121">
  <defs>
    <style>
      .cls-1, .cls-2, .cls-4 {
        fill: none;
      }

      .cls-1 {
        stroke: #bfd730;
      }

      .cls-1, .cls-2 {
        stroke-width: 4px;
      }

      .cls-2 {
        stroke: #010101;
        stroke-miterlimit: 10;
      }

      .cls-3 {
        stroke: none;
      }
    </style>
  </defs>
  <g id="Group_7175" data-name="Group 7175" transform="translate(-6162 2416)">
    <g id="Ellipse_247" data-name="Ellipse 247" class="cls-1" transform="translate(836 1167)">
      <circle class="cls-3" cx="60.5" cy="60.5" r="60.5"/>
      <circle class="cls-4" cx="60.5" cy="60.5" r="58.5"/>
    </g>
    <path id="Path_5043" data-name="Path 5043" class="cls-2" d="M88.361,93.888l5.66-45.643A2.008,2.008,0,0,0,91.844,46L45.4,50.857a2.022,2.022,0,0,0-1.234,3.411l8.563,8.563a1.972,1.972,0,0,1,0,2.83L38.074,80.318a1.972,1.972,0,0,0,0,2.83l18.069,18.069a1.972,1.972,0,0,0,2.83,0L73.631,86.559a1.972,1.972,0,0,1,2.83,0l8.49,8.49A2.01,2.01,0,0,0,88.361,93.888Z" transform="translate(898.412 1130.645) rotate(45)"/>
  </g>
</svg>
