<svg xmlns="http://www.w3.org/2000/svg" viewBox="-4017 4939.562 66.252 66.252">
  <defs>
    <style>
      .cls-1 {
        fill: #fff;
        stroke: #bfd730;
        stroke-width: 3px;
      }

      .cls-2 {
        stroke: none;
      }

      .cls-3 {
        fill: none;
      }
    </style>
  </defs>
  <g id="Ellipse_236" data-name="Ellipse 236" class="cls-1" transform="translate(-4017 4939.562)">
    <circle class="cls-2" cx="33.126" cy="33.126" r="33.126"/>
    <circle class="cls-3" cx="33.126" cy="33.126" r="31.626"/>
  </g>
</svg>
