<svg width="20" height="20" viewBox="0 0 20 20" fill="none" xmlns="http://www.w3.org/2000/svg">
<path d="M10 7.5V11.6667" stroke="#ED2224" stroke-linecap="round" stroke-linejoin="round"/>
<path d="M9.99986 17.8419H4.94986C2.0582 17.8419 0.849863 15.7752 2.24986 13.2502L4.84986 8.56689L7.29986 4.16689C8.7832 1.49189 11.2165 1.49189 12.6999 4.16689L15.1499 8.57523L17.7499 13.2586C19.1499 15.7836 17.9332 17.8502 15.0499 17.8502H9.99986V17.8419Z" stroke="#ED2224" stroke-linecap="round" stroke-linejoin="round"/>
<path d="M9.99512 14.1665H10.0026" stroke="#ED2224" stroke-linecap="round" stroke-linejoin="round"/>
</svg>
