# Exported from Wings 3D 2.2.5
mtllib Morphine Auto Injector.mtl
o Injector
#144 vertices, 138 faces
v 0.25000000 0.49849067 -1.0408341e-17
v 0.17677670 0.49849067 0.17677670
v -3.1529449e-17 0.49849067 0.25000000
v -0.17677670 0.49849067 0.17677670
v -0.25000000 0.49849067 2.0207829e-17
v -0.17677670 0.49849067 -0.17677670
v -9.2761789e-17 0.49849067 -0.25000000
v 0.17677670 0.49849067 -0.17677670
v 0.23150000 -1.5093333e-3 -9.7344008e-18
v 0.16369522 -1.5093333e-3 0.16369522
v -3.4331051e-17 -1.5093333e-3 0.23150000
v -0.16369522 -1.5093333e-3 0.16369522
v -0.23150000 -1.5093333e-3 1.8616173e-17
v -0.16369522 -1.5093333e-3 -0.16369522
v -9.1032198e-17 -1.5093333e-3 -0.23150000
v 0.16369522 -1.5093333e-3 -0.16369522
v 0.16723075 0.50450362 0.16723075
v 0.23650000 0.50450362 -9.8462904e-18
v 0.16723075 0.50450362 -0.16723075
v -9.1499655e-17 0.50450362 -0.23650000
v -0.16723075 0.50450362 -0.16723075
v -0.23650000 0.50450362 1.9116606e-17
v -0.16723075 0.50450362 0.16723075
v -3.3573861e-17 0.50450362 0.23650000
v 0.16723075 0.57279360 0.16723075
v 0.23650000 0.57279360 -9.8462904e-18
v 0.16723075 0.57279360 -0.16723075
v -9.1499655e-17 0.57279360 -0.23650000
v -0.16723075 0.57279360 -0.16723075
v -0.23650000 0.57279360 1.9116606e-17
v -0.16723075 0.57279360 0.16723075
v -3.3573861e-17 0.57279360 0.23650000
v 0.14448737 0.64237207 0.14448737
v 0.20433600 0.64237207 -8.0353502e-18
v 0.14448737 0.64237207 -0.14448737
v -8.9436287e-17 0.64237207 -0.20433600
v -0.14448737 0.64237207 -0.14448737
v -0.20433600 0.64237207 1.6988593e-17
v -0.14448737 0.64237207 0.14448737
v -3.9388401e-17 0.64237207 0.20433600
v 0.17655894 0.64608292 0.17655894
v 0.24969205 0.64608292 -1.1192620e-17
v 0.17655894 0.64608292 -0.17655894
v -9.1908905e-17 0.64608292 -0.24969205
v -0.17655894 0.64608292 -0.17655894
v -0.24969205 0.64608292 1.9385838e-17
v -0.17655894 0.64608292 0.17655894
v -3.0751990e-17 0.64608292 0.24969205
v 0.18220883 0.72029996 0.18220883
v 0.25768220 0.72029996 -1.1883850e-17
v 0.18220883 0.72029996 -0.18220883
v -9.2296477e-17 0.72029996 -0.25768220
v -0.18220883 0.72029996 -0.18220883
v -0.25768220 0.72029996 1.9673118e-17
v -0.18220883 0.72029996 0.18220883
v -2.9182541e-17 0.72029996 0.25768220
v 0.18220883 2.84560759 0.18220883
v 0.25768220 2.84560759 -1.1883850e-17
v 0.18220883 2.84560759 -0.18220883
v -9.2296477e-17 2.84560759 -0.25768220
v -0.18220883 2.84560759 -0.18220883
v -0.25768220 2.84560759 1.9673118e-17
v -0.18220883 2.84560759 0.18220883
v -2.9182541e-17 2.84560759 0.25768220
v 0.17382722 2.92272732 0.17382722
v 0.24582882 2.92272732 -1.1018004e-17
v 0.17382722 2.92272732 -0.17382722
v -9.1402325e-17 2.92272732 -0.24582882
v -0.17382722 2.92272732 -0.17382722
v -0.24582882 2.92272732 1.9087343e-17
v -0.17382722 2.92272732 0.17382722
v -3.1191630e-17 2.92272732 0.24582882
v 0.19781538 2.93187712 0.19781538
v 0.27975319 2.93187712 -1.3017272e-17
v 0.19781538 2.93187712 -0.19781538
v -9.3003821e-17 2.93187712 -0.27975319
v -0.19781538 2.93187712 -0.19781538
v -0.27975319 2.93187712 2.1242613e-17
v -0.19781538 2.93187712 0.19781538
v -2.4484050e-17 2.93187712 0.27975319
v 0.19781538 3.00376840 0.19781538
v 0.27975319 3.00376840 -1.3017272e-17
v 0.19781538 3.00376840 -0.19781538
v -9.3003821e-17 3.00376840 -0.27975319
v -0.19781538 3.00376840 -0.19781538
v -0.27975319 3.00376840 2.1242613e-17
v -0.19781538 3.00376840 0.19781538
v -2.4484050e-17 3.00376840 0.27975319
v 0.17170375 3.00376840 0.17170375
v 0.24282577 3.00376840 -5.2515491e-18
v 0.17170375 3.00376840 -0.17170375
v -9.0785043e-17 3.00376840 -0.24282577
v -0.17170375 3.00376840 -0.17170375
v -0.24282577 3.00376840 1.4586279e-17
v -0.17170375 3.00376840 0.17170375
v -2.4484050e-17 3.00376840 0.24282577
v 0.17170375 3.06912410 0.17170375
v 0.24282577 3.06912410 -5.2515491e-18
v 0.17170375 3.06912410 -0.17170375
v -9.0785043e-17 3.06912410 -0.24282577
v -0.17170375 3.06912410 -0.17170375
v -0.24282577 3.06912410 1.4586279e-17
v -0.17170375 3.06912410 0.17170375
v -2.4484050e-17 3.06912410 0.24282577
v 0.19574228 3.07304545 0.19574228
v 0.27682138 3.07304545 -7.4439337e-18
v 0.19574228 3.07304545 -0.19574228
v -9.1351885e-17 3.07304545 -0.27682138
v -0.19574228 3.07304545 -0.19574228
v -0.27682138 3.07304545 1.5171190e-17
v -0.19574228 3.07304545 0.19574228
v -1.5768753e-17 3.07304545 0.27682138
v 0.19574228 3.63024207 0.19574228
v 0.27682138 3.63024207 -7.4439337e-18
v 0.19574228 3.63024207 -0.19574228
v -9.1351885e-17 3.63024207 -0.27682138
v -0.19574228 3.63024207 -0.19574228
v -0.27682138 3.63024207 1.5171190e-17
v -0.19574228 3.63024207 0.19574228
v -1.5768753e-17 3.63024207 0.27682138
v 0.16755539 3.67337683 0.16755539
v 0.23695910 3.67337683 -5.3728065e-18
v 0.16755539 3.67337683 -0.16755539
v -9.0187622e-17 3.67337683 -0.23695910
v -0.16755539 3.67337683 -0.16755539
v -0.23695910 3.67337683 1.3985739e-17
v -0.16755539 3.67337683 0.16755539
v -2.5488461e-17 3.67337683 0.23695910
v 0.15012963 3.67337683 0.15012963
v 0.21231536 3.67337683 -2.4113755e-18
v 0.15012963 3.67337683 -0.15012963
v -8.9447264e-17 3.67337683 -0.21231536
v -0.15012963 3.67337683 -0.15012963
v -0.21231536 3.67337683 1.1024308e-17
v -0.15012963 3.67337683 0.15012963
v -2.8449892e-17 3.67337683 0.21231536
v 0.15012963 3.56901870 0.15012963
v 0.21231536 3.56901870 -2.4113755e-18
v 0.15012963 3.56901870 -0.15012963
v -8.9447264e-17 3.56901870 -0.21231536
v -0.15012963 3.56901870 -0.15012963
v -0.21231536 3.56901870 1.1024308e-17
v -0.15012963 3.56901870 0.15012963
v -2.8449892e-17 3.56901870 0.21231536
vn 0.92334022 -3.4163588e-2 -0.38246004
vn 0.92334022 -3.4163588e-2 0.38246004
vn 0.40121243 0.90078314 0.16618763
vn 0.40121243 0.90078314 -0.16618763
vn 0.38246004 -3.4163588e-2 0.92334022
vn 0.92334022 -3.4163588e-2 0.38246004
vn 0.40121243 0.90078314 0.16618763
vn 0.16618763 0.90078314 0.40121243
vn -0.38246004 -3.4163588e-2 0.92334022
vn 0.38246004 -3.4163588e-2 0.92334022
vn -0.16618763 0.90078314 0.40121243
vn 0.16618763 0.90078314 0.40121243
vn -0.92334022 -3.4163588e-2 0.38246004
vn -0.38246004 -3.4163588e-2 0.92334022
vn -0.40121243 0.90078314 0.16618763
vn -0.16618763 0.90078314 0.40121243
vn -0.92334022 -3.4163588e-2 -0.38246004
vn -0.92334022 -3.4163588e-2 0.38246004
vn -0.40121243 0.90078314 -0.16618763
vn -0.40121243 0.90078314 0.16618763
vn -0.38246004 -3.4163588e-2 -0.92334022
vn -0.92334022 -3.4163588e-2 -0.38246004
vn -0.16618763 0.90078314 -0.40121243
vn -0.40121243 0.90078314 -0.16618763
vn 0.38246004 -3.4163588e-2 -0.92334022
vn -0.38246004 -3.4163588e-2 -0.92334022
vn 0.16618763 0.90078314 -0.40121243
vn -0.16618763 0.90078314 -0.40121243
vn 0.92334022 -3.4163588e-2 -0.38246004
vn 0.38246004 -3.4163588e-2 -0.92334022
vn 0.40121243 0.90078314 -0.16618763
vn 0.16618763 0.90078314 -0.40121243
vn 0.0000000e+0 -1.00000000 -1.7881473e-19
vn 0.92334022 -3.4163588e-2 -0.38246004
vn 0.92334022 -3.4163588e-2 0.38246004
vn 0.0000000e+0 -1.00000000 -1.7881473e-19
vn 0.38246004 -3.4163588e-2 0.92334022
vn 0.92334022 -3.4163588e-2 0.38246004
vn 0.0000000e+0 -1.00000000 -1.7881473e-19
vn -0.38246004 -3.4163588e-2 0.92334022
vn 0.38246004 -3.4163588e-2 0.92334022
vn 0.0000000e+0 -1.00000000 -1.7881473e-19
vn -0.92334022 -3.4163588e-2 0.38246004
vn -0.38246004 -3.4163588e-2 0.92334022
vn 0.0000000e+0 -1.00000000 -1.7881473e-19
vn -0.92334022 -3.4163588e-2 -0.38246004
vn -0.92334022 -3.4163588e-2 0.38246004
vn 0.0000000e+0 -1.00000000 -1.7881473e-19
vn -0.38246004 -3.4163588e-2 -0.92334022
vn -0.92334022 -3.4163588e-2 -0.38246004
vn 0.0000000e+0 -1.00000000 -1.7881473e-19
vn 0.38246004 -3.4163588e-2 -0.92334022
vn -0.38246004 -3.4163588e-2 -0.92334022
vn 0.0000000e+0 -1.00000000 -1.7881473e-19
vn 0.92334022 -3.4163588e-2 -0.38246004
vn 0.38246004 -3.4163588e-2 -0.92334022
vn 0.40121243 0.90078314 0.16618763
vn 0.16618763 0.90078314 0.40121243
vn 0.92387953 0.0000000e+0 0.38268343
vn 0.38268343 0.0000000e+0 0.92387953
vn 0.40121243 0.90078314 0.16618763
vn 0.40121243 0.90078314 -0.16618763
vn 0.92387953 0.0000000e+0 0.38268343
vn 0.92387953 0.0000000e+0 -0.38268343
vn 0.40121243 0.90078314 -0.16618763
vn 0.16618763 0.90078314 -0.40121243
vn 0.92387953 0.0000000e+0 -0.38268343
vn 0.38268343 0.0000000e+0 -0.92387953
vn 0.16618763 0.90078314 -0.40121243
vn -0.16618763 0.90078314 -0.40121243
vn 0.38268343 0.0000000e+0 -0.92387953
vn -0.38268343 0.0000000e+0 -0.92387953
vn -0.16618763 0.90078314 -0.40121243
vn -0.40121243 0.90078314 -0.16618763
vn -0.38268343 0.0000000e+0 -0.92387953
vn -0.92387953 0.0000000e+0 -0.38268343
vn -0.40121243 0.90078314 -0.16618763
vn -0.40121243 0.90078314 0.16618763
vn -0.92387953 0.0000000e+0 -0.38268343
vn -0.92387953 0.0000000e+0 0.38268343
vn -0.40121243 0.90078314 0.16618763
vn -0.16618763 0.90078314 0.40121243
vn -0.92387953 0.0000000e+0 0.38268343
vn -0.38268343 0.0000000e+0 0.92387953
vn -0.16618763 0.90078314 0.40121243
vn 0.16618763 0.90078314 0.40121243
vn -0.38268343 0.0000000e+0 0.92387953
vn 0.38268343 0.0000000e+0 0.92387953
vn 0.92387953 0.0000000e+0 0.38268343
vn 0.38268343 0.0000000e+0 0.92387953
vn 0.84963702 0.39276122 0.35193118
vn 0.35193118 0.39276122 0.84963702
vn 0.92387953 0.0000000e+0 0.38268343
vn 0.92387953 0.0000000e+0 -0.38268343
vn 0.84963702 0.39276122 0.35193118
vn 0.84963702 0.39276122 -0.35193118
vn 0.92387953 0.0000000e+0 -0.38268343
vn 0.38268343 0.0000000e+0 -0.92387953
vn 0.84963702 0.39276122 -0.35193118
vn 0.35193118 0.39276122 -0.84963702
vn 0.38268343 0.0000000e+0 -0.92387953
vn -0.38268343 0.0000000e+0 -0.92387953
vn 0.35193118 0.39276122 -0.84963702
vn -0.35193118 0.39276122 -0.84963702
vn -0.38268343 0.0000000e+0 -0.92387953
vn -0.92387953 0.0000000e+0 -0.38268343
vn -0.35193118 0.39276122 -0.84963702
vn -0.84963702 0.39276122 -0.35193118
vn -0.92387953 0.0000000e+0 -0.38268343
vn -0.92387953 0.0000000e+0 0.38268343
vn -0.84963702 0.39276122 -0.35193118
vn -0.84963702 0.39276122 0.35193118
vn -0.92387953 0.0000000e+0 0.38268343
vn -0.38268343 0.0000000e+0 0.92387953
vn -0.84963702 0.39276122 0.35193118
vn -0.35193118 0.39276122 0.84963702
vn -0.38268343 0.0000000e+0 0.92387953
vn 0.38268343 0.0000000e+0 0.92387953
vn -0.35193118 0.39276122 0.84963702
vn 0.35193118 0.39276122 0.84963702
vn 0.84963702 0.39276122 0.35193118
vn 0.35193118 0.39276122 0.84963702
vn 8.1497080e-2 -0.99610174 3.3757196e-2
vn 3.3757196e-2 -0.99610174 8.1497080e-2
vn 0.84963702 0.39276122 0.35193118
vn 0.84963702 0.39276122 -0.35193118
vn 8.1497080e-2 -0.99610174 3.3757196e-2
vn 8.1497080e-2 -0.99610174 -3.3757196e-2
vn 0.84963702 0.39276122 -0.35193118
vn 0.35193118 0.39276122 -0.84963702
vn 8.1497080e-2 -0.99610174 -3.3757196e-2
vn 3.3757196e-2 -0.99610174 -8.1497080e-2
vn 0.35193118 0.39276122 -0.84963702
vn -0.35193118 0.39276122 -0.84963702
vn 3.3757196e-2 -0.99610174 -8.1497080e-2
vn -3.3757196e-2 -0.99610174 -8.1497080e-2
vn -0.35193118 0.39276122 -0.84963702
vn -0.84963702 0.39276122 -0.35193118
vn -3.3757196e-2 -0.99610174 -8.1497080e-2
vn -8.1497080e-2 -0.99610174 -3.3757196e-2
vn -0.84963702 0.39276122 -0.35193118
vn -0.84963702 0.39276122 0.35193118
vn -8.1497080e-2 -0.99610174 -3.3757196e-2
vn -8.1497080e-2 -0.99610174 3.3757196e-2
vn -0.84963702 0.39276122 0.35193118
vn -0.35193118 0.39276122 0.84963702
vn -8.1497080e-2 -0.99610174 3.3757196e-2
vn -3.3757196e-2 -0.99610174 8.1497080e-2
vn -0.35193118 0.39276122 0.84963702
vn 0.35193118 0.39276122 0.84963702
vn -3.3757196e-2 -0.99610174 8.1497080e-2
vn 3.3757196e-2 -0.99610174 8.1497080e-2
vn 8.1497080e-2 -0.99610174 3.3757196e-2
vn 3.3757196e-2 -0.99610174 8.1497080e-2
vn 0.91934314 -9.8975736e-2 0.38080440
vn 0.38080440 -9.8975736e-2 0.91934314
vn 8.1497080e-2 -0.99610174 3.3757196e-2
vn 8.1497080e-2 -0.99610174 -3.3757196e-2
vn 0.91934314 -9.8975736e-2 0.38080440
vn 0.91934314 -9.8975736e-2 -0.38080440
vn 8.1497080e-2 -0.99610174 -3.3757196e-2
vn 3.3757196e-2 -0.99610174 -8.1497080e-2
vn 0.91934314 -9.8975736e-2 -0.38080440
vn 0.38080440 -9.8975736e-2 -0.91934314
vn 3.3757196e-2 -0.99610174 -8.1497080e-2
vn -3.3757196e-2 -0.99610174 -8.1497080e-2
vn 0.38080440 -9.8975736e-2 -0.91934314
vn -0.38080440 -9.8975736e-2 -0.91934314
vn -3.3757196e-2 -0.99610174 -8.1497080e-2
vn -8.1497080e-2 -0.99610174 -3.3757196e-2
vn -0.38080440 -9.8975736e-2 -0.91934314
vn -0.91934314 -9.8975736e-2 -0.38080440
vn -8.1497080e-2 -0.99610174 -3.3757196e-2
vn -8.1497080e-2 -0.99610174 3.3757196e-2
vn -0.91934314 -9.8975736e-2 -0.38080440
vn -0.91934314 -9.8975736e-2 0.38080440
vn -8.1497080e-2 -0.99610174 3.3757196e-2
vn -3.3757196e-2 -0.99610174 8.1497080e-2
vn -0.91934314 -9.8975736e-2 0.38080440
vn -0.38080440 -9.8975736e-2 0.91934314
vn -3.3757196e-2 -0.99610174 8.1497080e-2
vn 3.3757196e-2 -0.99610174 8.1497080e-2
vn -0.38080440 -9.8975736e-2 0.91934314
vn 0.38080440 -9.8975736e-2 0.91934314
vn 0.91934314 -9.8975736e-2 0.38080440
vn 0.38080440 -9.8975736e-2 0.91934314
vn 0.92387953 0.0000000e+0 0.38268343
vn 0.38268343 0.0000000e+0 0.92387953
vn 0.91934314 -9.8975736e-2 0.38080440
vn 0.91934314 -9.8975736e-2 -0.38080440
vn 0.92387953 0.0000000e+0 0.38268343
vn 0.92387953 0.0000000e+0 -0.38268343
vn 0.91934314 -9.8975736e-2 -0.38080440
vn 0.38080440 -9.8975736e-2 -0.91934314
vn 0.92387953 0.0000000e+0 -0.38268343
vn 0.38268343 0.0000000e+0 -0.92387953
vn 0.38080440 -9.8975736e-2 -0.91934314
vn -0.38080440 -9.8975736e-2 -0.91934314
vn 0.38268343 0.0000000e+0 -0.92387953
vn -0.38268343 0.0000000e+0 -0.92387953
vn -0.38080440 -9.8975736e-2 -0.91934314
vn -0.91934314 -9.8975736e-2 -0.38080440
vn -0.38268343 0.0000000e+0 -0.92387953
vn -0.92387953 0.0000000e+0 -0.38268343
vn -0.91934314 -9.8975736e-2 -0.38080440
vn -0.91934314 -9.8975736e-2 0.38080440
vn -0.92387953 0.0000000e+0 -0.38268343
vn -0.92387953 0.0000000e+0 0.38268343
vn -0.91934314 -9.8975736e-2 0.38080440
vn -0.38080440 -9.8975736e-2 0.91934314
vn -0.92387953 0.0000000e+0 0.38268343
vn -0.38268343 0.0000000e+0 0.92387953
vn -0.38080440 -9.8975736e-2 0.91934314
vn 0.38080440 -9.8975736e-2 0.91934314
vn -0.38268343 0.0000000e+0 0.92387953
vn 0.38268343 0.0000000e+0 0.92387953
vn 0.92387953 0.0000000e+0 0.38268343
vn 0.38268343 0.0000000e+0 0.92387953
vn 0.91470336 0.14059083 0.37888254
vn 0.37888254 0.14059083 0.91470336
vn 0.92387953 0.0000000e+0 0.38268343
vn 0.92387953 0.0000000e+0 -0.38268343
vn 0.91470336 0.14059083 0.37888254
vn 0.91470336 0.14059083 -0.37888254
vn 0.92387953 0.0000000e+0 -0.38268343
vn 0.38268343 0.0000000e+0 -0.92387953
vn 0.91470336 0.14059083 -0.37888254
vn 0.37888254 0.14059083 -0.91470336
vn 0.38268343 0.0000000e+0 -0.92387953
vn -0.38268343 0.0000000e+0 -0.92387953
vn 0.37888254 0.14059083 -0.91470336
vn -0.37888254 0.14059083 -0.91470336
vn -0.38268343 0.0000000e+0 -0.92387953
vn -0.92387953 0.0000000e+0 -0.38268343
vn -0.37888254 0.14059083 -0.91470336
vn -0.91470336 0.14059083 -0.37888254
vn -0.92387953 0.0000000e+0 -0.38268343
vn -0.92387953 0.0000000e+0 0.38268343
vn -0.91470336 0.14059083 -0.37888254
vn -0.91470336 0.14059083 0.37888254
vn -0.92387953 0.0000000e+0 0.38268343
vn -0.38268343 0.0000000e+0 0.92387953
vn -0.91470336 0.14059083 0.37888254
vn -0.37888254 0.14059083 0.91470336
vn -0.38268343 0.0000000e+0 0.92387953
vn 0.38268343 0.0000000e+0 0.92387953
vn -0.37888254 0.14059083 0.91470336
vn 0.37888254 0.14059083 0.91470336
vn 0.91470336 0.14059083 0.37888254
vn 0.37888254 0.14059083 0.91470336
vn 0.25890457 -0.95993105 0.10724178
vn 0.10724178 -0.95993105 0.25890457
vn 0.91470336 0.14059083 0.37888254
vn 0.91470336 0.14059083 -0.37888254
vn 0.25890457 -0.95993105 0.10724178
vn 0.25890457 -0.95993105 -0.10724178
vn 0.91470336 0.14059083 -0.37888254
vn 0.37888254 0.14059083 -0.91470336
vn 0.25890457 -0.95993105 -0.10724178
vn 0.10724178 -0.95993105 -0.25890457
vn 0.37888254 0.14059083 -0.91470336
vn -0.37888254 0.14059083 -0.91470336
vn 0.10724178 -0.95993105 -0.25890457
vn -0.10724178 -0.95993105 -0.25890457
vn -0.37888254 0.14059083 -0.91470336
vn -0.91470336 0.14059083 -0.37888254
vn -0.10724178 -0.95993105 -0.25890457
vn -0.25890457 -0.95993105 -0.10724178
vn -0.91470336 0.14059083 -0.37888254
vn -0.91470336 0.14059083 0.37888254
vn -0.25890457 -0.95993105 -0.10724178
vn -0.25890457 -0.95993105 0.10724178
vn -0.91470336 0.14059083 0.37888254
vn -0.37888254 0.14059083 0.91470336
vn -0.25890457 -0.95993105 0.10724178
vn -0.10724178 -0.95993105 0.25890457
vn -0.37888254 0.14059083 0.91470336
vn 0.37888254 0.14059083 0.91470336
vn -0.10724178 -0.95993105 0.25890457
vn 0.10724178 -0.95993105 0.25890457
vn 0.25890457 -0.95993105 0.10724178
vn 0.10724178 -0.95993105 0.25890457
vn 0.92387953 0.0000000e+0 0.38268343
vn 0.38268343 0.0000000e+0 0.92387953
vn 0.25890457 -0.95993105 0.10724178
vn 0.25890457 -0.95993105 -0.10724178
vn 0.92387953 0.0000000e+0 0.38268343
vn 0.92387953 0.0000000e+0 -0.38268343
vn 0.25890457 -0.95993105 -0.10724178
vn 0.10724178 -0.95993105 -0.25890457
vn 0.92387953 0.0000000e+0 -0.38268343
vn 0.38268343 0.0000000e+0 -0.92387953
vn 0.10724178 -0.95993105 -0.25890457
vn -0.10724178 -0.95993105 -0.25890457
vn 0.38268343 0.0000000e+0 -0.92387953
vn -0.38268343 0.0000000e+0 -0.92387953
vn -0.10724178 -0.95993105 -0.25890457
vn -0.25890457 -0.95993105 -0.10724178
vn -0.38268343 0.0000000e+0 -0.92387953
vn -0.92387953 0.0000000e+0 -0.38268343
vn -0.25890457 -0.95993105 -0.10724178
vn -0.25890457 -0.95993105 0.10724178
vn -0.92387953 0.0000000e+0 -0.38268343
vn -0.92387953 0.0000000e+0 0.38268343
vn -0.25890457 -0.95993105 0.10724178
vn -0.10724178 -0.95993105 0.25890457
vn -0.92387953 0.0000000e+0 0.38268343
vn -0.38268343 0.0000000e+0 0.92387953
vn -0.10724178 -0.95993105 0.25890457
vn 0.10724178 -0.95993105 0.25890457
vn -0.38268343 0.0000000e+0 0.92387953
vn 0.38268343 0.0000000e+0 0.92387953
vn 0.92387953 0.0000000e+0 0.38268343
vn 0.38268343 0.0000000e+0 0.92387953
vn 0.0000000e+0 1.00000000 0.0000000e+0
vn 0.0000000e+0 1.00000000 0.0000000e+0
vn 0.92387953 0.0000000e+0 0.38268343
vn 0.92387953 0.0000000e+0 -0.38268343
vn 0.0000000e+0 1.00000000 0.0000000e+0
vn 0.0000000e+0 1.00000000 0.0000000e+0
vn 0.92387953 0.0000000e+0 -0.38268343
vn 0.38268343 0.0000000e+0 -0.92387953
vn 0.0000000e+0 1.00000000 0.0000000e+0
vn 0.0000000e+0 1.00000000 0.0000000e+0
vn 0.38268343 0.0000000e+0 -0.92387953
vn -0.38268343 0.0000000e+0 -0.92387953
vn 0.0000000e+0 1.00000000 0.0000000e+0
vn 0.0000000e+0 1.00000000 0.0000000e+0
vn -0.38268343 0.0000000e+0 -0.92387953
vn -0.92387953 0.0000000e+0 -0.38268343
vn 0.0000000e+0 1.00000000 0.0000000e+0
vn 0.0000000e+0 1.00000000 0.0000000e+0
vn -0.92387953 0.0000000e+0 -0.38268343
vn -0.92387953 0.0000000e+0 0.38268343
vn 0.0000000e+0 1.00000000 0.0000000e+0
vn 0.0000000e+0 1.00000000 0.0000000e+0
vn -0.92387953 0.0000000e+0 0.38268343
vn -0.38268343 0.0000000e+0 0.92387953
vn 0.0000000e+0 1.00000000 0.0000000e+0
vn 0.0000000e+0 1.00000000 0.0000000e+0
vn -0.38268343 0.0000000e+0 0.92387953
vn 0.38268343 0.0000000e+0 0.92387953
vn 0.0000000e+0 1.00000000 0.0000000e+0
vn 0.0000000e+0 1.00000000 0.0000000e+0
vn 0.0000000e+0 1.00000000 0.0000000e+0
vn 0.0000000e+0 1.00000000 0.0000000e+0
vn 0.92387953 0.0000000e+0 0.38268343
vn 0.38268343 0.0000000e+0 0.92387953
vn 0.0000000e+0 1.00000000 0.0000000e+0
vn 0.0000000e+0 1.00000000 0.0000000e+0
vn 0.92387953 0.0000000e+0 0.38268343
vn 0.92387953 0.0000000e+0 -0.38268343
vn 0.0000000e+0 1.00000000 0.0000000e+0
vn 0.0000000e+0 1.00000000 0.0000000e+0
vn 0.92387953 0.0000000e+0 -0.38268343
vn 0.38268343 0.0000000e+0 -0.92387953
vn 0.0000000e+0 1.00000000 0.0000000e+0
vn 0.0000000e+0 1.00000000 0.0000000e+0
vn 0.38268343 0.0000000e+0 -0.92387953
vn -0.38268343 0.0000000e+0 -0.92387953
vn 0.0000000e+0 1.00000000 0.0000000e+0
vn 0.0000000e+0 1.00000000 0.0000000e+0
vn -0.38268343 0.0000000e+0 -0.92387953
vn -0.92387953 0.0000000e+0 -0.38268343
vn 0.0000000e+0 1.00000000 0.0000000e+0
vn 0.0000000e+0 1.00000000 0.0000000e+0
vn -0.92387953 0.0000000e+0 -0.38268343
vn -0.92387953 0.0000000e+0 0.38268343
vn 0.0000000e+0 1.00000000 0.0000000e+0
vn 0.0000000e+0 1.00000000 0.0000000e+0
vn -0.92387953 0.0000000e+0 0.38268343
vn -0.38268343 0.0000000e+0 0.92387953
vn 0.0000000e+0 1.00000000 0.0000000e+0
vn 0.0000000e+0 1.00000000 0.0000000e+0
vn -0.38268343 0.0000000e+0 0.92387953
vn 0.38268343 0.0000000e+0 0.92387953
vn 0.92387953 0.0000000e+0 0.38268343
vn 0.38268343 0.0000000e+0 0.92387953
vn 0.11445984 -0.99229590 4.7410820e-2
vn 4.7410820e-2 -0.99229590 0.11445984
vn 0.92387953 0.0000000e+0 0.38268343
vn 0.92387953 0.0000000e+0 -0.38268343
vn 0.11445984 -0.99229590 4.7410820e-2
vn 0.11445984 -0.99229590 -4.7410820e-2
vn 0.92387953 0.0000000e+0 -0.38268343
vn 0.38268343 0.0000000e+0 -0.92387953
vn 0.11445984 -0.99229590 -4.7410820e-2
vn 4.7410820e-2 -0.99229590 -0.11445984
vn 0.38268343 0.0000000e+0 -0.92387953
vn -0.38268343 0.0000000e+0 -0.92387953
vn 4.7410820e-2 -0.99229590 -0.11445984
vn -4.7410820e-2 -0.99229590 -0.11445984
vn -0.38268343 0.0000000e+0 -0.92387953
vn -0.92387953 0.0000000e+0 -0.38268343
vn -4.7410820e-2 -0.99229590 -0.11445984
vn -0.11445984 -0.99229590 -4.7410820e-2
vn -0.92387953 0.0000000e+0 -0.38268343
vn -0.92387953 0.0000000e+0 0.38268343
vn -0.11445984 -0.99229590 -4.7410820e-2
vn -0.11445984 -0.99229590 4.7410820e-2
vn -0.92387953 0.0000000e+0 0.38268343
vn -0.38268343 0.0000000e+0 0.92387953
vn -0.11445984 -0.99229590 4.7410820e-2
vn -4.7410820e-2 -0.99229590 0.11445984
vn -0.38268343 0.0000000e+0 0.92387953
vn 0.38268343 0.0000000e+0 0.92387953
vn -4.7410820e-2 -0.99229590 0.11445984
vn 4.7410820e-2 -0.99229590 0.11445984
vn 0.11445984 -0.99229590 4.7410820e-2
vn 4.7410820e-2 -0.99229590 0.11445984
vn 0.92387953 0.0000000e+0 0.38268343
vn 0.38268343 0.0000000e+0 0.92387953
vn 0.11445984 -0.99229590 4.7410820e-2
vn 0.11445984 -0.99229590 -4.7410820e-2
vn 0.92387953 0.0000000e+0 0.38268343
vn 0.92387953 0.0000000e+0 -0.38268343
vn 0.11445984 -0.99229590 -4.7410820e-2
vn 4.7410820e-2 -0.99229590 -0.11445984
vn 0.92387953 0.0000000e+0 -0.38268343
vn 0.38268343 0.0000000e+0 -0.92387953
vn 4.7410820e-2 -0.99229590 -0.11445984
vn -4.7410820e-2 -0.99229590 -0.11445984
vn 0.38268343 0.0000000e+0 -0.92387953
vn -0.38268343 0.0000000e+0 -0.92387953
vn -4.7410820e-2 -0.99229590 -0.11445984
vn -0.11445984 -0.99229590 -4.7410820e-2
vn -0.38268343 0.0000000e+0 -0.92387953
vn -0.92387953 0.0000000e+0 -0.38268343
vn -0.11445984 -0.99229590 -4.7410820e-2
vn -0.11445984 -0.99229590 4.7410820e-2
vn -0.92387953 0.0000000e+0 -0.38268343
vn -0.92387953 0.0000000e+0 0.38268343
vn -0.11445984 -0.99229590 4.7410820e-2
vn -4.7410820e-2 -0.99229590 0.11445984
vn -0.92387953 0.0000000e+0 0.38268343
vn -0.38268343 0.0000000e+0 0.92387953
vn -4.7410820e-2 -0.99229590 0.11445984
vn 4.7410820e-2 -0.99229590 0.11445984
vn -0.38268343 0.0000000e+0 0.92387953
vn 0.38268343 0.0000000e+0 0.92387953
vn 0.92387953 0.0000000e+0 0.38268343
vn 0.38268343 0.0000000e+0 0.92387953
vn 0.70262508 0.64931930 0.29103684
vn 0.29103684 0.64931930 0.70262508
vn 0.92387953 0.0000000e+0 0.38268343
vn 0.92387953 0.0000000e+0 -0.38268343
vn 0.70262508 0.64931930 0.29103684
vn 0.70262508 0.64931930 -0.29103684
vn 0.92387953 0.0000000e+0 -0.38268343
vn 0.38268343 0.0000000e+0 -0.92387953
vn 0.70262508 0.64931930 -0.29103684
vn 0.29103684 0.64931930 -0.70262508
vn 0.38268343 0.0000000e+0 -0.92387953
vn -0.38268343 0.0000000e+0 -0.92387953
vn 0.29103684 0.64931930 -0.70262508
vn -0.29103684 0.64931930 -0.70262508
vn -0.38268343 0.0000000e+0 -0.92387953
vn -0.92387953 0.0000000e+0 -0.38268343
vn -0.29103684 0.64931930 -0.70262508
vn -0.70262508 0.64931930 -0.29103684
vn -0.92387953 0.0000000e+0 -0.38268343
vn -0.92387953 0.0000000e+0 0.38268343
vn -0.70262508 0.64931930 -0.29103684
vn -0.70262508 0.64931930 0.29103684
vn -0.92387953 0.0000000e+0 0.38268343
vn -0.38268343 0.0000000e+0 0.92387953
vn -0.70262508 0.64931930 0.29103684
vn -0.29103684 0.64931930 0.70262508
vn -0.38268343 0.0000000e+0 0.92387953
vn 0.38268343 0.0000000e+0 0.92387953
vn -0.29103684 0.64931930 0.70262508
vn 0.29103684 0.64931930 0.70262508
vn 0.70262508 0.64931930 0.29103684
vn 0.29103684 0.64931930 0.70262508
vn 0.0000000e+0 1.00000000 0.0000000e+0
vn 0.0000000e+0 1.00000000 0.0000000e+0
vn 0.70262508 0.64931930 0.29103684
vn 0.70262508 0.64931930 -0.29103684
vn 0.0000000e+0 1.00000000 0.0000000e+0
vn 0.0000000e+0 1.00000000 0.0000000e+0
vn 0.70262508 0.64931930 -0.29103684
vn 0.29103684 0.64931930 -0.70262508
vn 0.0000000e+0 1.00000000 0.0000000e+0
vn 0.0000000e+0 1.00000000 0.0000000e+0
vn 0.29103684 0.64931930 -0.70262508
vn -0.29103684 0.64931930 -0.70262508
vn 0.0000000e+0 1.00000000 0.0000000e+0
vn 0.0000000e+0 1.00000000 0.0000000e+0
vn -0.29103684 0.64931930 -0.70262508
vn -0.70262508 0.64931930 -0.29103684
vn 0.0000000e+0 1.00000000 0.0000000e+0
vn 0.0000000e+0 1.00000000 0.0000000e+0
vn -0.70262508 0.64931930 -0.29103684
vn -0.70262508 0.64931930 0.29103684
vn 0.0000000e+0 1.00000000 0.0000000e+0
vn 0.0000000e+0 1.00000000 0.0000000e+0
vn -0.70262508 0.64931930 0.29103684
vn -0.29103684 0.64931930 0.70262508
vn 0.0000000e+0 1.00000000 0.0000000e+0
vn 0.0000000e+0 1.00000000 0.0000000e+0
vn -0.29103684 0.64931930 0.70262508
vn 0.29103684 0.64931930 0.70262508
vn 0.0000000e+0 1.00000000 0.0000000e+0
vn 0.0000000e+0 1.00000000 0.0000000e+0
vn 0.0000000e+0 1.00000000 0.0000000e+0
vn 0.0000000e+0 1.00000000 0.0000000e+0
vn -0.92387953 0.0000000e+0 -0.38268343
vn -0.38268343 0.0000000e+0 -0.92387953
vn 0.0000000e+0 1.00000000 0.0000000e+0
vn 0.0000000e+0 1.00000000 0.0000000e+0
vn -0.92387953 0.0000000e+0 -0.38268343
vn -0.92387953 0.0000000e+0 0.38268343
vn 0.0000000e+0 1.00000000 0.0000000e+0
vn 0.0000000e+0 1.00000000 0.0000000e+0
vn -0.92387953 0.0000000e+0 0.38268343
vn -0.38268343 0.0000000e+0 0.92387953
vn 0.0000000e+0 1.00000000 0.0000000e+0
vn 0.0000000e+0 1.00000000 0.0000000e+0
vn -0.38268343 0.0000000e+0 0.92387953
vn 0.38268343 0.0000000e+0 0.92387953
vn 0.0000000e+0 1.00000000 0.0000000e+0
vn 0.0000000e+0 1.00000000 0.0000000e+0
vn 0.38268343 0.0000000e+0 0.92387953
vn 0.92387953 0.0000000e+0 0.38268343
vn 0.0000000e+0 1.00000000 0.0000000e+0
vn 0.0000000e+0 1.00000000 0.0000000e+0
vn 0.92387953 0.0000000e+0 0.38268343
vn 0.92387953 0.0000000e+0 -0.38268343
vn 0.0000000e+0 1.00000000 0.0000000e+0
vn 0.0000000e+0 1.00000000 0.0000000e+0
vn 0.92387953 0.0000000e+0 -0.38268343
vn 0.38268343 0.0000000e+0 -0.92387953
vn 0.0000000e+0 1.00000000 0.0000000e+0
vn 0.0000000e+0 1.00000000 0.0000000e+0
vn 0.38268343 0.0000000e+0 -0.92387953
vn -0.38268343 0.0000000e+0 -0.92387953
vn 0.0000000e+0 1.00000000 2.1769198e-16
vn -0.92387953 0.0000000e+0 -0.38268343
vn -0.38268343 0.0000000e+0 -0.92387953
vn 0.0000000e+0 1.00000000 2.1769198e-16
vn -0.92387953 0.0000000e+0 -0.38268343
vn -0.92387953 0.0000000e+0 0.38268343
vn 0.0000000e+0 1.00000000 2.1769198e-16
vn -0.92387953 0.0000000e+0 0.38268343
vn -0.38268343 0.0000000e+0 0.92387953
vn 0.0000000e+0 1.00000000 2.1769198e-16
vn -0.38268343 0.0000000e+0 0.92387953
vn 0.38268343 0.0000000e+0 0.92387953
vn 0.0000000e+0 1.00000000 2.1769198e-16
vn 0.38268343 0.0000000e+0 0.92387953
vn 0.92387953 0.0000000e+0 0.38268343
vn 0.0000000e+0 1.00000000 2.1769198e-16
vn 0.92387953 0.0000000e+0 0.38268343
vn 0.92387953 0.0000000e+0 -0.38268343
vn 0.0000000e+0 1.00000000 2.1769198e-16
vn 0.92387953 0.0000000e+0 -0.38268343
vn 0.38268343 0.0000000e+0 -0.92387953
vn 0.0000000e+0 1.00000000 2.1769198e-16
vn 0.38268343 0.0000000e+0 -0.92387953
vn -0.38268343 0.0000000e+0 -0.92387953
g Injector_Black Plastic
usemtl Black Plastic
s 1
f 18//63 26//93 25//89 17//59
f 21//75 29//105 28//102 20//72
f 23//83 31//113 30//110 22//80
f 25//92 33//122 40//150 32//120
f 27//99 35//129 34//126 26//96
f 30//111 38//141 37//138 29//108
f 37//139 45//169 44//166 36//136
f 39//147 47//177 46//174 38//144
f 66//255 74//285 73//281 65//251
f 69//267 77//297 76//294 68//264
f 72//279 80//309 79//306 71//276
f 73//284 81//314 88//342 80//312
f 75//291 83//321 82//318 74//288
f 79//307 87//337 86//334 78//304
f 90//351 98//381 97//377 89//347
f 93//363 101//393 100//390 92//360
f 96//375 104//405 103//402 95//372
f 97//380 105//410 112//438 104//408
f 100//391 108//421 107//418 99//388
f 103//403 111//433 110//430 102//400
f 107//419 115//449 114//446 106//416
f 110//431 118//461 117//458 109//428
f 112//439 120//469 119//466 111//436
f 114//447 122//477 121//473 113//443
f 117//459 125//489 124//486 116//456
f 119//467 127//497 126//494 118//464
f 138//540 139//543 140//546 141//549 142//552 143//555 144//558 137//537
s 2
f 17//60 25//90 32//118 24//88
f 19//67 27//97 26//94 18//64
f 22//79 30//109 29//106 21//76
f 26//95 34//125 33//121 25//91
f 29//107 37//137 36//134 28//104
f 31//115 39//145 38//142 30//112
f 35//131 43//161 42//158 34//128
f 38//143 46//173 45//170 37//140
f 40//151 48//181 47//178 39//148
f 65//252 73//282 80//310 72//280
f 67//259 75//289 74//286 66//256
f 71//275 79//305 78//302 70//272
f 74//287 82//317 81//313 73//283
f 76//295 84//325 83//322 75//292
f 78//303 86//333 85//330 77//300
f 80//311 88//341 87//338 79//308
f 89//348 97//378 104//406 96//376
f 92//359 100//389 99//386 91//356
f 95//371 103//401 102//398 94//368
f 99//387 107//417 106//414 98//384
f 102//399 110//429 109//426 101//396
f 104//407 112//437 111//434 103//404
f 106//415 114//445 113//441 105//411
f 109//427 117//457 116//454 108//424
f 111//435 119//465 118//462 110//432
f 116//455 124//485 123//482 115//452
f 118//463 126//493 125//490 117//460
f 120//471 128//501 127//498 119//468
f 131//515 139//544 138//542 130//512
f 134//527 142//553 141//551 133//524
f 136//535 144//559 143//557 135//532
s 3
f 20//71 28//101 27//98 19//68
f 32//119 40//149 39//146 31//116
f 34//127 42//157 41//153 33//123
f 36//135 44//165 43//162 35//132
f 68//263 76//293 75//290 67//260
f 70//271 78//301 77//298 69//268
f 77//299 85//329 84//326 76//296
f 91//355 99//385 98//382 90//352
f 94//367 102//397 101//394 93//364
f 98//383 106//413 105//409 97//379
f 101//395 109//425 108//422 100//392
f 108//423 116//453 115//450 107//420
f 113//444 121//474 128//502 120//472
f 115//451 123//481 122//478 114//448
f 130//511 138//541 137//538 129//507
f 132//519 140//547 139//545 131//516
f 135//531 143//556 142//554 134//528
s 4
f 24//87 32//117 31//114 23//84
f 28//103 36//133 35//130 27//100
f 33//124 41//154 48//182 40//152
f 81//316 89//346 96//374 88//344
f 82//319 90//349 89//345 81//315
f 83//323 91//353 90//350 82//320
f 84//327 92//357 91//354 83//324
f 85//331 93//361 92//358 84//328
f 86//335 94//365 93//362 85//332
f 87//339 95//369 94//366 86//336
f 88//343 96//373 95//370 87//340
f 105//412 113//442 120//470 112//440
f 129//508 137//539 144//560 136//536
f 133//523 141//550 140//548 132//520
s 5
f 121//476 129//506 136//534 128//504
f 122//479 130//509 129//505 121//475
f 123//483 131//513 130//510 122//480
f 124//487 132//517 131//514 123//484
f 125//491 133//521 132//518 124//488
f 126//495 134//525 133//522 125//492
f 127//499 135//529 134//526 126//496
f 128//503 136//533 135//530 127//500
g Injector_Dark Green Plastic
usemtl Dark Green Plastic
s 1
f 53//203 61//233 60//230 52//200
f 55//211 63//241 62//238 54//208
s 2
f 51//195 59//225 58//222 50//192
f 54//207 62//237 61//234 53//204
s 3
f 50//191 58//221 57//217 49//187
f 52//199 60//229 59//226 51//196
f 56//215 64//245 63//242 55//212
s 4
f 49//188 57//218 64//246 56//216
g Injector_Red Plastic
usemtl Red Plastic
s 1
f 42//159 50//189 49//185 41//155
f 44//167 52//197 51//194 43//164
f 46//175 54//205 53//202 45//172
f 48//183 56//213 55//210 47//180
f 57//220 65//250 72//278 64//248
f 59//227 67//257 66//254 58//224
f 62//239 70//269 69//266 61//236
s 2
f 41//156 49//186 56//214 48//184
f 45//171 53//201 52//198 44//168
f 47//179 55//209 54//206 46//176
f 58//223 66//253 65//249 57//219
f 61//235 69//265 68//262 60//232
f 64//247 72//277 71//274 63//244
s 3
f 43//163 51//193 50//190 42//160
f 63//243 71//273 70//270 62//240
s 4
f 60//231 68//261 67//258 59//228
g Injector_Yellow Plastic
usemtl Yellow Plastic
s 1
f 1//1 9//34 16//55 8//29
f 2//8 17//58 24//86 3//12
f 4//14 12//44 11//40 3//9
f 6//22 14//50 13//46 5//17
f 7//27 20//69 19//66 8//32
s 2
f 2//6 10//38 9//35 1//2
f 3//11 24//85 23//82 4//16
f 5//18 13//47 12//43 4//13
f 7//26 15//53 14//49 6//21
s 3
f 1//3 18//61 17//57 2//7
f 3//10 11//41 10//37 2//5
f 5//19 22//77 21//74 6//24
f 8//30 16//56 15//52 7//25
s 4
f 4//15 23//81 22//78 5//20
f 6//23 21//73 20//70 7//28
f 8//31 19//65 18//62 1//4
f 10//36 11//39 12//42 13//45 14//48 15//51 16//54 9//33
