# Exported from Wings 3D 2.2.5
mtllib 7.62x54mmR.mtl
o Bullet
#78 vertices, 70 faces
v -2.6186468e-2 0.49890790 -8.5869164e-18
v -1.2919756e-2 0.49892180 2.2978633e-2
v 1.3613670e-2 0.49894958 2.2978633e-2
v 2.6880383e-2 0.49896348 -5.3375071e-18
v 1.3613670e-2 0.49894958 -2.2978633e-2
v -1.2919756e-2 0.49892180 -2.2978633e-2
v -1.0284897e-2 0.54585306 -8.5641985e-18
v -4.9957810e-3 0.54585860 9.1610221e-3
v 5.5824504e-3 0.54586968 9.1610221e-3
v 1.0871566e-2 0.54587522 -7.2687381e-18
v 5.5824504e-3 0.54586968 -9.1610221e-3
v -4.9957810e-3 0.54585860 -9.1610221e-3
v -1.4562777e-2 0.45557852 2.5876839e-2
v -2.9502768e-2 0.45556288 -8.6851359e-18
v -1.4562777e-2 0.45557852 -2.5876839e-2
v 1.5317207e-2 0.45560981 -2.5876839e-2
v 3.0257199e-2 0.45562546 -5.0258913e-18
v 1.5317207e-2 0.45560981 2.5876839e-2
v -1.4480955e-2 0.33837730 2.5876839e-2
v -2.9420946e-2 0.33836165 -8.6851359e-18
v -1.4480955e-2 0.33837730 -2.5876839e-2
v 1.5399029e-2 0.33840859 -2.5876839e-2
v 3.0339021e-2 0.33842423 -5.0258913e-18
v 1.5399029e-2 0.33840859 2.5876839e-2
v -4.3941200e-2 1.1894755e-2 -8.1112367e-18
v -2.1641649e-2 1.1918107e-2 3.8623977e-2
v 2.2957454e-2 1.1964811e-2 3.8623977e-2
v 4.5257005e-2 1.1988163e-2 -2.6494188e-18
v 2.2957454e-2 1.1964811e-2 -3.8623977e-2
v -2.1641649e-2 1.1918107e-2 -3.8623977e-2
v -4.4182710e-2 0.31323287 -8.1112367e-18
v -2.1883159e-2 0.31325622 3.8623977e-2
v 2.2715944e-2 0.31330293 3.8623977e-2
v 4.5015495e-2 0.31332628 -2.6494188e-18
v 2.2715944e-2 0.31330293 -3.8623977e-2
v -2.1883159e-2 0.31325622 -3.8623977e-2
v -3.3781070e-2 0.36273270 -7.6120130e-18
v -1.6699613e-2 0.36275058 2.9585966e-2
v 1.7463299e-2 0.36278636 2.9585966e-2
v 3.4544755e-2 0.36280425 -3.4282605e-18
v 1.7463299e-2 0.36278636 -2.9585966e-2
v -1.6699613e-2 0.36275058 -2.9585966e-2
v -3.3820559e-2 0.41929737 -7.6120130e-18
v -1.6739103e-2 0.41931526 2.9585966e-2
v 1.7423810e-2 0.41935104 2.9585966e-2
v 3.4505266e-2 0.41936892 -3.4282605e-18
v 1.7423810e-2 0.41935104 -2.9585966e-2
v -1.6739103e-2 0.41931526 -2.9585966e-2
v -2.4361589e-2 1.1048422e-2 4.3336102e-2
v -4.9381686e-2 1.1022221e-2 -8.3953533e-18
v -2.4361589e-2 1.1048422e-2 -4.3336102e-2
v 2.5678604e-2 1.1100824e-2 -4.3336102e-2
v 5.0698701e-2 1.1127025e-2 -2.2671937e-18
v 2.5678604e-2 1.1100824e-2 4.3336102e-2
v -2.4353924e-2 6.8507855e-5 4.3336102e-2
v -4.9374020e-2 4.2306862e-5 -8.3953533e-18
v -2.4353924e-2 6.8507855e-5 -4.3336102e-2
v 2.5686270e-2 1.2090984e-4 -4.3336102e-2
v 5.0706366e-2 1.4711084e-4 -2.2671937e-18
v 2.5686270e-2 1.2090984e-4 4.3336102e-2
v -9.3919058e-3 8.4176049e-5 1.7421113e-2
v -1.9449985e-2 7.3643250e-5 -9.3544006e-18
v -9.3919058e-3 8.4176049e-5 -1.7421113e-2
v 1.0724252e-2 1.0524165e-4 -1.7421113e-2
v 2.0782331e-2 1.1577445e-4 -2.2671937e-18
v 1.0724252e-2 1.0524165e-4 1.7421113e-2
v -2.9652684e-2 0.41930174 -7.6120130e-18
v -1.4655165e-2 0.41931744 2.5976478e-2
v 1.5339872e-2 0.41934885 2.5976478e-2
v 3.0337390e-2 0.41936456 -3.1611047e-18
v 1.5339872e-2 0.41934885 -2.5976478e-2
v -1.4655165e-2 0.41931744 -2.5976478e-2
v -2.9379010e-2 2.7292872e-2 -7.6120130e-18
v -1.4381492e-2 2.7308577e-2 2.5976478e-2
v 1.5613546e-2 2.7339988e-2 2.5976478e-2
v 3.0611064e-2 2.7355694e-2 -3.1611047e-18
v 1.5613546e-2 2.7339988e-2 -2.5976478e-2
v -1.4381492e-2 2.7308577e-2 -2.5976478e-2
vn 1.0471974e-3 -0.99999945 9.0601211e-16
vn 1.0471974e-3 -0.99999945 3.3569637e-20
vn 1.0471974e-3 -0.99999945 -9.0594497e-16
vn 1.0471974e-3 -0.99999945 -2.5482215e-15
vn 1.0471974e-3 -0.99999945 3.3569637e-20
vn 1.0471974e-3 -0.99999945 2.5482887e-15
vn -0.83107627 0.28150760 -0.47965165
vn -0.83107627 0.28150760 0.47965165
vn -0.86414795 6.6115400e-2 0.49887581
vn -0.86414795 6.6115400e-2 -0.49887581
vn -2.9578165e-4 0.28245056 0.95928181
vn -0.83107627 0.28150760 0.47965165
vn -0.86414795 6.6115400e-2 0.49887581
vn -6.9869031e-5 6.6719986e-2 0.99777174
vn 0.83044750 0.28339348 0.47963016
vn -2.9578165e-4 0.28245056 0.95928181
vn 0.86404299 6.7324590e-2 0.49889589
vn -6.9869031e-5 6.6719986e-2 0.99777174
vn 0.83044750 0.28339348 -0.47963016
vn 0.83044750 0.28339348 0.47963016
vn 0.86404299 6.7324590e-2 -0.49889589
vn 0.86404299 6.7324590e-2 0.49889589
vn -2.9578165e-4 0.28245056 -0.95928181
vn 0.83044750 0.28339348 -0.47963016
vn -6.9869031e-5 6.6719986e-2 -0.99777174
vn 0.86404299 6.7324590e-2 -0.49889589
vn -0.83107627 0.28150760 -0.47965165
vn -2.9578165e-4 0.28245056 -0.95928181
vn -0.86414795 6.6115400e-2 -0.49887581
vn -6.9869031e-5 6.6719986e-2 -0.99777174
vn -1.0471974e-3 0.99999945 -2.9834707e-15
vn -0.83107627 0.28150760 -0.47965165
vn -0.83107627 0.28150760 0.47965165
vn -1.0471974e-3 0.99999945 -2.9834707e-15
vn -2.9578165e-4 0.28245056 0.95928181
vn -0.83107627 0.28150760 0.47965165
vn -1.0471974e-3 0.99999945 -2.9834707e-15
vn 0.83044750 0.28339348 0.47963016
vn -2.9578165e-4 0.28245056 0.95928181
vn -1.0471974e-3 0.99999945 -2.9834707e-15
vn 0.83044750 0.28339348 -0.47963016
vn 0.83044750 0.28339348 0.47963016
vn -1.0471974e-3 0.99999945 -2.9834707e-15
vn -2.9578165e-4 0.28245056 -0.95928181
vn 0.83044750 0.28339348 -0.47963016
vn -1.0471974e-3 0.99999945 -2.9834707e-15
vn -0.83107627 0.28150760 -0.47965165
vn -2.9578165e-4 0.28245056 -0.95928181
vn -0.86414795 6.6115400e-2 0.49887581
vn -6.9869031e-5 6.6719986e-2 0.99777174
vn -0.86602521 -6.0459975e-4 0.49999998
vn -1.1611266e-16 -8.1061943e-20 1.00000000
vn -0.86414795 6.6115400e-2 0.49887581
vn -0.86414795 6.6115400e-2 -0.49887581
vn -0.86602521 -6.0459975e-4 0.49999998
vn -0.86602521 -6.0459975e-4 -0.49999998
vn -0.86414795 6.6115400e-2 -0.49887581
vn -6.9869031e-5 6.6719986e-2 -0.99777174
vn -0.86602521 -6.0459975e-4 -0.49999998
vn 5.8056331e-16 4.0530971e-19 -1.00000000
vn -6.9869031e-5 6.6719986e-2 -0.99777174
vn 0.86404299 6.7324590e-2 -0.49889589
vn 5.8056331e-16 4.0530971e-19 -1.00000000
vn 0.86602521 6.0459975e-4 -0.49999998
vn 0.86404299 6.7324590e-2 -0.49889589
vn 0.86404299 6.7324590e-2 0.49889589
vn 0.86602521 6.0459975e-4 -0.49999998
vn 0.86602521 6.0459975e-4 0.49999998
vn 0.86404299 6.7324590e-2 0.49889589
vn -6.9869031e-5 6.6719986e-2 0.99777174
vn 0.86602521 6.0459975e-4 0.49999998
vn -1.1611266e-16 -8.1061943e-20 1.00000000
vn 1.0471974e-3 -0.99999945 0.0000000e+0
vn -0.86602521 -6.0459975e-4 0.49999998
vn -1.1611266e-16 -8.1061943e-20 1.00000000
vn 1.0471974e-3 -0.99999945 0.0000000e+0
vn -0.86602521 -6.0459975e-4 0.49999998
vn -0.86602521 -6.0459975e-4 -0.49999998
vn 1.0471974e-3 -0.99999945 0.0000000e+0
vn -0.86602521 -6.0459975e-4 -0.49999998
vn 5.8056331e-16 4.0530971e-19 -1.00000000
vn 1.0471974e-3 -0.99999945 0.0000000e+0
vn 5.8056331e-16 4.0530971e-19 -1.00000000
vn 0.86602521 6.0459975e-4 -0.49999998
vn 1.0471974e-3 -0.99999945 0.0000000e+0
vn 0.86602521 6.0459975e-4 -0.49999998
vn 0.86602521 6.0459975e-4 0.49999998
vn 1.0471974e-3 -0.99999945 0.0000000e+0
vn 0.86602521 6.0459975e-4 0.49999998
vn -1.1611266e-16 -8.1061943e-20 1.00000000
vn -0.86602513 -6.9408264e-4 -0.49999999
vn -0.86602513 -6.9408264e-4 0.49999999
vn -0.15770506 0.98333450 9.0456483e-2
vn -0.15770506 0.98333450 -9.0456483e-2
vn 0.0000000e+0 0.0000000e+0 1.00000000
vn -0.86602513 -6.9408264e-4 0.49999999
vn -0.15770506 0.98333450 9.0456483e-2
vn -1.0299158e-3 0.98349678 0.18092270
vn 0.86602513 6.9408264e-4 0.49999999
vn 0.0000000e+0 0.0000000e+0 1.00000000
vn 0.15566208 0.98365908 9.0466214e-2
vn -1.0299158e-3 0.98349678 0.18092270
vn 0.86602513 6.9408264e-4 -0.49999999
vn 0.86602513 6.9408264e-4 0.49999999
vn 0.15566208 0.98365908 -9.0466214e-2
vn 0.15566208 0.98365908 9.0466214e-2
vn 6.2233432e-16 4.9877473e-19 -1.00000000
vn 0.86602513 6.9408264e-4 -0.49999999
vn -1.0299158e-3 0.98349678 -0.18092270
vn 0.15566208 0.98365908 -9.0466214e-2
vn -0.86602513 -6.9408264e-4 -0.49999999
vn 6.2233432e-16 4.9877473e-19 -1.00000000
vn -0.15770506 0.98333450 -9.0456483e-2
vn -1.0299158e-3 0.98349678 -0.18092270
vn -0.86602513 -6.9408264e-4 -0.49999999
vn -0.86602513 -6.9408264e-4 0.49999999
vn -0.85207722 0.17905115 0.49183849
vn -0.85207722 0.17905115 -0.49183849
vn 0.0000000e+0 0.0000000e+0 1.00000000
vn -0.86602513 -6.9408264e-4 0.49999999
vn -0.85207722 0.17905115 0.49183849
vn -1.8813485e-4 0.17965549 0.98372957
vn 0.86602513 6.9408264e-4 0.49999999
vn 0.0000000e+0 0.0000000e+0 1.00000000
vn -1.8813485e-4 0.17965549 0.98372957
vn 0.85179198 0.18025987 0.49189104
vn 0.86602513 6.9408264e-4 -0.49999999
vn 0.86602513 6.9408264e-4 0.49999999
vn 0.85179198 0.18025987 0.49189104
vn 0.85179198 0.18025987 -0.49189104
vn 6.2233432e-16 4.9877473e-19 -1.00000000
vn 0.86602513 6.9408264e-4 -0.49999999
vn 0.85179198 0.18025987 -0.49189104
vn -1.8813485e-4 0.17965549 -0.98372957
vn -0.86602513 -6.9408264e-4 -0.49999999
vn 6.2233432e-16 4.9877473e-19 -1.00000000
vn -1.8813485e-4 0.17965549 -0.98372957
vn -0.85207722 0.17905115 -0.49183849
vn -0.85207722 0.17905115 0.49183849
vn -0.85207722 0.17905115 -0.49183849
vn -0.86602521 -6.0459975e-4 0.49999998
vn -0.86602521 -6.0459975e-4 -0.49999998
vn -0.85207722 0.17905115 0.49183849
vn -1.8813485e-4 0.17965549 0.98372957
vn -0.86602521 -6.0459975e-4 0.49999998
vn 0.0000000e+0 0.0000000e+0 1.00000000
vn -1.8813485e-4 0.17965549 0.98372957
vn 0.85179198 0.18025987 0.49189104
vn 0.0000000e+0 0.0000000e+0 1.00000000
vn 0.86602521 6.0459975e-4 0.49999998
vn 0.85179198 0.18025987 0.49189104
vn 0.85179198 0.18025987 -0.49189104
vn 0.86602521 6.0459975e-4 0.49999998
vn 0.86602521 6.0459975e-4 -0.49999998
vn 0.85179198 0.18025987 -0.49189104
vn -1.8813485e-4 0.17965549 -0.98372957
vn 0.86602521 6.0459975e-4 -0.49999998
vn 6.0933524e-16 4.2539632e-19 -1.00000000
vn -1.8813485e-4 0.17965549 -0.98372957
vn -0.85207722 0.17905115 -0.49183849
vn 6.0933524e-16 4.2539632e-19 -1.00000000
vn -0.86602521 -6.0459975e-4 -0.49999998
vn -0.86602521 -6.0459975e-4 0.49999998
vn -0.86602521 -6.0459975e-4 -0.49999998
vn -1.0471974e-3 0.99999945 -4.8902989e-15
vn -1.0471974e-3 0.99999945 4.8902989e-15
vn -0.86602521 -6.0459975e-4 0.49999998
vn 0.0000000e+0 0.0000000e+0 1.00000000
vn -1.0471974e-3 0.99999945 -4.8902989e-15
vn -1.0471974e-3 0.99999945 7.6893275e-15
vn 0.0000000e+0 0.0000000e+0 1.00000000
vn 0.86602521 6.0459975e-4 0.49999998
vn -1.0471974e-3 0.99999945 7.6893275e-15
vn -1.0471974e-3 0.99999945 5.8956997e-16
vn 0.86602521 6.0459975e-4 0.49999998
vn 0.86602521 6.0459975e-4 -0.49999998
vn -1.0471974e-3 0.99999945 5.8956997e-16
vn -1.0471974e-3 0.99999945 -5.8956997e-16
vn 0.86602521 6.0459975e-4 -0.49999998
vn 6.0933524e-16 4.2539632e-19 -1.00000000
vn -1.0471974e-3 0.99999945 -5.8956997e-16
vn -1.0471974e-3 0.99999945 -7.6893275e-15
vn 6.0933524e-16 4.2539632e-19 -1.00000000
vn -0.86602521 -6.0459975e-4 -0.49999998
vn -1.0471974e-3 0.99999945 -7.6893275e-15
vn -1.0471974e-3 0.99999945 4.8902989e-15
vn -0.15770506 0.98333450 9.0456483e-2
vn -1.0299158e-3 0.98349678 0.18092270
vn -0.86602521 -6.0459975e-4 0.49999998
vn 0.0000000e+0 0.0000000e+0 1.00000000
vn -0.15770506 0.98333450 9.0456483e-2
vn -0.15770506 0.98333450 -9.0456483e-2
vn -0.86602521 -6.0459975e-4 0.49999998
vn -0.86602521 -6.0459975e-4 -0.49999998
vn -0.15770506 0.98333450 -9.0456483e-2
vn -1.0299158e-3 0.98349678 -0.18092270
vn -0.86602521 -6.0459975e-4 -0.49999998
vn 6.9333154e-16 4.8403681e-19 -1.00000000
vn -1.0299158e-3 0.98349678 -0.18092270
vn 0.15566208 0.98365908 -9.0466214e-2
vn 6.9333154e-16 4.8403681e-19 -1.00000000
vn 0.86602521 6.0459975e-4 -0.49999998
vn 0.15566208 0.98365908 -9.0466214e-2
vn 0.15566208 0.98365908 9.0466214e-2
vn 0.86602521 6.0459975e-4 -0.49999998
vn 0.86602521 6.0459975e-4 0.49999998
vn 0.15566208 0.98365908 9.0466214e-2
vn -1.0299158e-3 0.98349678 0.18092270
vn 0.86602521 6.0459975e-4 0.49999998
vn 0.0000000e+0 0.0000000e+0 1.00000000
vn -0.86602521 -6.0459975e-4 0.49999998
vn 0.0000000e+0 0.0000000e+0 1.00000000
vn 1.0471974e-3 -0.99999945 1.3589678e-15
vn 1.0471974e-3 -0.99999945 1.3589678e-15
vn -0.86602521 -6.0459975e-4 0.49999998
vn -0.86602521 -6.0459975e-4 -0.49999998
vn 1.0471974e-3 -0.99999945 5.9164568e-31
vn 1.0471974e-3 -0.99999945 5.9164568e-31
vn -0.86602521 -6.0459975e-4 -0.49999998
vn 6.9333154e-16 4.8403681e-19 -1.00000000
vn 1.0471974e-3 -0.99999945 -1.3589678e-15
vn 1.0471974e-3 -0.99999945 -1.3589678e-15
vn 6.9333154e-16 4.8403681e-19 -1.00000000
vn 0.86602521 6.0459975e-4 -0.49999998
vn 1.0471974e-3 -0.99999945 -3.8223827e-15
vn 1.0471974e-3 -0.99999945 -3.8223827e-15
vn 0.86602521 6.0459975e-4 -0.49999998
vn 0.86602521 6.0459975e-4 0.49999998
vn 1.0471974e-3 -0.99999945 0.0000000e+0
vn 1.0471974e-3 -0.99999945 0.0000000e+0
vn 0.86602521 6.0459975e-4 0.49999998
vn 0.0000000e+0 0.0000000e+0 1.00000000
vn 1.0471974e-3 -0.99999945 3.8223827e-15
vn 1.0471974e-3 -0.99999945 3.8223827e-15
vn -1.0471974e-3 0.99999945 -4.8902989e-15
vn -1.0471974e-3 0.99999945 4.8902989e-15
vn 0.86602521 6.0459975e-4 -0.49999998
vn 0.86602521 6.0459975e-4 0.49999998
vn -1.0471974e-3 0.99999945 -4.8902989e-15
vn -1.0471974e-3 0.99999945 7.6893275e-15
vn 0.86602521 6.0459975e-4 -0.49999998
vn 0.0000000e+0 0.0000000e+0 -1.00000000
vn -1.0471974e-3 0.99999945 7.6893275e-15
vn -1.0471974e-3 0.99999945 5.8956997e-16
vn 0.0000000e+0 0.0000000e+0 -1.00000000
vn -0.86602521 -6.0459975e-4 -0.49999998
vn -1.0471974e-3 0.99999945 5.8956997e-16
vn -1.0471974e-3 0.99999945 -5.8956997e-16
vn -0.86602521 -6.0459975e-4 -0.49999998
vn -0.86602521 -6.0459975e-4 0.49999998
vn -1.0471974e-3 0.99999945 -5.8956997e-16
vn -1.0471974e-3 0.99999945 -7.6893275e-15
vn -0.86602521 -6.0459975e-4 0.49999998
vn -6.9400369e-16 -4.8450605e-19 1.00000000
vn -1.0471974e-3 0.99999945 -7.6893275e-15
vn -1.0471974e-3 0.99999945 4.8902989e-15
vn -6.9400369e-16 -4.8450605e-19 1.00000000
vn 0.86602521 6.0459975e-4 0.49999998
vn -1.0471974e-3 0.99999945 4.6383028e-17
vn 0.86602521 6.0459975e-4 -0.49999998
vn 0.86602521 6.0459975e-4 0.49999998
vn -1.0471974e-3 0.99999945 4.6383028e-17
vn 0.86602521 6.0459975e-4 -0.49999998
vn 0.0000000e+0 0.0000000e+0 -1.00000000
vn -1.0471974e-3 0.99999945 4.6383028e-17
vn 0.0000000e+0 0.0000000e+0 -1.00000000
vn -0.86602521 -6.0459975e-4 -0.49999998
vn -1.0471974e-3 0.99999945 4.6383028e-17
vn -0.86602521 -6.0459975e-4 -0.49999998
vn -0.86602521 -6.0459975e-4 0.49999998
vn -1.0471974e-3 0.99999945 4.6383028e-17
vn -0.86602521 -6.0459975e-4 0.49999998
vn -6.9400369e-16 -4.8450605e-19 1.00000000
vn -1.0471974e-3 0.99999945 4.6383028e-17
vn -6.9400369e-16 -4.8450605e-19 1.00000000
vn 0.86602521 6.0459975e-4 0.49999998
g Bullet_Brass
usemtl Brass
s 1
f 26//96 32//120 31//116 25//92
f 26//98 49//188 54//208 27//102
f 28//105 53//203 52//200 29//110
f 30//112 36//136 35//131 29//107
f 30//113 51//195 50//192 25//94
f 31//118 37//140 42//160 36//138
f 34//129 40//151 39//148 33//126
f 38//145 44//167 43//163 37//141
f 41//157 47//179 46//176 40//154
f 45//173 69//243 68//240 44//170
f 48//185 72//255 71//252 47//182
f 50//193 56//215 55//211 49//189
f 52//201 58//223 57//220 51//198
f 54//209 60//231 59//228 53//206
f 67//238 73//261 78//276 72//258
f 70//249 76//269 75//267 69//246
s 2
f 25//91 31//115 36//135 30//111
f 25//93 50//191 49//187 26//97
f 27//101 54//207 53//204 28//106
f 29//109 52//199 51//196 30//114
f 33//125 39//147 38//144 32//122
f 35//133 41//155 40//152 34//130
f 40//153 46//175 45//172 39//150
f 42//161 48//183 47//180 41//158
f 43//166 67//236 72//256 48//186
f 49//190 55//212 60//232 54//210
f 51//197 57//219 56//216 50//194
f 53//205 59//227 58//224 52//202
f 69//245 75//266 74//264 68//242
f 71//253 77//272 76//270 70//250
s 3
f 27//100 33//124 32//119 26//95
f 29//108 35//132 34//127 28//103
f 32//121 38//143 37//139 31//117
f 36//137 42//159 41//156 35//134
f 37//142 43//164 48//184 42//162
f 39//149 45//171 44//168 38//146
f 47//181 71//251 70//248 46//178
f 55//214 61//1 66//6 60//234
f 56//217 62//2 61//1 55//213
f 57//221 63//3 62//2 56//218
f 58//225 64//4 63//3 57//222
f 59//229 65//5 64//4 58//226
f 60//233 66//6 65//5 59//230
f 68//241 74//263 73//260 67//237
f 72//257 78//275 77//273 71//254
s 4
f 28//104 34//128 33//123 27//99
f 44//169 68//239 67//235 43//165
f 46//177 70//247 69//244 45//174
f 74//262 75//265 76//268 77//271 78//274 73//259
g Bullet_Bullet
usemtl Bullet
s 1
f 1//7 7//32 12//47 6//27
f 1//9 14//53 13//49 2//13
f 4//20 10//42 9//38 3//15
f 5//25 16//61 15//58 6//30
f 20//76 21//79 22//82 23//85 24//88 19//73
s 2
f 3//16 9//39 8//35 2//11
f 3//17 18//69 17//66 4//22
f 5//24 11//45 10//41 4//19
f 6//29 15//57 14//54 1//10
f 13//52 19//75 24//90 18//72
f 17//67 23//86 22//84 16//64
s 3
f 2//12 8//36 7//33 1//8
f 2//14 13//50 18//70 3//18
f 4//21 17//65 16//62 5//26
f 6//28 12//48 11//44 5//23
f 14//55 20//77 19//74 13//51
f 16//63 22//83 21//81 15//60
f 18//71 24//89 23//87 17//68
s 4
f 8//34 9//37 10//40 11//43 12//46 7//31
f 15//59 21//80 20//78 14//56
g Bullet_Primer
usemtl Primer
s 3
f 62//2 63//3 64//4 65//5 66//6 61//1
