^C:\USERS\NINO\DESKTOP\POSAO\BREAKOUT\BREAKOUT\BREAKOUT\X64\RELEASE\ASSETMANAGER.OBJ|C:\USERS\NINO\DESKTOP\POSAO\BREAKOUT\BREAKOUT\BREAKOUT\X64\RELEASE\BREAKOUT.OBJ|C:\USERS\NINO\DESKTOP\POSAO\BREAKOUT\BREAKOUT\BREAKOUT\X64\RELEASE\BRICKCOMPONENT.OBJ|C:\USERS\NINO\DESKTOP\POSAO\BREAKOUT\BREAKOUT\BREAKOUT\X64\RELEASE\COLLIDERCOMPONENT.OBJ|C:\USERS\NINO\DESKTOP\POSAO\BREAKOUT\BREAKOUT\BREAKOUT\X64\RELEASE\COLLISION.OBJ|C:\USERS\NINO\DESKTOP\POSAO\BREAKOUT\BREAKOUT\BREAKOUT\X64\RELEASE\ECS.OBJ|C:\USERS\NINO\DESKTOP\POSAO\BREAKOUT\BREAKOUT\BREAKOUT\X64\RELEASE\MAIN.OBJ|C:\USERS\NINO\DESKTOP\POSAO\BREAKOUT\BREAKOUT\BREAKOUT\X64\RELEASE\PADDLECOMPONENT.OBJ|C:\USERS\NINO\DESKTOP\POSAO\BREAKOUT\BREAKOUT\BREAKOUT\X64\RELEASE\SOUNDMANAGER.OBJ|C:\USERS\NINO\DESKTOP\POSAO\BREAKOUT\BREAKOUT\BREAKOUT\X64\RELEASE\SPRITECOMPONENT.OBJ|C:\USERS\NINO\DESKTOP\POSAO\BREAKOUT\BREAKOUT\BREAKOUT\X64\RELEASE\TEXTUREMANAGER.OBJ|C:\USERS\NINO\DESKTOP\POSAO\BREAKOUT\BREAKOUT\BREAKOUT\X64\RELEASE\TINYSTR.OBJ|C:\USERS\NINO\DESKTOP\POSAO\BREAKOUT\BREAKOUT\BREAKOUT\X64\RELEASE\TINYXML.OBJ|C:\USERS\NINO\DESKTOP\POSAO\BREAKOUT\BREAKOUT\BREAKOUT\X64\RELEASE\TINYXMLERROR.OBJ|C:\USERS\NINO\DESKTOP\POSAO\BREAKOUT\BREAKOUT\BREAKOUT\X64\RELEASE\TINYXMLPARSER.OBJ|C:\USERS\NINO\DESKTOP\POSAO\BREAKOUT\BREAKOUT\BREAKOUT\X64\RELEASE\TRANSFORMCOMPONENT.OBJ|C:\USERS\NINO\DESKTOP\POSAO\BREAKOUT\BREAKOUT\BREAKOUT\X64\RELEASE\VECTOR2D.OBJ
C:\USERS\NINO\DESKTOP\POSAO\BREAKOUT\BREAKOUT\SDL2\LIB\X64\SDL2.LIB
C:\USERS\NINO\DESKTOP\POSAO\BREAKOUT\BREAKOUT\SDL2\LIB\X64\SDL2MAIN.LIB
C:\USERS\NINO\DESKTOP\POSAO\BREAKOUT\BREAKOUT\SDL2_IMAGE\LIB\X64\SDL2_IMAGE.LIB
C:\USERS\NINO\DESKTOP\POSAO\BREAKOUT\BREAKOUT\SDL2_TTF\LIB\X64\SDL2_TTF.LIB
C:\USERS\NINO\DESKTOP\POSAO\BREAKOUT\BREAKOUT\SDL2_MIXER\LIB\X64\SDL2_MIXER.LIB
C:\PROGRAM FILES (X86)\WINDOWS KITS\10\LIB\10.0.19041.0\UM\X64\KERNEL32.LIB
C:\PROGRAM FILES (X86)\WINDOWS KITS\10\LIB\10.0.19041.0\UM\X64\USER32.LIB
C:\PROGRAM FILES (X86)\WINDOWS KITS\10\LIB\10.0.19041.0\UM\X64\GDI32.LIB
C:\PROGRAM FILES (X86)\WINDOWS KITS\10\LIB\10.0.19041.0\UM\X64\WINSPOOL.LIB
C:\PROGRAM FILES (X86)\WINDOWS KITS\10\LIB\10.0.19041.0\UM\X64\COMDLG32.LIB
C:\PROGRAM FILES (X86)\WINDOWS KITS\10\LIB\10.0.19041.0\UM\X64\ADVAPI32.LIB
C:\PROGRAM FILES (X86)\WINDOWS KITS\10\LIB\10.0.19041.0\UM\X64\SHELL32.LIB
C:\PROGRAM FILES (X86)\WINDOWS KITS\10\LIB\10.0.19041.0\UM\X64\OLE32.LIB
C:\PROGRAM FILES (X86)\WINDOWS KITS\10\LIB\10.0.19041.0\UM\X64\OLEAUT32.LIB
C:\PROGRAM FILES (X86)\WINDOWS KITS\10\LIB\10.0.19041.0\UM\X64\UUID.LIB
C:\PROGRAM FILES (X86)\WINDOWS KITS\10\LIB\10.0.19041.0\UM\X64\ODBC32.LIB
C:\PROGRAM FILES (X86)\WINDOWS KITS\10\LIB\10.0.19041.0\UM\X64\ODBCCP32.LIB
C:\USERS\NINO\DESKTOP\POSAO\BREAKOUT\BREAKOUT\BREAKOUT\X64\RELEASE\BREAKOUT.OBJ
C:\USERS\NINO\DESKTOP\POSAO\BREAKOUT\BREAKOUT\BREAKOUT\X64\RELEASE\ASSETMANAGER.OBJ
C:\USERS\NINO\DESKTOP\POSAO\BREAKOUT\BREAKOUT\BREAKOUT\X64\RELEASE\BRICKCOMPONENT.OBJ
C:\USERS\NINO\DESKTOP\POSAO\BREAKOUT\BREAKOUT\BREAKOUT\X64\RELEASE\COLLIDERCOMPONENT.OBJ
C:\USERS\NINO\DESKTOP\POSAO\BREAKOUT\BREAKOUT\BREAKOUT\X64\RELEASE\COLLISION.OBJ
C:\USERS\NINO\DESKTOP\POSAO\BREAKOUT\BREAKOUT\BREAKOUT\X64\RELEASE\ECS.OBJ
C:\USERS\NINO\DESKTOP\POSAO\BREAKOUT\BREAKOUT\BREAKOUT\X64\RELEASE\MAIN.OBJ
C:\USERS\NINO\DESKTOP\POSAO\BREAKOUT\BREAKOUT\BREAKOUT\X64\RELEASE\PADDLECOMPONENT.OBJ
C:\USERS\NINO\DESKTOP\POSAO\BREAKOUT\BREAKOUT\BREAKOUT\X64\RELEASE\SOUNDMANAGER.OBJ
C:\USERS\NINO\DESKTOP\POSAO\BREAKOUT\BREAKOUT\BREAKOUT\X64\RELEASE\SPRITECOMPONENT.OBJ
C:\USERS\NINO\DESKTOP\POSAO\BREAKOUT\BREAKOUT\BREAKOUT\X64\RELEASE\TEXTUREMANAGER.OBJ
C:\USERS\NINO\DESKTOP\POSAO\BREAKOUT\BREAKOUT\BREAKOUT\X64\RELEASE\TINYSTR.OBJ
C:\USERS\NINO\DESKTOP\POSAO\BREAKOUT\BREAKOUT\BREAKOUT\X64\RELEASE\TINYXML.OBJ
C:\USERS\NINO\DESKTOP\POSAO\BREAKOUT\BREAKOUT\BREAKOUT\X64\RELEASE\TINYXMLERROR.OBJ
C:\USERS\NINO\DESKTOP\POSAO\BREAKOUT\BREAKOUT\BREAKOUT\X64\RELEASE\TINYXMLPARSER.OBJ
C:\USERS\NINO\DESKTOP\POSAO\BREAKOUT\BREAKOUT\BREAKOUT\X64\RELEASE\TRANSFORMCOMPONENT.OBJ
C:\USERS\NINO\DESKTOP\POSAO\BREAKOUT\BREAKOUT\BREAKOUT\X64\RELEASE\VECTOR2D.OBJ
C:\WINDOWS\GLOBALIZATION\SORTING\SORTDEFAULT.NLS
C:\PROGRAM FILES (X86)\MICROSOFT VISUAL STUDIO\2019\COMMUNITY\VC\TOOLS\MSVC\14.28.29910\BIN\HOSTX86\X64\C2.DLL
C:\PROGRAM FILES (X86)\MICROSOFT VISUAL STUDIO\2019\COMMUNITY\VC\TOOLS\MSVC\14.28.29910\LIB\X64\MSVCPRT.LIB
C:\PROGRAM FILES (X86)\MICROSOFT VISUAL STUDIO\2019\COMMUNITY\VC\TOOLS\MSVC\14.28.29910\LIB\X64\MSVCRT.LIB
C:\PROGRAM FILES (X86)\MICROSOFT VISUAL STUDIO\2019\COMMUNITY\VC\TOOLS\MSVC\14.28.29910\LIB\X64\OLDNAMES.LIB
C:\PROGRAM FILES (X86)\MICROSOFT VISUAL STUDIO\2019\COMMUNITY\VC\TOOLS\MSVC\14.28.29910\LIB\X64\VCRUNTIME.LIB
C:\PROGRAM FILES (X86)\WINDOWS KITS\10\LIB\10.0.19041.0\UCRT\X64\UCRT.LIB
C:\PROGRAM FILES (X86)\MICROSOFT VISUAL STUDIO\2019\COMMUNITY\VC\TOOLS\MSVC\14.28.29910\BIN\HOSTX86\X64\1033\LINKUI.DLL
C:\PROGRAM FILES (X86)\MICROSOFT VISUAL STUDIO\2019\COMMUNITY\VC\TOOLS\MSVC\14.28.29910\BIN\HOSTX86\X64\CVTRES.EXE
C:\PROGRAM FILES (X86)\MICROSOFT VISUAL STUDIO\2019\COMMUNITY\VC\TOOLS\MSVC\14.28.29910\BIN\HOSTX86\X64\MSPDBSRV.EXE
C:\WINDOWS\SYSTEM32\TZRES.DLL
C:\PROGRAM FILES (X86)\MICROSOFT VISUAL STUDIO\2019\COMMUNITY\VC\TOOLS\MSVC\14.28.29910\BIN\HOSTX86\X64\VCTIP.EXE
