^C:\USERS\NINO\DESKTOP\POSAO\BREAKOUT\BREAKOUT\BREAKOUT\X64\DEBUG\ASSETMANAGER.OBJ|C:\USERS\NINO\DESKTOP\POSAO\BREAKOUT\BREAKOUT\BREAKOUT\X64\DEBUG\BREAKOUT.OBJ|C:\USERS\NINO\DESKTOP\POSAO\BREAKOUT\BREAKOUT\BREAKOUT\X64\DEBUG\BRICKCOMPONENT.OBJ|C:\USERS\NINO\DESKTOP\POSAO\BREAKOUT\BREAKOUT\BREAKOUT\X64\DEBUG\COLLIDERCOMPONENT.OBJ|C:\USERS\NINO\DESKTOP\POSAO\BREAKOUT\BREAKOUT\BREAKOUT\X64\DEBUG\COLLISION.OBJ|C:\USERS\NINO\DESKTOP\POSAO\BREAKOUT\BREAKOUT\BREAKOUT\X64\DEBUG\ECS.OBJ|C:\USERS\NINO\DESKTOP\POSAO\BREAKOUT\BREAKOUT\BREAKOUT\X64\DEBUG\MAIN.OBJ|C:\USERS\NINO\DESKTOP\POSAO\BREAKOUT\BREAKOUT\BREAKOUT\X64\DEBUG\PADDLECOMPONENT.OBJ|C:\USERS\NINO\DESKTOP\POSAO\BREAKOUT\BREAKOUT\BREAKOUT\X64\DEBUG\SOUNDMANAGER.OBJ|C:\USERS\NINO\DESKTOP\POSAO\BREAKOUT\BREAKOUT\BREAKOUT\X64\DEBUG\SPRITECOMPONENT.OBJ|C:\USERS\NINO\DESKTOP\POSAO\BREAKOUT\BREAKOUT\BREAKOUT\X64\DEBUG\TEXTUREMANAGER.OBJ|C:\USERS\NINO\DESKTOP\POSAO\BREAKOUT\BREAKOUT\BREAKOUT\X64\DEBUG\TINYSTR.OBJ|C:\USERS\NINO\DESKTOP\POSAO\BREAKOUT\BREAKOUT\BREAKOUT\X64\DEBUG\TINYXML.OBJ|C:\USERS\NINO\DESKTOP\POSAO\BREAKOUT\BREAKOUT\BREAKOUT\X64\DEBUG\TINYXMLERROR.OBJ|C:\USERS\NINO\DESKTOP\POSAO\BREAKOUT\BREAKOUT\BREAKOUT\X64\DEBUG\TINYXMLPARSER.OBJ|C:\USERS\NINO\DESKTOP\POSAO\BREAKOUT\BREAKOUT\BREAKOUT\X64\DEBUG\TRANSFORMCOMPONENT.OBJ|C:\USERS\NINO\DESKTOP\POSAO\BREAKOUT\BREAKOUT\BREAKOUT\X64\DEBUG\VECTOR2D.OBJ
C:\USERS\NINO\DESKTOP\POSAO\BREAKOUT\BREAKOUT\X64\DEBUG\BREAKOUT.ILK
C:\USERS\NINO\DESKTOP\POSAO\BREAKOUT\BREAKOUT\X64\DEBUG\BREAKOUT.EXE
C:\USERS\NINO\DESKTOP\POSAO\BREAKOUT\BREAKOUT\X64\DEBUG\BREAKOUT.PDB
