{
    "name": "Todoninja APP",
    "dockerComposeFile": [
        "../infrastructure/docker-compose.yml"
    ],
    "service": "todoninja-app",
    "workspaceFolder": "/app",
    "shutdownAction": "stopCompose",
    "extensions": [
        "octref.vetur",
        "esbenp.prettier-vscode"
    ]
}
