{
  "name": "Todoninja API - APP",
  "dockerComposeFile": [
    "../infrastructure/docker-compose.yml"
  ],
  "service": "todoninja-api",
  "workspaceFolder": "/app",
  "shutdownAction": "stopCompose",
  "extensions": ["esbenp.prettier-vscode"]
}
