Content-Type: text/x-zim-wiki
Wiki-Format: zim 0.6
Creation-Date: 2022-01-08T15:29:05+08:00

====== Syllabus ======
Created Saturday 08 January 2022


[[+Assumptions#assumptions|Assumptions]]
Tier-1
Tier-2
Tier-3

Tier-1+i
