(kicad_sch
	(version 20231120)
	(generator "eeschema")
	(generator_version "8.0")
	(uuid "39fddef4-aadf-48cd-8bc2-d99e63cc0d2e")
	(paper "A4")
	(lib_symbols
		(symbol "Switch:SW_Push"
			(pin_numbers hide)
			(pin_names
				(offset 1.016) hide)
			(exclude_from_sim no)
			(in_bom yes)
			(on_board yes)
			(property "Reference" "SW"
				(at 1.27 2.54 0)
				(effects
					(font
						(size 1.27 1.27)
					)
					(justify left)
				)
			)
			(property "Value" "SW_Push"
				(at 0 -1.524 0)
				(effects
					(font
						(size 1.27 1.27)
					)
				)
			)
			(property "Footprint" ""
				(at 0 5.08 0)
				(effects
					(font
						(size 1.27 1.27)
					)
					(hide yes)
				)
			)
			(property "Datasheet" "~"
				(at 0 5.08 0)
				(effects
					(font
						(size 1.27 1.27)
					)
					(hide yes)
				)
			)
			(property "Description" "Push button switch, generic, two pins"
				(at 0 0 0)
				(effects
					(font
						(size 1.27 1.27)
					)
					(hide yes)
				)
			)
			(property "ki_keywords" "switch normally-open pushbutton push-button"
				(at 0 0 0)
				(effects
					(font
						(size 1.27 1.27)
					)
					(hide yes)
				)
			)
			(symbol "SW_Push_0_1"
				(circle
					(center -2.032 0)
					(radius 0.508)
					(stroke
						(width 0)
						(type default)
					)
					(fill
						(type none)
					)
				)
				(polyline
					(pts
						(xy 0 1.27) (xy 0 3.048)
					)
					(stroke
						(width 0)
						(type default)
					)
					(fill
						(type none)
					)
				)
				(polyline
					(pts
						(xy 2.54 1.27) (xy -2.54 1.27)
					)
					(stroke
						(width 0)
						(type default)
					)
					(fill
						(type none)
					)
				)
				(circle
					(center 2.032 0)
					(radius 0.508)
					(stroke
						(width 0)
						(type default)
					)
					(fill
						(type none)
					)
				)
				(pin passive line
					(at -5.08 0 0)
					(length 2.54)
					(name "1"
						(effects
							(font
								(size 1.27 1.27)
							)
						)
					)
					(number "1"
						(effects
							(font
								(size 1.27 1.27)
							)
						)
					)
				)
				(pin passive line
					(at 5.08 0 180)
					(length 2.54)
					(name "2"
						(effects
							(font
								(size 1.27 1.27)
							)
						)
					)
					(number "2"
						(effects
							(font
								(size 1.27 1.27)
							)
						)
					)
				)
			)
		)
		(symbol "joystick:Joycon-like"
			(exclude_from_sim no)
			(in_bom yes)
			(on_board yes)
			(property "Reference" "U"
				(at -1.27 0 0)
				(effects
					(font
						(size 1.27 1.27)
					)
				)
			)
			(property "Value" ""
				(at 0 0 0)
				(effects
					(font
						(size 1.27 1.27)
					)
				)
			)
			(property "Footprint" "joystick:Adafruit-style-joycon"
				(at 0 0 0)
				(effects
					(font
						(size 1.27 1.27)
					)
					(hide yes)
				)
			)
			(property "Datasheet" "https://www.aliexpress.com/item/1005006278495692.html"
				(at 0 0 0)
				(effects
					(font
						(size 1.27 1.27)
					)
					(hide yes)
				)
			)
			(property "Description" ""
				(at 0 0 0)
				(effects
					(font
						(size 1.27 1.27)
					)
					(hide yes)
				)
			)
			(property "ki_locked" ""
				(at 0 0 0)
				(effects
					(font
						(size 1.27 1.27)
					)
				)
			)
			(symbol "Joycon-like_1_1"
				(rectangle
					(start -0.635 1.905)
					(end 0.635 -1.905)
					(stroke
						(width 0)
						(type default)
					)
					(fill
						(type none)
					)
				)
				(pin input line
					(at 3.175 0 180)
					(length 2.54)
					(name ""
						(effects
							(font
								(size 1.27 1.27)
							)
						)
					)
					(number "AD1"
						(effects
							(font
								(size 1.27 1.27)
							)
						)
					)
				)
				(pin input line
					(at 0 4.445 270)
					(length 2.54)
					(name ""
						(effects
							(font
								(size 1.27 1.27)
							)
						)
					)
					(number "GND"
						(effects
							(font
								(size 1.27 1.27)
							)
						)
					)
				)
				(pin input line
					(at 0 -4.445 90)
					(length 2.54)
					(name ""
						(effects
							(font
								(size 1.27 1.27)
							)
						)
					)
					(number "VCC"
						(effects
							(font
								(size 1.27 1.27)
							)
						)
					)
				)
			)
			(symbol "Joycon-like_2_1"
				(rectangle
					(start -0.635 1.905)
					(end 0.635 -1.905)
					(stroke
						(width 0)
						(type default)
					)
					(fill
						(type none)
					)
				)
				(pin input line
					(at 3.175 0 180)
					(length 2.54)
					(name ""
						(effects
							(font
								(size 1.27 1.27)
							)
						)
					)
					(number "AD2"
						(effects
							(font
								(size 1.27 1.27)
							)
						)
					)
				)
				(pin input line
					(at 0 4.445 270)
					(length 2.54)
					(name ""
						(effects
							(font
								(size 1.27 1.27)
							)
						)
					)
					(number "GND"
						(effects
							(font
								(size 1.27 1.27)
							)
						)
					)
				)
				(pin input line
					(at 0 -4.445 90)
					(length 2.54)
					(name ""
						(effects
							(font
								(size 1.27 1.27)
							)
						)
					)
					(number "VCC"
						(effects
							(font
								(size 1.27 1.27)
							)
						)
					)
				)
			)
			(symbol "Joycon-like_3_1"
				(circle
					(center 0 -1.905)
					(radius 0.635)
					(stroke
						(width 0)
						(type default)
					)
					(fill
						(type outline)
					)
				)
				(polyline
					(pts
						(xy 0 1.905) (xy 1.27 -1.27)
					)
					(stroke
						(width 0)
						(type default)
					)
					(fill
						(type none)
					)
				)
				(circle
					(center 0 1.905)
					(radius 0.635)
					(stroke
						(width 0)
						(type default)
					)
					(fill
						(type outline)
					)
				)
				(pin input line
					(at 0 4.445 270)
					(length 2.54)
					(name ""
						(effects
							(font
								(size 1.27 1.27)
							)
						)
					)
					(number "GND"
						(effects
							(font
								(size 1.27 1.27)
							)
						)
					)
				)
				(pin input line
					(at 0 -4.445 90)
					(length 2.54)
					(name ""
						(effects
							(font
								(size 1.27 1.27)
							)
						)
					)
					(number "SW"
						(effects
							(font
								(size 1.27 1.27)
							)
						)
					)
				)
			)
		)
		(symbol "power:GND"
			(power)
			(pin_names
				(offset 0)
			)
			(exclude_from_sim no)
			(in_bom yes)
			(on_board yes)
			(property "Reference" "#PWR"
				(at 0 -6.35 0)
				(effects
					(font
						(size 1.27 1.27)
					)
					(hide yes)
				)
			)
			(property "Value" "GND"
				(at 0 -3.81 0)
				(effects
					(font
						(size 1.27 1.27)
					)
				)
			)
			(property "Footprint" ""
				(at 0 0 0)
				(effects
					(font
						(size 1.27 1.27)
					)
					(hide yes)
				)
			)
			(property "Datasheet" ""
				(at 0 0 0)
				(effects
					(font
						(size 1.27 1.27)
					)
					(hide yes)
				)
			)
			(property "Description" "Power symbol creates a global label with name \"GND\" , ground"
				(at 0 0 0)
				(effects
					(font
						(size 1.27 1.27)
					)
					(hide yes)
				)
			)
			(property "ki_keywords" "global power"
				(at 0 0 0)
				(effects
					(font
						(size 1.27 1.27)
					)
					(hide yes)
				)
			)
			(symbol "GND_0_1"
				(polyline
					(pts
						(xy 0 0) (xy 0 -1.27) (xy 1.27 -1.27) (xy 0 -2.54) (xy -1.27 -1.27) (xy 0 -1.27)
					)
					(stroke
						(width 0)
						(type default)
					)
					(fill
						(type none)
					)
				)
			)
			(symbol "GND_1_1"
				(pin power_in line
					(at 0 0 270)
					(length 0) hide
					(name "GND"
						(effects
							(font
								(size 1.27 1.27)
							)
						)
					)
					(number "1"
						(effects
							(font
								(size 1.27 1.27)
							)
						)
					)
				)
			)
		)
	)
	(junction
		(at 81.915 170.815)
		(diameter 0)
		(color 0 0 0 0)
		(uuid "2c5ac9a6-e8e9-41da-9e46-bc6f89a45f5d")
	)
	(junction
		(at 81.915 158.75)
		(diameter 0)
		(color 0 0 0 0)
		(uuid "7ec44e55-3937-4025-a232-42f7f3827431")
	)
	(junction
		(at 131.445 160.02)
		(diameter 0)
		(color 0 0 0 0)
		(uuid "8de22b06-e85b-4be3-aa40-41037974aad9")
	)
	(junction
		(at 131.445 172.085)
		(diameter 0)
		(color 0 0 0 0)
		(uuid "f43ac5d6-339d-488a-9d03-41cb8e63daea")
	)
	(wire
		(pts
			(xy 88.9 166.37) (xy 85.09 166.37)
		)
		(stroke
			(width 0)
			(type default)
		)
		(uuid "033cc819-02d6-4b7a-b3ed-f8f7bd49dc83")
	)
	(wire
		(pts
			(xy 116.205 160.02) (xy 131.445 160.02)
		)
		(stroke
			(width 0)
			(type default)
		)
		(uuid "0598dfd6-3a07-418a-a4b2-3418df0e9932")
	)
	(wire
		(pts
			(xy 62.23 153.67) (xy 62.23 155.575)
		)
		(stroke
			(width 0)
			(type default)
		)
		(uuid "0792322b-3d74-41da-9e18-52d1b712e97b")
	)
	(wire
		(pts
			(xy 138.43 167.64) (xy 134.62 167.64)
		)
		(stroke
			(width 0)
			(type default)
		)
		(uuid "126d64a1-27d3-4f0a-8cc8-159aeb8fff0b")
	)
	(wire
		(pts
			(xy 81.915 158.75) (xy 81.915 161.925)
		)
		(stroke
			(width 0)
			(type default)
		)
		(uuid "19681933-f558-4547-af84-f7aa13c0d2be")
	)
	(wire
		(pts
			(xy 104.14 172.085) (xy 104.14 160.02)
		)
		(stroke
			(width 0)
			(type default)
		)
		(uuid "1d0c935f-cab6-405d-a3e0-c67f9d70df69")
	)
	(wire
		(pts
			(xy 138.43 154.94) (xy 111.76 154.94)
		)
		(stroke
			(width 0)
			(type default)
		)
		(uuid "254e8be7-f2ab-4abb-b948-b9886ec09008")
	)
	(wire
		(pts
			(xy 54.61 170.815) (xy 81.915 170.815)
		)
		(stroke
			(width 0)
			(type default)
		)
		(uuid "2f3495e7-817f-49db-9716-6f27aa843e57")
	)
	(wire
		(pts
			(xy 167.64 135.89) (xy 167.64 134.62)
		)
		(stroke
			(width 0)
			(type default)
		)
		(uuid "6f7845f7-f4c4-4052-880b-4c08a1d5ee36")
	)
	(wire
		(pts
			(xy 88.9 153.67) (xy 62.23 153.67)
		)
		(stroke
			(width 0)
			(type default)
		)
		(uuid "7129612f-0f57-4c52-82ff-266f146c9e8f")
	)
	(wire
		(pts
			(xy 81.915 170.815) (xy 88.9 170.815)
		)
		(stroke
			(width 0)
			(type default)
		)
		(uuid "73a540a5-398d-451a-93c5-72085c5a0843")
	)
	(wire
		(pts
			(xy 131.445 160.02) (xy 137.795 160.02)
		)
		(stroke
			(width 0)
			(type default)
		)
		(uuid "7cc4ab38-34ed-4072-be4b-d2e0889c2b55")
	)
	(wire
		(pts
			(xy 54.61 158.75) (xy 57.785 158.75)
		)
		(stroke
			(width 0)
			(type default)
		)
		(uuid "99c48157-7e77-43b7-a27c-f2bcd080f488")
	)
	(wire
		(pts
			(xy 104.14 172.085) (xy 131.445 172.085)
		)
		(stroke
			(width 0)
			(type default)
		)
		(uuid "9b11198d-586d-4717-bb55-2a7f168f7ca1")
	)
	(wire
		(pts
			(xy 54.61 170.815) (xy 54.61 158.75)
		)
		(stroke
			(width 0)
			(type default)
		)
		(uuid "a8a1420a-1c40-4ee3-97bc-61c67ca01472")
	)
	(wire
		(pts
			(xy 131.445 160.02) (xy 131.445 163.195)
		)
		(stroke
			(width 0)
			(type default)
		)
		(uuid "b530e83a-664b-46b6-8291-6da85b099f24")
	)
	(wire
		(pts
			(xy 66.675 158.75) (xy 81.915 158.75)
		)
		(stroke
			(width 0)
			(type default)
		)
		(uuid "b929ecd6-2b03-4943-9d04-42394d5e30c1")
	)
	(wire
		(pts
			(xy 111.76 154.94) (xy 111.76 156.845)
		)
		(stroke
			(width 0)
			(type default)
		)
		(uuid "c6ccea41-eae0-46f0-b511-43e3bffd7b92")
	)
	(wire
		(pts
			(xy 81.915 158.75) (xy 88.9 158.75)
		)
		(stroke
			(width 0)
			(type default)
		)
		(uuid "d0d9785c-2beb-405b-9ab2-8867748c59ba")
	)
	(wire
		(pts
			(xy 131.445 172.085) (xy 138.43 172.085)
		)
		(stroke
			(width 0)
			(type default)
		)
		(uuid "d892eda4-a4e3-460c-b698-47681510c455")
	)
	(wire
		(pts
			(xy 104.14 160.02) (xy 107.315 160.02)
		)
		(stroke
			(width 0)
			(type default)
		)
		(uuid "ec33eae5-7795-47d2-abd3-04ec7626f4cb")
	)
	(hierarchical_label "SW_LD"
		(shape input)
		(at 92.71 124.46 0)
		(fields_autoplaced yes)
		(effects
			(font
				(size 1.27 1.27)
			)
			(justify left)
		)
		(uuid "0c979676-1ab4-467c-ad88-6c69b47164e8")
	)
	(hierarchical_label "JOYR_Y"
		(shape input)
		(at 138.43 167.64 0)
		(fields_autoplaced yes)
		(effects
			(font
				(size 1.27 1.27)
			)
			(justify left)
		)
		(uuid "13fd3634-87cd-4b1e-96f2-e0e011edcd4a")
	)
	(hierarchical_label "SW_LS_OUTER"
		(shape input)
		(at 110.49 58.42 0)
		(fields_autoplaced yes)
		(effects
			(font
				(size 1.27 1.27)
			)
			(justify left)
		)
		(uuid "1742001e-4d7c-4a31-a6d1-a762e1a210a3")
	)
	(hierarchical_label "SW_LU"
		(shape input)
		(at 55.88 124.46 0)
		(fields_autoplaced yes)
		(effects
			(font
				(size 1.27 1.27)
			)
			(justify left)
		)
		(uuid "2d57feba-4249-44ec-953b-09b8bdb24c90")
	)
	(hierarchical_label "SW_RS_INNER"
		(shape input)
		(at 160.02 33.02 0)
		(fields_autoplaced yes)
		(effects
			(font
				(size 1.27 1.27)
			)
			(justify left)
		)
		(uuid "3c54c77d-b78a-4e88-9821-7e7c7083e861")
	)
	(hierarchical_label "SW_RU"
		(shape input)
		(at 63.5 90.17 0)
		(fields_autoplaced yes)
		(effects
			(font
				(size 1.27 1.27)
			)
			(justify left)
		)
		(uuid "3d01b06f-5e6d-4da9-bd83-b42bc57a11cb")
	)
	(hierarchical_label "SW_LL"
		(shape input)
		(at 132.08 124.46 0)
		(fields_autoplaced yes)
		(effects
			(font
				(size 1.27 1.27)
			)
			(justify left)
		)
		(uuid "3eb9dcf2-94a1-446c-ad63-4b0a89d6ed10")
	)
	(hierarchical_label "SW_RR"
		(shape input)
		(at 175.26 90.17 0)
		(fields_autoplaced yes)
		(effects
			(font
				(size 1.27 1.27)
			)
			(justify left)
		)
		(uuid "81b82223-ba7a-4aec-b978-b749c289fe1a")
	)
	(hierarchical_label "LEF_JOY_PRESS"
		(shape input)
		(at 83.82 34.29 0)
		(fields_autoplaced yes)
		(effects
			(font
				(size 1.27 1.27)
			)
			(justify left)
		)
		(uuid "862b7ffb-f79c-46a7-a7ea-10d5fe28a7f9")
	)
	(hierarchical_label "JOYL_Y"
		(shape input)
		(at 88.9 166.37 0)
		(fields_autoplaced yes)
		(effects
			(font
				(size 1.27 1.27)
			)
			(justify left)
		)
		(uuid "8aaf5137-434f-4aae-995f-d613dbdfc62c")
	)
	(hierarchical_label "SW_RL"
		(shape input)
		(at 139.7 90.17 0)
		(fields_autoplaced yes)
		(effects
			(font
				(size 1.27 1.27)
			)
			(justify left)
		)
		(uuid "94596d81-132c-4159-91e2-1f0b00b94cf4")
	)
	(hierarchical_label "VSSA"
		(shape input)
		(at 88.9 170.815 0)
		(fields_autoplaced yes)
		(effects
			(font
				(size 1.27 1.27)
			)
			(justify left)
		)
		(uuid "962686f6-e9e5-4f25-9a94-2634fbacafea")
	)
	(hierarchical_label "SW_RD"
		(shape input)
		(at 100.33 90.17 0)
		(fields_autoplaced yes)
		(effects
			(font
				(size 1.27 1.27)
			)
			(justify left)
		)
		(uuid "9817a402-b047-4b68-8e57-94be41fbdc06")
	)
	(hierarchical_label "VSSA"
		(shape input)
		(at 138.43 172.085 0)
		(fields_autoplaced yes)
		(effects
			(font
				(size 1.27 1.27)
			)
			(justify left)
		)
		(uuid "b408c392-b561-4513-b826-972191cea392")
	)
	(hierarchical_label "SW_SELECT"
		(shape input)
		(at 185.42 58.42 0)
		(fields_autoplaced yes)
		(effects
			(font
				(size 1.27 1.27)
			)
			(justify left)
		)
		(uuid "bd3e5a16-202b-495f-8fe4-0a311abbe905")
	)
	(hierarchical_label "JOYL_X"
		(shape input)
		(at 88.9 153.67 0)
		(fields_autoplaced yes)
		(effects
			(font
				(size 1.27 1.27)
			)
			(justify left)
		)
		(uuid "c17a7a11-abeb-4902-91d7-a7d820a3cb28")
	)
	(hierarchical_label "JOYR_X"
		(shape input)
		(at 138.43 154.94 0)
		(fields_autoplaced yes)
		(effects
			(font
				(size 1.27 1.27)
			)
			(justify left)
		)
		(uuid "c5096588-7830-4ef8-82b2-2fac64e01fcf")
	)
	(hierarchical_label "SW_LR"
		(shape input)
		(at 167.64 124.46 0)
		(fields_autoplaced yes)
		(effects
			(font
				(size 1.27 1.27)
			)
			(justify left)
		)
		(uuid "c59cd8b6-292b-4170-b227-ad0cdc69b2ec")
	)
	(hierarchical_label "VDDA"
		(shape input)
		(at 137.795 160.02 0)
		(fields_autoplaced yes)
		(effects
			(font
				(size 1.27 1.27)
			)
			(justify left)
		)
		(uuid "d23f57a8-d530-47b8-a9c1-5f4ced66d5c7")
	)
	(hierarchical_label "SW_RS_OUTER"
		(shape input)
		(at 195.58 33.02 0)
		(fields_autoplaced yes)
		(effects
			(font
				(size 1.27 1.27)
			)
			(justify left)
		)
		(uuid "d38923d4-a5dd-43f8-9914-9587e23c2102")
	)
	(hierarchical_label "RIGHT_JOY_PRESS"
		(shape input)
		(at 120.65 34.29 0)
		(fields_autoplaced yes)
		(effects
			(font
				(size 1.27 1.27)
			)
			(justify left)
		)
		(uuid "d3b0a784-7ea7-4a12-b5ab-30fe38f34a8b")
	)
	(hierarchical_label "SW_LS_INNER"
		(shape input)
		(at 73.66 58.42 0)
		(fields_autoplaced yes)
		(effects
			(font
				(size 1.27 1.27)
			)
			(justify left)
		)
		(uuid "d47babfe-4d0c-4a51-90c8-96ca3cfef24a")
	)
	(hierarchical_label "VDDA"
		(shape input)
		(at 88.9 158.75 0)
		(fields_autoplaced yes)
		(effects
			(font
				(size 1.27 1.27)
			)
			(justify left)
		)
		(uuid "d69d8ef4-c5d8-4447-98c4-6c32957d58ad")
	)
	(hierarchical_label "SW_START"
		(shape input)
		(at 149.86 58.42 0)
		(fields_autoplaced yes)
		(effects
			(font
				(size 1.27 1.27)
			)
			(justify left)
		)
		(uuid "f65cd78e-5fd1-4dc8-b665-0ffce80c4d4a")
	)
	(symbol
		(lib_id "Switch:SW_Push")
		(at 175.26 95.25 90)
		(unit 1)
		(exclude_from_sim no)
		(in_bom no)
		(on_board yes)
		(dnp no)
		(fields_autoplaced yes)
		(uuid "017bedec-3be5-451d-be51-28f53960acfc")
		(property "Reference" "SW_RR1"
			(at 176.53 93.98 90)
			(effects
				(font
					(size 1.27 1.27)
				)
				(justify right)
			)
		)
		(property "Value" "SW_Push"
			(at 176.53 96.52 90)
			(effects
				(font
					(size 1.27 1.27)
				)
				(justify right)
			)
		)
		(property "Footprint" "buttons:Silicone_contact_1.8_5mm_D7"
			(at 170.18 95.25 0)
			(effects
				(font
					(size 1.27 1.27)
				)
				(hide yes)
			)
		)
		(property "Datasheet" "https://www.aliexpress.com/item/4001360901596.html"
			(at 170.18 95.25 0)
			(effects
				(font
					(size 1.27 1.27)
				)
				(hide yes)
			)
		)
		(property "Description" ""
			(at 175.26 95.25 0)
			(effects
				(font
					(size 1.27 1.27)
				)
				(hide yes)
			)
		)
		(property "LCSC Part #" ""
			(at 175.26 95.25 0)
			(effects
				(font
					(size 1.27 1.27)
				)
				(hide yes)
			)
		)
		(property "LCSC PIN" ""
			(at 175.26 95.25 0)
			(effects
				(font
					(size 1.27 1.27)
				)
				(hide yes)
			)
		)
		(pin "1"
			(uuid "777469fb-92c0-46b9-8f38-5ee79ee3fed8")
		)
		(pin "2"
			(uuid "3ec1a209-d47c-4a67-8abc-faf146b64904")
		)
		(instances
			(project "GamesMachine"
				(path "/e4a8f1f8-6edd-4300-88b6-7e19b38dbeb3/4c8cace3-ab52-4afa-9367-b5be05eac78a"
					(reference "SW_RR1")
					(unit 1)
				)
			)
		)
	)
	(symbol
		(lib_id "power:GND")
		(at 73.66 68.58 0)
		(unit 1)
		(exclude_from_sim no)
		(in_bom yes)
		(on_board yes)
		(dnp no)
		(uuid "0527dccb-bde8-427f-8613-197e73bcdf2c")
		(property "Reference" "#PWR040"
			(at 73.66 74.93 0)
			(effects
				(font
					(size 1.27 1.27)
				)
				(hide yes)
			)
		)
		(property "Value" "GND"
			(at 73.66 73.66 0)
			(effects
				(font
					(size 1.27 1.27)
				)
			)
		)
		(property "Footprint" ""
			(at 73.66 68.58 0)
			(effects
				(font
					(size 1.27 1.27)
				)
				(hide yes)
			)
		)
		(property "Datasheet" ""
			(at 73.66 68.58 0)
			(effects
				(font
					(size 1.27 1.27)
				)
				(hide yes)
			)
		)
		(property "Description" ""
			(at 73.66 68.58 0)
			(effects
				(font
					(size 1.27 1.27)
				)
				(hide yes)
			)
		)
		(pin "1"
			(uuid "22cb0e6a-2dd4-4ceb-8823-45dac7a237c5")
		)
		(instances
			(project "GamesMachine"
				(path "/e4a8f1f8-6edd-4300-88b6-7e19b38dbeb3/4c8cace3-ab52-4afa-9367-b5be05eac78a"
					(reference "#PWR040")
					(unit 1)
				)
			)
		)
	)
	(symbol
		(lib_id "joystick:Joycon-like")
		(at 120.65 38.735 180)
		(unit 3)
		(exclude_from_sim no)
		(in_bom no)
		(on_board yes)
		(dnp no)
		(fields_autoplaced yes)
		(uuid "0ff8736d-227f-45c5-99b6-8bd17947e733")
		(property "Reference" "U12"
			(at 121.92 38.735 0)
			(effects
				(font
					(size 1.27 1.27)
				)
				(justify right)
			)
		)
		(property "Value" "~"
			(at 120.65 38.735 0)
			(effects
				(font
					(size 1.27 1.27)
				)
			)
		)
		(property "Footprint" "joystick:Adafruit-style-joycon"
			(at 120.65 38.735 0)
			(effects
				(font
					(size 1.27 1.27)
				)
				(hide yes)
			)
		)
		(property "Datasheet" "https://www.aliexpress.com/item/1005006099825950.html?"
			(at 120.65 38.735 0)
			(effects
				(font
					(size 1.27 1.27)
				)
				(hide yes)
			)
		)
		(property "Description" ""
			(at 120.65 38.735 0)
			(effects
				(font
					(size 1.27 1.27)
				)
				(hide yes)
			)
		)
		(property "LCSC Part #" ""
			(at 120.65 38.735 0)
			(effects
				(font
					(size 1.27 1.27)
				)
				(hide yes)
			)
		)
		(property "LCSC PIN" ""
			(at 120.65 38.735 0)
			(effects
				(font
					(size 1.27 1.27)
				)
				(hide yes)
			)
		)
		(pin "AD2"
			(uuid "eb202158-01e8-4ebd-9172-6a7e0063bf94")
		)
		(pin "VCC"
			(uuid "e6b69590-9f56-4b09-b5cc-9748b7dbdb92")
		)
		(pin "GND"
			(uuid "f3558fac-d2ef-44d1-8030-7a7cd788f7b2")
		)
		(pin "SW"
			(uuid "3992c67e-4bc7-44d8-a584-66345c19daba")
		)
		(pin "AD1"
			(uuid "54491561-50bf-4a9e-ab2b-a322c2d59a11")
		)
		(pin "GND"
			(uuid "24043da3-5222-4441-a74f-ed03ec555935")
		)
		(pin "GND"
			(uuid "fb503228-ce20-4103-833e-fecf26b72c03")
		)
		(pin "VCC"
			(uuid "fe3e045c-c3bb-405c-9b9e-dbcdc8a39dba")
		)
		(instances
			(project "GamesMachine"
				(path "/e4a8f1f8-6edd-4300-88b6-7e19b38dbeb3/4c8cace3-ab52-4afa-9367-b5be05eac78a"
					(reference "U12")
					(unit 3)
				)
			)
		)
	)
	(symbol
		(lib_id "joystick:Joycon-like")
		(at 131.445 167.64 0)
		(mirror x)
		(unit 2)
		(exclude_from_sim no)
		(in_bom no)
		(on_board yes)
		(dnp no)
		(uuid "10e2390c-b560-476a-b3a1-ef091e85a7e1")
		(property "Reference" "U12"
			(at 129.54 167.64 0)
			(effects
				(font
					(size 1.27 1.27)
				)
				(justify right)
			)
		)
		(property "Value" "~"
			(at 131.445 167.64 0)
			(effects
				(font
					(size 1.27 1.27)
				)
			)
		)
		(property "Footprint" "joystick:Adafruit-style-joycon"
			(at 131.445 167.64 0)
			(effects
				(font
					(size 1.27 1.27)
				)
				(hide yes)
			)
		)
		(property "Datasheet" "https://www.aliexpress.com/item/1005006099825950.html?"
			(at 131.445 167.64 0)
			(effects
				(font
					(size 1.27 1.27)
				)
				(hide yes)
			)
		)
		(property "Description" ""
			(at 131.445 167.64 0)
			(effects
				(font
					(size 1.27 1.27)
				)
				(hide yes)
			)
		)
		(property "LCSC Part #" ""
			(at 131.445 167.64 0)
			(effects
				(font
					(size 1.27 1.27)
				)
				(hide yes)
			)
		)
		(property "LCSC PIN" ""
			(at 131.445 167.64 0)
			(effects
				(font
					(size 1.27 1.27)
				)
				(hide yes)
			)
		)
		(pin "AD2"
			(uuid "eb202158-01e8-4ebd-9172-6a7e0063bf95")
		)
		(pin "VCC"
			(uuid "e6b69590-9f56-4b09-b5cc-9748b7dbdb93")
		)
		(pin "GND"
			(uuid "f3558fac-d2ef-44d1-8030-7a7cd788f7b3")
		)
		(pin "SW"
			(uuid "3992c67e-4bc7-44d8-a584-66345c19dabb")
		)
		(pin "AD1"
			(uuid "54491561-50bf-4a9e-ab2b-a322c2d59a12")
		)
		(pin "GND"
			(uuid "24043da3-5222-4441-a74f-ed03ec555936")
		)
		(pin "GND"
			(uuid "fb503228-ce20-4103-833e-fecf26b72c04")
		)
		(pin "VCC"
			(uuid "fe3e045c-c3bb-405c-9b9e-dbcdc8a39dbb")
		)
		(instances
			(project "GamesMachine"
				(path "/e4a8f1f8-6edd-4300-88b6-7e19b38dbeb3/4c8cace3-ab52-4afa-9367-b5be05eac78a"
					(reference "U12")
					(unit 2)
				)
			)
		)
	)
	(symbol
		(lib_id "power:GND")
		(at 175.26 100.33 0)
		(unit 1)
		(exclude_from_sim no)
		(in_bom yes)
		(on_board yes)
		(dnp no)
		(fields_autoplaced yes)
		(uuid "120cdec8-16b9-4c70-9106-df6c604115e5")
		(property "Reference" "#PWR047"
			(at 175.26 106.68 0)
			(effects
				(font
					(size 1.27 1.27)
				)
				(hide yes)
			)
		)
		(property "Value" "GND"
			(at 175.26 105.41 0)
			(effects
				(font
					(size 1.27 1.27)
				)
			)
		)
		(property "Footprint" ""
			(at 175.26 100.33 0)
			(effects
				(font
					(size 1.27 1.27)
				)
				(hide yes)
			)
		)
		(property "Datasheet" ""
			(at 175.26 100.33 0)
			(effects
				(font
					(size 1.27 1.27)
				)
				(hide yes)
			)
		)
		(property "Description" ""
			(at 175.26 100.33 0)
			(effects
				(font
					(size 1.27 1.27)
				)
				(hide yes)
			)
		)
		(pin "1"
			(uuid "36d7fc2d-84f1-4948-bc98-2791c05dbcbd")
		)
		(instances
			(project "GamesMachine"
				(path "/e4a8f1f8-6edd-4300-88b6-7e19b38dbeb3/4c8cace3-ab52-4afa-9367-b5be05eac78a"
					(reference "#PWR047")
					(unit 1)
				)
			)
		)
	)
	(symbol
		(lib_id "Switch:SW_Push")
		(at 92.71 129.54 90)
		(unit 1)
		(exclude_from_sim no)
		(in_bom no)
		(on_board yes)
		(dnp no)
		(fields_autoplaced yes)
		(uuid "132600d1-21a0-4ee7-8802-6849665f8b90")
		(property "Reference" "SW_LD1"
			(at 93.98 128.27 90)
			(effects
				(font
					(size 1.27 1.27)
				)
				(justify right)
			)
		)
		(property "Value" "SW_Push"
			(at 93.98 130.81 90)
			(effects
				(font
					(size 1.27 1.27)
				)
				(justify right)
			)
		)
		(property "Footprint" "buttons:Silicone_contact_1.8_5mm_D7"
			(at 87.63 129.54 0)
			(effects
				(font
					(size 1.27 1.27)
				)
				(hide yes)
			)
		)
		(property "Datasheet" "https://www.aliexpress.com/item/4001360901596.html"
			(at 87.63 129.54 0)
			(effects
				(font
					(size 1.27 1.27)
				)
				(hide yes)
			)
		)
		(property "Description" ""
			(at 92.71 129.54 0)
			(effects
				(font
					(size 1.27 1.27)
				)
				(hide yes)
			)
		)
		(property "LCSC Part #" ""
			(at 92.71 129.54 0)
			(effects
				(font
					(size 1.27 1.27)
				)
				(hide yes)
			)
		)
		(property "LCSC PIN" ""
			(at 92.71 129.54 0)
			(effects
				(font
					(size 1.27 1.27)
				)
				(hide yes)
			)
		)
		(pin "1"
			(uuid "e8bbf362-bf8e-4287-863e-d7623237728b")
		)
		(pin "2"
			(uuid "51e6975f-2472-4240-b006-14fa7f37c8af")
		)
		(instances
			(project "GamesMachine"
				(path "/e4a8f1f8-6edd-4300-88b6-7e19b38dbeb3/4c8cace3-ab52-4afa-9367-b5be05eac78a"
					(reference "SW_LD1")
					(unit 1)
				)
			)
		)
	)
	(symbol
		(lib_id "power:GND")
		(at 185.42 68.58 0)
		(unit 1)
		(exclude_from_sim no)
		(in_bom yes)
		(on_board yes)
		(dnp no)
		(uuid "141a9779-45e5-416c-b4a8-7484fca536ac")
		(property "Reference" "#PWR043"
			(at 185.42 74.93 0)
			(effects
				(font
					(size 1.27 1.27)
				)
				(hide yes)
			)
		)
		(property "Value" "GND"
			(at 185.42 73.66 0)
			(effects
				(font
					(size 1.27 1.27)
				)
			)
		)
		(property "Footprint" ""
			(at 185.42 68.58 0)
			(effects
				(font
					(size 1.27 1.27)
				)
				(hide yes)
			)
		)
		(property "Datasheet" ""
			(at 185.42 68.58 0)
			(effects
				(font
					(size 1.27 1.27)
				)
				(hide yes)
			)
		)
		(property "Description" ""
			(at 185.42 68.58 0)
			(effects
				(font
					(size 1.27 1.27)
				)
				(hide yes)
			)
		)
		(pin "1"
			(uuid "f93326c9-75d3-45f9-8307-20e2c49f60d2")
		)
		(instances
			(project "GamesMachine"
				(path "/e4a8f1f8-6edd-4300-88b6-7e19b38dbeb3/4c8cace3-ab52-4afa-9367-b5be05eac78a"
					(reference "#PWR043")
					(unit 1)
				)
			)
		)
	)
	(symbol
		(lib_id "power:GND")
		(at 149.86 68.58 0)
		(unit 1)
		(exclude_from_sim no)
		(in_bom yes)
		(on_board yes)
		(dnp no)
		(uuid "18212f05-b05f-4485-9a15-953d6e47682f")
		(property "Reference" "#PWR042"
			(at 149.86 74.93 0)
			(effects
				(font
					(size 1.27 1.27)
				)
				(hide yes)
			)
		)
		(property "Value" "GND"
			(at 149.86 73.66 0)
			(effects
				(font
					(size 1.27 1.27)
				)
			)
		)
		(property "Footprint" ""
			(at 149.86 68.58 0)
			(effects
				(font
					(size 1.27 1.27)
				)
				(hide yes)
			)
		)
		(property "Datasheet" ""
			(at 149.86 68.58 0)
			(effects
				(font
					(size 1.27 1.27)
				)
				(hide yes)
			)
		)
		(property "Description" ""
			(at 149.86 68.58 0)
			(effects
				(font
					(size 1.27 1.27)
				)
				(hide yes)
			)
		)
		(pin "1"
			(uuid "5b54dd82-16a7-44ab-bae4-9ce61007a5c9")
		)
		(instances
			(project "GamesMachine"
				(path "/e4a8f1f8-6edd-4300-88b6-7e19b38dbeb3/4c8cace3-ab52-4afa-9367-b5be05eac78a"
					(reference "#PWR042")
					(unit 1)
				)
			)
		)
	)
	(symbol
		(lib_id "joystick:Joycon-like")
		(at 111.76 160.02 90)
		(unit 1)
		(exclude_from_sim no)
		(in_bom no)
		(on_board yes)
		(dnp no)
		(uuid "192e5d4d-6d13-42dd-8108-00cceb207409")
		(property "Reference" "U12"
			(at 111.76 162.56 90)
			(effects
				(font
					(size 1.27 1.27)
				)
			)
		)
		(property "Value" "~"
			(at 111.76 160.02 0)
			(effects
				(font
					(size 1.27 1.27)
				)
			)
		)
		(property "Footprint" "joystick:Adafruit-style-joycon"
			(at 111.76 160.02 0)
			(effects
				(font
					(size 1.27 1.27)
				)
				(hide yes)
			)
		)
		(property "Datasheet" "https://www.aliexpress.com/item/1005006099825950.html?"
			(at 111.76 160.02 0)
			(effects
				(font
					(size 1.27 1.27)
				)
				(hide yes)
			)
		)
		(property "Description" ""
			(at 111.76 160.02 0)
			(effects
				(font
					(size 1.27 1.27)
				)
				(hide yes)
			)
		)
		(property "LCSC Part #" ""
			(at 111.76 160.02 0)
			(effects
				(font
					(size 1.27 1.27)
				)
				(hide yes)
			)
		)
		(property "LCSC PIN" ""
			(at 111.76 160.02 0)
			(effects
				(font
					(size 1.27 1.27)
				)
				(hide yes)
			)
		)
		(pin "AD2"
			(uuid "eb202158-01e8-4ebd-9172-6a7e0063bf96")
		)
		(pin "VCC"
			(uuid "e6b69590-9f56-4b09-b5cc-9748b7dbdb94")
		)
		(pin "GND"
			(uuid "f3558fac-d2ef-44d1-8030-7a7cd788f7b4")
		)
		(pin "SW"
			(uuid "3992c67e-4bc7-44d8-a584-66345c19dabc")
		)
		(pin "AD1"
			(uuid "54491561-50bf-4a9e-ab2b-a322c2d59a13")
		)
		(pin "GND"
			(uuid "24043da3-5222-4441-a74f-ed03ec555937")
		)
		(pin "GND"
			(uuid "fb503228-ce20-4103-833e-fecf26b72c05")
		)
		(pin "VCC"
			(uuid "fe3e045c-c3bb-405c-9b9e-dbcdc8a39dbc")
		)
		(instances
			(project "GamesMachine"
				(path "/e4a8f1f8-6edd-4300-88b6-7e19b38dbeb3/4c8cace3-ab52-4afa-9367-b5be05eac78a"
					(reference "U12")
					(unit 1)
				)
			)
		)
	)
	(symbol
		(lib_id "joystick:Joycon-like")
		(at 81.915 166.37 0)
		(mirror x)
		(unit 2)
		(exclude_from_sim no)
		(in_bom no)
		(on_board yes)
		(dnp no)
		(uuid "200c4e55-9c2b-4de7-9f0d-3060a4ab4498")
		(property "Reference" "U9"
			(at 80.645 166.37 0)
			(effects
				(font
					(size 1.27 1.27)
				)
				(justify right)
			)
		)
		(property "Value" "~"
			(at 81.915 166.37 0)
			(effects
				(font
					(size 1.27 1.27)
				)
			)
		)
		(property "Footprint" "joystick:Adafruit-style-joycon"
			(at 81.915 166.37 0)
			(effects
				(font
					(size 1.27 1.27)
				)
				(hide yes)
			)
		)
		(property "Datasheet" "https://www.aliexpress.com/item/1005006099825950.html?"
			(at 81.915 166.37 0)
			(effects
				(font
					(size 1.27 1.27)
				)
				(hide yes)
			)
		)
		(property "Description" ""
			(at 81.915 166.37 0)
			(effects
				(font
					(size 1.27 1.27)
				)
				(hide yes)
			)
		)
		(property "LCSC Part #" ""
			(at 81.915 166.37 0)
			(effects
				(font
					(size 1.27 1.27)
				)
				(hide yes)
			)
		)
		(property "LCSC PIN" ""
			(at 81.915 166.37 0)
			(effects
				(font
					(size 1.27 1.27)
				)
				(hide yes)
			)
		)
		(pin "GND"
			(uuid "192f80ba-26bf-41b5-b688-7b1e9f47d771")
		)
		(pin "AD2"
			(uuid "bbbd32f6-9d69-4e37-8d6b-10f02d93d199")
		)
		(pin "SW"
			(uuid "fd150e14-9ea6-487c-90f1-52a24f325cfb")
		)
		(pin "GND"
			(uuid "177fa029-3507-4716-95d9-09e67dda47f9")
		)
		(pin "VCC"
			(uuid "728c2420-8ebc-4f96-8202-82d834d50c38")
		)
		(pin "GND"
			(uuid "0bc1a607-8921-4990-8f9d-2178eae73dae")
		)
		(pin "VCC"
			(uuid "f766727d-35c3-4e30-bccd-72ee17cbe17e")
		)
		(pin "AD1"
			(uuid "94ee71ee-81ad-4c4a-a217-015a4559ae55")
		)
		(instances
			(project "GamesMachine"
				(path "/e4a8f1f8-6edd-4300-88b6-7e19b38dbeb3/4c8cace3-ab52-4afa-9367-b5be05eac78a"
					(reference "U9")
					(unit 2)
				)
			)
		)
	)
	(symbol
		(lib_id "power:GND")
		(at 83.82 43.18 0)
		(unit 1)
		(exclude_from_sim no)
		(in_bom yes)
		(on_board yes)
		(dnp no)
		(fields_autoplaced yes)
		(uuid "3029c4a8-8645-48e5-a01e-9e05ca118738")
		(property "Reference" "#PWR039"
			(at 83.82 49.53 0)
			(effects
				(font
					(size 1.27 1.27)
				)
				(hide yes)
			)
		)
		(property "Value" "GND"
			(at 83.82 48.26 0)
			(effects
				(font
					(size 1.27 1.27)
				)
			)
		)
		(property "Footprint" ""
			(at 83.82 43.18 0)
			(effects
				(font
					(size 1.27 1.27)
				)
				(hide yes)
			)
		)
		(property "Datasheet" ""
			(at 83.82 43.18 0)
			(effects
				(font
					(size 1.27 1.27)
				)
				(hide yes)
			)
		)
		(property "Description" ""
			(at 83.82 43.18 0)
			(effects
				(font
					(size 1.27 1.27)
				)
				(hide yes)
			)
		)
		(pin "1"
			(uuid "bfd4a9b4-d1cf-4c8e-a6a9-1e5e0582528e")
		)
		(instances
			(project "GamesMachine"
				(path "/e4a8f1f8-6edd-4300-88b6-7e19b38dbeb3/4c8cace3-ab52-4afa-9367-b5be05eac78a"
					(reference "#PWR039")
					(unit 1)
				)
			)
		)
	)
	(symbol
		(lib_id "power:GND")
		(at 139.7 100.33 0)
		(unit 1)
		(exclude_from_sim no)
		(in_bom yes)
		(on_board yes)
		(dnp no)
		(fields_autoplaced yes)
		(uuid "3e194904-cc5d-4ffc-9ec6-5372634788d6")
		(property "Reference" "#PWR046"
			(at 139.7 106.68 0)
			(effects
				(font
					(size 1.27 1.27)
				)
				(hide yes)
			)
		)
		(property "Value" "GND"
			(at 139.7 105.41 0)
			(effects
				(font
					(size 1.27 1.27)
				)
			)
		)
		(property "Footprint" ""
			(at 139.7 100.33 0)
			(effects
				(font
					(size 1.27 1.27)
				)
				(hide yes)
			)
		)
		(property "Datasheet" ""
			(at 139.7 100.33 0)
			(effects
				(font
					(size 1.27 1.27)
				)
				(hide yes)
			)
		)
		(property "Description" ""
			(at 139.7 100.33 0)
			(effects
				(font
					(size 1.27 1.27)
				)
				(hide yes)
			)
		)
		(pin "1"
			(uuid "f84fc752-688f-4307-bcbf-9602154c1425")
		)
		(instances
			(project "GamesMachine"
				(path "/e4a8f1f8-6edd-4300-88b6-7e19b38dbeb3/4c8cace3-ab52-4afa-9367-b5be05eac78a"
					(reference "#PWR046")
					(unit 1)
				)
			)
		)
	)
	(symbol
		(lib_id "power:GND")
		(at 120.65 43.18 0)
		(unit 1)
		(exclude_from_sim no)
		(in_bom yes)
		(on_board yes)
		(dnp no)
		(fields_autoplaced yes)
		(uuid "4f29662d-2fc7-4f39-8cfa-bf609b84fb1c")
		(property "Reference" "#PWR038"
			(at 120.65 49.53 0)
			(effects
				(font
					(size 1.27 1.27)
				)
				(hide yes)
			)
		)
		(property "Value" "GND"
			(at 120.65 48.26 0)
			(effects
				(font
					(size 1.27 1.27)
				)
			)
		)
		(property "Footprint" ""
			(at 120.65 43.18 0)
			(effects
				(font
					(size 1.27 1.27)
				)
				(hide yes)
			)
		)
		(property "Datasheet" ""
			(at 120.65 43.18 0)
			(effects
				(font
					(size 1.27 1.27)
				)
				(hide yes)
			)
		)
		(property "Description" ""
			(at 120.65 43.18 0)
			(effects
				(font
					(size 1.27 1.27)
				)
				(hide yes)
			)
		)
		(pin "1"
			(uuid "23499353-8806-4cb5-bfb8-b661a7cd9c7b")
		)
		(instances
			(project "GamesMachine"
				(path "/e4a8f1f8-6edd-4300-88b6-7e19b38dbeb3/4c8cace3-ab52-4afa-9367-b5be05eac78a"
					(reference "#PWR038")
					(unit 1)
				)
			)
		)
	)
	(symbol
		(lib_id "Switch:SW_Push")
		(at 132.08 129.54 90)
		(unit 1)
		(exclude_from_sim no)
		(in_bom no)
		(on_board yes)
		(dnp no)
		(fields_autoplaced yes)
		(uuid "55dda554-e470-4e79-9891-43fcc31135a8")
		(property "Reference" "SW_LL1"
			(at 133.35 128.27 90)
			(effects
				(font
					(size 1.27 1.27)
				)
				(justify right)
			)
		)
		(property "Value" "SW_Push"
			(at 133.35 130.81 90)
			(effects
				(font
					(size 1.27 1.27)
				)
				(justify right)
			)
		)
		(property "Footprint" "buttons:Silicone_contact_1.8_5mm_D7"
			(at 127 129.54 0)
			(effects
				(font
					(size 1.27 1.27)
				)
				(hide yes)
			)
		)
		(property "Datasheet" "https://www.aliexpress.com/item/4001360901596.html"
			(at 127 129.54 0)
			(effects
				(font
					(size 1.27 1.27)
				)
				(hide yes)
			)
		)
		(property "Description" ""
			(at 132.08 129.54 0)
			(effects
				(font
					(size 1.27 1.27)
				)
				(hide yes)
			)
		)
		(property "LCSC Part #" ""
			(at 132.08 129.54 0)
			(effects
				(font
					(size 1.27 1.27)
				)
				(hide yes)
			)
		)
		(property "LCSC PIN" ""
			(at 132.08 129.54 0)
			(effects
				(font
					(size 1.27 1.27)
				)
				(hide yes)
			)
		)
		(pin "1"
			(uuid "70048ce9-92b9-4fda-bc73-9c17b763d7d8")
		)
		(pin "2"
			(uuid "3b3f2137-b1af-4972-a4fb-5f4e9cd92c60")
		)
		(instances
			(project "GamesMachine"
				(path "/e4a8f1f8-6edd-4300-88b6-7e19b38dbeb3/4c8cace3-ab52-4afa-9367-b5be05eac78a"
					(reference "SW_LL1")
					(unit 1)
				)
			)
		)
	)
	(symbol
		(lib_id "Switch:SW_Push")
		(at 160.02 38.1 90)
		(unit 1)
		(exclude_from_sim no)
		(in_bom no)
		(on_board yes)
		(dnp no)
		(fields_autoplaced yes)
		(uuid "6e562db7-ea51-4cb0-8046-19b535abcc9e")
		(property "Reference" "SW_RS1"
			(at 161.29 36.83 90)
			(effects
				(font
					(size 1.27 1.27)
				)
				(justify right)
			)
		)
		(property "Value" "SW_Push"
			(at 161.29 39.37 90)
			(effects
				(font
					(size 1.27 1.27)
				)
				(justify right)
			)
		)
		(property "Footprint" "buttons:G78-side"
			(at 154.94 38.1 0)
			(effects
				(font
					(size 1.27 1.27)
				)
				(hide yes)
			)
		)
		(property "Datasheet" "https://www.aliexpress.com/item/32815761946.html"
			(at 154.94 38.1 0)
			(effects
				(font
					(size 1.27 1.27)
				)
				(hide yes)
			)
		)
		(property "Description" ""
			(at 160.02 38.1 0)
			(effects
				(font
					(size 1.27 1.27)
				)
				(hide yes)
			)
		)
		(property "LCSC Part #" ""
			(at 160.02 38.1 0)
			(effects
				(font
					(size 1.27 1.27)
				)
				(hide yes)
			)
		)
		(property "LCSC PIN" ""
			(at 160.02 38.1 0)
			(effects
				(font
					(size 1.27 1.27)
				)
				(hide yes)
			)
		)
		(pin "1"
			(uuid "0f1024bf-0f72-41bb-a973-fdfd6d509985")
		)
		(pin "2"
			(uuid "4773ac0a-af06-4990-81f1-4c78f760b5f3")
		)
		(instances
			(project "GamesMachine"
				(path "/e4a8f1f8-6edd-4300-88b6-7e19b38dbeb3/4c8cace3-ab52-4afa-9367-b5be05eac78a"
					(reference "SW_RS1")
					(unit 1)
				)
			)
		)
	)
	(symbol
		(lib_id "Switch:SW_Push")
		(at 195.58 38.1 90)
		(unit 1)
		(exclude_from_sim no)
		(in_bom no)
		(on_board yes)
		(dnp no)
		(fields_autoplaced yes)
		(uuid "6ec2dc21-d7f6-4725-8ace-2efdc585b7ab")
		(property "Reference" "SW_RT1"
			(at 196.85 36.83 90)
			(effects
				(font
					(size 1.27 1.27)
				)
				(justify right)
			)
		)
		(property "Value" "SW_Push"
			(at 196.85 39.37 90)
			(effects
				(font
					(size 1.27 1.27)
				)
				(justify right)
			)
		)
		(property "Footprint" "buttons:G78-side"
			(at 190.5 38.1 0)
			(effects
				(font
					(size 1.27 1.27)
				)
				(hide yes)
			)
		)
		(property "Datasheet" "https://www.aliexpress.com/item/32815761946.html"
			(at 190.5 38.1 0)
			(effects
				(font
					(size 1.27 1.27)
				)
				(hide yes)
			)
		)
		(property "Description" ""
			(at 195.58 38.1 0)
			(effects
				(font
					(size 1.27 1.27)
				)
				(hide yes)
			)
		)
		(property "Field4" ""
			(at 195.58 38.1 90)
			(effects
				(font
					(size 1.27 1.27)
				)
				(hide yes)
			)
		)
		(property "LCSC Part #" ""
			(at 195.58 38.1 0)
			(effects
				(font
					(size 1.27 1.27)
				)
				(hide yes)
			)
		)
		(property "LCSC PIN" ""
			(at 195.58 38.1 0)
			(effects
				(font
					(size 1.27 1.27)
				)
				(hide yes)
			)
		)
		(pin "1"
			(uuid "4e9d0817-dd00-462f-95b9-f3a8704e6520")
		)
		(pin "2"
			(uuid "e080c32e-bb08-4b7e-b1a2-eff1bac3714f")
		)
		(instances
			(project "GamesMachine"
				(path "/e4a8f1f8-6edd-4300-88b6-7e19b38dbeb3/4c8cace3-ab52-4afa-9367-b5be05eac78a"
					(reference "SW_RT1")
					(unit 1)
				)
			)
		)
	)
	(symbol
		(lib_id "power:GND")
		(at 55.88 134.62 0)
		(unit 1)
		(exclude_from_sim no)
		(in_bom yes)
		(on_board yes)
		(dnp no)
		(fields_autoplaced yes)
		(uuid "71c2c9f9-abf3-4b46-8504-57ceba1cbe08")
		(property "Reference" "#PWR048"
			(at 55.88 140.97 0)
			(effects
				(font
					(size 1.27 1.27)
				)
				(hide yes)
			)
		)
		(property "Value" "GND"
			(at 55.88 139.7 0)
			(effects
				(font
					(size 1.27 1.27)
				)
			)
		)
		(property "Footprint" ""
			(at 55.88 134.62 0)
			(effects
				(font
					(size 1.27 1.27)
				)
				(hide yes)
			)
		)
		(property "Datasheet" ""
			(at 55.88 134.62 0)
			(effects
				(font
					(size 1.27 1.27)
				)
				(hide yes)
			)
		)
		(property "Description" ""
			(at 55.88 134.62 0)
			(effects
				(font
					(size 1.27 1.27)
				)
				(hide yes)
			)
		)
		(pin "1"
			(uuid "8f6312a2-e016-4632-be6a-6aa24e874189")
		)
		(instances
			(project "GamesMachine"
				(path "/e4a8f1f8-6edd-4300-88b6-7e19b38dbeb3/4c8cace3-ab52-4afa-9367-b5be05eac78a"
					(reference "#PWR048")
					(unit 1)
				)
			)
		)
	)
	(symbol
		(lib_id "joystick:Joycon-like")
		(at 83.82 38.735 180)
		(unit 3)
		(exclude_from_sim no)
		(in_bom no)
		(on_board yes)
		(dnp no)
		(fields_autoplaced yes)
		(uuid "7f748fe1-6f18-4a87-9f87-8ae31ac71fd4")
		(property "Reference" "U9"
			(at 85.09 38.735 0)
			(effects
				(font
					(size 1.27 1.27)
				)
				(justify right)
			)
		)
		(property "Value" "~"
			(at 83.82 38.735 0)
			(effects
				(font
					(size 1.27 1.27)
				)
			)
		)
		(property "Footprint" "joystick:Adafruit-style-joycon"
			(at 83.82 38.735 0)
			(effects
				(font
					(size 1.27 1.27)
				)
				(hide yes)
			)
		)
		(property "Datasheet" "https://www.aliexpress.com/item/1005006099825950.html?"
			(at 83.82 38.735 0)
			(effects
				(font
					(size 1.27 1.27)
				)
				(hide yes)
			)
		)
		(property "Description" ""
			(at 83.82 38.735 0)
			(effects
				(font
					(size 1.27 1.27)
				)
				(hide yes)
			)
		)
		(property "LCSC Part #" ""
			(at 83.82 38.735 0)
			(effects
				(font
					(size 1.27 1.27)
				)
				(hide yes)
			)
		)
		(property "LCSC PIN" ""
			(at 83.82 38.735 0)
			(effects
				(font
					(size 1.27 1.27)
				)
				(hide yes)
			)
		)
		(pin "GND"
			(uuid "192f80ba-26bf-41b5-b688-7b1e9f47d772")
		)
		(pin "AD2"
			(uuid "bbbd32f6-9d69-4e37-8d6b-10f02d93d19a")
		)
		(pin "SW"
			(uuid "fd150e14-9ea6-487c-90f1-52a24f325cfc")
		)
		(pin "GND"
			(uuid "177fa029-3507-4716-95d9-09e67dda47fa")
		)
		(pin "VCC"
			(uuid "728c2420-8ebc-4f96-8202-82d834d50c39")
		)
		(pin "GND"
			(uuid "0bc1a607-8921-4990-8f9d-2178eae73daf")
		)
		(pin "VCC"
			(uuid "f766727d-35c3-4e30-bccd-72ee17cbe17f")
		)
		(pin "AD1"
			(uuid "94ee71ee-81ad-4c4a-a217-015a4559ae56")
		)
		(instances
			(project "GamesMachine"
				(path "/e4a8f1f8-6edd-4300-88b6-7e19b38dbeb3/4c8cace3-ab52-4afa-9367-b5be05eac78a"
					(reference "U9")
					(unit 3)
				)
			)
		)
	)
	(symbol
		(lib_id "Switch:SW_Push")
		(at 73.66 63.5 90)
		(unit 1)
		(exclude_from_sim no)
		(in_bom no)
		(on_board yes)
		(dnp no)
		(fields_autoplaced yes)
		(uuid "7fe760e7-c2c0-4375-b3a7-c032fed3bf27")
		(property "Reference" "SW_LS1"
			(at 74.93 62.23 90)
			(effects
				(font
					(size 1.27 1.27)
				)
				(justify right)
			)
		)
		(property "Value" "SW_Push"
			(at 74.93 64.77 90)
			(effects
				(font
					(size 1.27 1.27)
				)
				(justify right)
			)
		)
		(property "Footprint" "buttons:G78-side"
			(at 68.58 63.5 0)
			(effects
				(font
					(size 1.27 1.27)
				)
				(hide yes)
			)
		)
		(property "Datasheet" "https://www.aliexpress.com/item/32815761946.html"
			(at 68.58 63.5 0)
			(effects
				(font
					(size 1.27 1.27)
				)
				(hide yes)
			)
		)
		(property "Description" ""
			(at 73.66 63.5 0)
			(effects
				(font
					(size 1.27 1.27)
				)
				(hide yes)
			)
		)
		(property "LCSC Part #" ""
			(at 73.66 63.5 0)
			(effects
				(font
					(size 1.27 1.27)
				)
				(hide yes)
			)
		)
		(property "LCSC PIN" ""
			(at 73.66 63.5 0)
			(effects
				(font
					(size 1.27 1.27)
				)
				(hide yes)
			)
		)
		(pin "1"
			(uuid "dae05b91-3d86-4176-99d4-ccae4c50dafe")
		)
		(pin "2"
			(uuid "08c52404-0516-4eef-9589-8eab43f5cf4e")
		)
		(instances
			(project "GamesMachine"
				(path "/e4a8f1f8-6edd-4300-88b6-7e19b38dbeb3/4c8cace3-ab52-4afa-9367-b5be05eac78a"
					(reference "SW_LS1")
					(unit 1)
				)
			)
		)
	)
	(symbol
		(lib_id "Switch:SW_Push")
		(at 55.88 129.54 90)
		(unit 1)
		(exclude_from_sim no)
		(in_bom no)
		(on_board yes)
		(dnp no)
		(fields_autoplaced yes)
		(uuid "8c4c7b1b-63f7-42ef-9f0d-2a39456e5994")
		(property "Reference" "SW_LU1"
			(at 48.26 129.54 0)
			(effects
				(font
					(size 1.27 1.27)
				)
			)
		)
		(property "Value" "SW_Push"
			(at 50.8 129.54 0)
			(effects
				(font
					(size 1.27 1.27)
				)
			)
		)
		(property "Footprint" "buttons:Silicone_contact_1.8_5mm_D7"
			(at 50.8 129.54 0)
			(effects
				(font
					(size 1.27 1.27)
				)
				(hide yes)
			)
		)
		(property "Datasheet" "https://www.aliexpress.com/item/4001360901596.html"
			(at 50.8 129.54 0)
			(effects
				(font
					(size 1.27 1.27)
				)
				(hide yes)
			)
		)
		(property "Description" ""
			(at 55.88 129.54 0)
			(effects
				(font
					(size 1.27 1.27)
				)
				(hide yes)
			)
		)
		(property "LCSC Part #" ""
			(at 55.88 129.54 0)
			(effects
				(font
					(size 1.27 1.27)
				)
				(hide yes)
			)
		)
		(property "LCSC PIN" ""
			(at 55.88 129.54 0)
			(effects
				(font
					(size 1.27 1.27)
				)
				(hide yes)
			)
		)
		(pin "1"
			(uuid "3f3c47a1-ef8f-47ca-ac62-d4e4efd654fa")
		)
		(pin "2"
			(uuid "816a5bbd-c8ad-4fc4-b64d-8014aa1e8bfc")
		)
		(instances
			(project "GamesMachine"
				(path "/e4a8f1f8-6edd-4300-88b6-7e19b38dbeb3/4c8cace3-ab52-4afa-9367-b5be05eac78a"
					(reference "SW_LU1")
					(unit 1)
				)
			)
		)
	)
	(symbol
		(lib_id "power:GND")
		(at 195.58 43.18 0)
		(unit 1)
		(exclude_from_sim no)
		(in_bom yes)
		(on_board yes)
		(dnp no)
		(fields_autoplaced yes)
		(uuid "9580064e-4ffa-4f3c-bb00-b71c303c72cc")
		(property "Reference" "#PWR037"
			(at 195.58 49.53 0)
			(effects
				(font
					(size 1.27 1.27)
				)
				(hide yes)
			)
		)
		(property "Value" "GND"
			(at 195.58 48.26 0)
			(effects
				(font
					(size 1.27 1.27)
				)
			)
		)
		(property "Footprint" ""
			(at 195.58 43.18 0)
			(effects
				(font
					(size 1.27 1.27)
				)
				(hide yes)
			)
		)
		(property "Datasheet" ""
			(at 195.58 43.18 0)
			(effects
				(font
					(size 1.27 1.27)
				)
				(hide yes)
			)
		)
		(property "Description" ""
			(at 195.58 43.18 0)
			(effects
				(font
					(size 1.27 1.27)
				)
				(hide yes)
			)
		)
		(pin "1"
			(uuid "3e0c6af2-404e-4597-928e-d067ecc2ffc7")
		)
		(instances
			(project "GamesMachine"
				(path "/e4a8f1f8-6edd-4300-88b6-7e19b38dbeb3/4c8cace3-ab52-4afa-9367-b5be05eac78a"
					(reference "#PWR037")
					(unit 1)
				)
			)
		)
	)
	(symbol
		(lib_id "Switch:SW_Push")
		(at 185.42 63.5 90)
		(unit 1)
		(exclude_from_sim no)
		(in_bom no)
		(on_board yes)
		(dnp no)
		(fields_autoplaced yes)
		(uuid "98c33965-a722-4524-9eb8-555f6c8da8c4")
		(property "Reference" "SW_SL1"
			(at 186.69 62.23 90)
			(effects
				(font
					(size 1.27 1.27)
				)
				(justify right)
			)
		)
		(property "Value" "SW_SMALL"
			(at 186.69 64.77 90)
			(effects
				(font
					(size 1.27 1.27)
				)
				(justify right)
			)
		)
		(property "Footprint" "buttons:Silicone_contact_1.8_5mm_D7"
			(at 180.34 63.5 0)
			(effects
				(font
					(size 1.27 1.27)
				)
				(hide yes)
			)
		)
		(property "Datasheet" "https://www.aliexpress.com/item/4001360901596.html"
			(at 180.34 63.5 0)
			(effects
				(font
					(size 1.27 1.27)
				)
				(hide yes)
			)
		)
		(property "Description" ""
			(at 185.42 63.5 0)
			(effects
				(font
					(size 1.27 1.27)
				)
				(hide yes)
			)
		)
		(property "Field4" ""
			(at 185.42 63.5 90)
			(effects
				(font
					(size 1.27 1.27)
				)
				(hide yes)
			)
		)
		(property "LCSC Part #" ""
			(at 185.42 63.5 0)
			(effects
				(font
					(size 1.27 1.27)
				)
				(hide yes)
			)
		)
		(property "LCSC PIN" ""
			(at 185.42 63.5 0)
			(effects
				(font
					(size 1.27 1.27)
				)
				(hide yes)
			)
		)
		(pin "1"
			(uuid "481b9cd3-10d5-414c-8537-cbe943ae5021")
		)
		(pin "2"
			(uuid "ebf1035f-62b2-411e-9486-cff9166c7c55")
		)
		(instances
			(project "GamesMachine"
				(path "/e4a8f1f8-6edd-4300-88b6-7e19b38dbeb3/4c8cace3-ab52-4afa-9367-b5be05eac78a"
					(reference "SW_SL1")
					(unit 1)
				)
			)
		)
	)
	(symbol
		(lib_id "power:GND")
		(at 110.49 68.58 0)
		(unit 1)
		(exclude_from_sim no)
		(in_bom yes)
		(on_board yes)
		(dnp no)
		(uuid "9a60527b-54ae-4e9b-9ce6-6135054c2669")
		(property "Reference" "#PWR041"
			(at 110.49 74.93 0)
			(effects
				(font
					(size 1.27 1.27)
				)
				(hide yes)
			)
		)
		(property "Value" "GND"
			(at 110.49 73.66 0)
			(effects
				(font
					(size 1.27 1.27)
				)
			)
		)
		(property "Footprint" ""
			(at 110.49 68.58 0)
			(effects
				(font
					(size 1.27 1.27)
				)
				(hide yes)
			)
		)
		(property "Datasheet" ""
			(at 110.49 68.58 0)
			(effects
				(font
					(size 1.27 1.27)
				)
				(hide yes)
			)
		)
		(property "Description" ""
			(at 110.49 68.58 0)
			(effects
				(font
					(size 1.27 1.27)
				)
				(hide yes)
			)
		)
		(pin "1"
			(uuid "01d38997-df34-452f-80ae-f221787cbc32")
		)
		(instances
			(project "GamesMachine"
				(path "/e4a8f1f8-6edd-4300-88b6-7e19b38dbeb3/4c8cace3-ab52-4afa-9367-b5be05eac78a"
					(reference "#PWR041")
					(unit 1)
				)
			)
		)
	)
	(symbol
		(lib_id "Switch:SW_Push")
		(at 110.49 63.5 90)
		(unit 1)
		(exclude_from_sim no)
		(in_bom no)
		(on_board yes)
		(dnp no)
		(fields_autoplaced yes)
		(uuid "9b86d8ff-6e6f-4984-8906-d345d889d44f")
		(property "Reference" "SW_LT1"
			(at 111.76 62.23 90)
			(effects
				(font
					(size 1.27 1.27)
				)
				(justify right)
			)
		)
		(property "Value" "SW_Push"
			(at 111.76 64.77 90)
			(effects
				(font
					(size 1.27 1.27)
				)
				(justify right)
			)
		)
		(property "Footprint" "buttons:G78-side"
			(at 105.41 63.5 0)
			(effects
				(font
					(size 1.27 1.27)
				)
				(hide yes)
			)
		)
		(property "Datasheet" "https://www.aliexpress.com/item/32815761946.html"
			(at 105.41 63.5 0)
			(effects
				(font
					(size 1.27 1.27)
				)
				(hide yes)
			)
		)
		(property "Description" ""
			(at 110.49 63.5 0)
			(effects
				(font
					(size 1.27 1.27)
				)
				(hide yes)
			)
		)
		(property "LCSC Part #" ""
			(at 110.49 63.5 0)
			(effects
				(font
					(size 1.27 1.27)
				)
				(hide yes)
			)
		)
		(property "LCSC PIN" ""
			(at 110.49 63.5 0)
			(effects
				(font
					(size 1.27 1.27)
				)
				(hide yes)
			)
		)
		(pin "1"
			(uuid "496053ce-60ee-47bc-8f49-e3558b960dd4")
		)
		(pin "2"
			(uuid "3bb48d25-3e68-439c-9fee-d0e5489d32ab")
		)
		(instances
			(project "GamesMachine"
				(path "/e4a8f1f8-6edd-4300-88b6-7e19b38dbeb3/4c8cace3-ab52-4afa-9367-b5be05eac78a"
					(reference "SW_LT1")
					(unit 1)
				)
			)
		)
	)
	(symbol
		(lib_id "power:GND")
		(at 92.71 134.62 0)
		(unit 1)
		(exclude_from_sim no)
		(in_bom yes)
		(on_board yes)
		(dnp no)
		(fields_autoplaced yes)
		(uuid "9e260c54-222c-463d-b572-5db7d4246ce2")
		(property "Reference" "#PWR049"
			(at 92.71 140.97 0)
			(effects
				(font
					(size 1.27 1.27)
				)
				(hide yes)
			)
		)
		(property "Value" "GND"
			(at 92.71 139.7 0)
			(effects
				(font
					(size 1.27 1.27)
				)
			)
		)
		(property "Footprint" ""
			(at 92.71 134.62 0)
			(effects
				(font
					(size 1.27 1.27)
				)
				(hide yes)
			)
		)
		(property "Datasheet" ""
			(at 92.71 134.62 0)
			(effects
				(font
					(size 1.27 1.27)
				)
				(hide yes)
			)
		)
		(property "Description" ""
			(at 92.71 134.62 0)
			(effects
				(font
					(size 1.27 1.27)
				)
				(hide yes)
			)
		)
		(pin "1"
			(uuid "48939604-3a5c-43a7-8e98-459f2301bc6b")
		)
		(instances
			(project "GamesMachine"
				(path "/e4a8f1f8-6edd-4300-88b6-7e19b38dbeb3/4c8cace3-ab52-4afa-9367-b5be05eac78a"
					(reference "#PWR049")
					(unit 1)
				)
			)
		)
	)
	(symbol
		(lib_id "joystick:Joycon-like")
		(at 62.23 158.75 90)
		(unit 1)
		(exclude_from_sim no)
		(in_bom no)
		(on_board yes)
		(dnp no)
		(uuid "b48cde70-11a9-4a68-b39b-4e666166be59")
		(property "Reference" "U9"
			(at 62.23 161.925 90)
			(effects
				(font
					(size 1.27 1.27)
				)
			)
		)
		(property "Value" "~"
			(at 62.23 158.75 0)
			(effects
				(font
					(size 1.27 1.27)
				)
			)
		)
		(property "Footprint" "joystick:Adafruit-style-joycon"
			(at 62.23 158.75 0)
			(effects
				(font
					(size 1.27 1.27)
				)
				(hide yes)
			)
		)
		(property "Datasheet" "https://www.aliexpress.com/item/1005006099825950.html?"
			(at 62.23 158.75 0)
			(effects
				(font
					(size 1.27 1.27)
				)
				(hide yes)
			)
		)
		(property "Description" ""
			(at 62.23 158.75 0)
			(effects
				(font
					(size 1.27 1.27)
				)
				(hide yes)
			)
		)
		(property "LCSC Part #" ""
			(at 62.23 158.75 0)
			(effects
				(font
					(size 1.27 1.27)
				)
				(hide yes)
			)
		)
		(property "LCSC PIN" ""
			(at 62.23 158.75 0)
			(effects
				(font
					(size 1.27 1.27)
				)
				(hide yes)
			)
		)
		(pin "GND"
			(uuid "192f80ba-26bf-41b5-b688-7b1e9f47d773")
		)
		(pin "AD2"
			(uuid "bbbd32f6-9d69-4e37-8d6b-10f02d93d19b")
		)
		(pin "SW"
			(uuid "fd150e14-9ea6-487c-90f1-52a24f325cfd")
		)
		(pin "GND"
			(uuid "177fa029-3507-4716-95d9-09e67dda47fb")
		)
		(pin "VCC"
			(uuid "728c2420-8ebc-4f96-8202-82d834d50c3a")
		)
		(pin "GND"
			(uuid "0bc1a607-8921-4990-8f9d-2178eae73db0")
		)
		(pin "VCC"
			(uuid "f766727d-35c3-4e30-bccd-72ee17cbe180")
		)
		(pin "AD1"
			(uuid "94ee71ee-81ad-4c4a-a217-015a4559ae57")
		)
		(instances
			(project "GamesMachine"
				(path "/e4a8f1f8-6edd-4300-88b6-7e19b38dbeb3/4c8cace3-ab52-4afa-9367-b5be05eac78a"
					(reference "U9")
					(unit 1)
				)
			)
		)
	)
	(symbol
		(lib_id "power:GND")
		(at 167.64 135.89 0)
		(unit 1)
		(exclude_from_sim no)
		(in_bom yes)
		(on_board yes)
		(dnp no)
		(fields_autoplaced yes)
		(uuid "bbbf8d1b-cc62-448e-b55b-583bd475458d")
		(property "Reference" "#PWR051"
			(at 167.64 142.24 0)
			(effects
				(font
					(size 1.27 1.27)
				)
				(hide yes)
			)
		)
		(property "Value" "GND"
			(at 167.64 140.97 0)
			(effects
				(font
					(size 1.27 1.27)
				)
			)
		)
		(property "Footprint" ""
			(at 167.64 135.89 0)
			(effects
				(font
					(size 1.27 1.27)
				)
				(hide yes)
			)
		)
		(property "Datasheet" ""
			(at 167.64 135.89 0)
			(effects
				(font
					(size 1.27 1.27)
				)
				(hide yes)
			)
		)
		(property "Description" ""
			(at 167.64 135.89 0)
			(effects
				(font
					(size 1.27 1.27)
				)
				(hide yes)
			)
		)
		(pin "1"
			(uuid "0240100b-cb17-4b25-be0e-c34e03d6e5d8")
		)
		(instances
			(project "GamesMachine"
				(path "/e4a8f1f8-6edd-4300-88b6-7e19b38dbeb3/4c8cace3-ab52-4afa-9367-b5be05eac78a"
					(reference "#PWR051")
					(unit 1)
				)
			)
		)
	)
	(symbol
		(lib_id "power:GND")
		(at 63.5 100.33 0)
		(unit 1)
		(exclude_from_sim no)
		(in_bom yes)
		(on_board yes)
		(dnp no)
		(fields_autoplaced yes)
		(uuid "c232c351-786a-48c4-8fb4-b06905c517bf")
		(property "Reference" "#PWR044"
			(at 63.5 106.68 0)
			(effects
				(font
					(size 1.27 1.27)
				)
				(hide yes)
			)
		)
		(property "Value" "GND"
			(at 63.5 105.41 0)
			(effects
				(font
					(size 1.27 1.27)
				)
			)
		)
		(property "Footprint" ""
			(at 63.5 100.33 0)
			(effects
				(font
					(size 1.27 1.27)
				)
				(hide yes)
			)
		)
		(property "Datasheet" ""
			(at 63.5 100.33 0)
			(effects
				(font
					(size 1.27 1.27)
				)
				(hide yes)
			)
		)
		(property "Description" ""
			(at 63.5 100.33 0)
			(effects
				(font
					(size 1.27 1.27)
				)
				(hide yes)
			)
		)
		(pin "1"
			(uuid "e11443ba-6975-4963-8314-09223ae429f8")
		)
		(instances
			(project "GamesMachine"
				(path "/e4a8f1f8-6edd-4300-88b6-7e19b38dbeb3/4c8cace3-ab52-4afa-9367-b5be05eac78a"
					(reference "#PWR044")
					(unit 1)
				)
			)
		)
	)
	(symbol
		(lib_id "power:GND")
		(at 160.02 43.18 0)
		(unit 1)
		(exclude_from_sim no)
		(in_bom yes)
		(on_board yes)
		(dnp no)
		(fields_autoplaced yes)
		(uuid "c3281794-908c-4d07-85ca-96e9b9e2e545")
		(property "Reference" "#PWR023"
			(at 160.02 49.53 0)
			(effects
				(font
					(size 1.27 1.27)
				)
				(hide yes)
			)
		)
		(property "Value" "GND"
			(at 160.02 48.26 0)
			(effects
				(font
					(size 1.27 1.27)
				)
			)
		)
		(property "Footprint" ""
			(at 160.02 43.18 0)
			(effects
				(font
					(size 1.27 1.27)
				)
				(hide yes)
			)
		)
		(property "Datasheet" ""
			(at 160.02 43.18 0)
			(effects
				(font
					(size 1.27 1.27)
				)
				(hide yes)
			)
		)
		(property "Description" ""
			(at 160.02 43.18 0)
			(effects
				(font
					(size 1.27 1.27)
				)
				(hide yes)
			)
		)
		(pin "1"
			(uuid "a644b7f5-1eb2-43ce-ad15-1f6b1bba476b")
		)
		(instances
			(project "GamesMachine"
				(path "/e4a8f1f8-6edd-4300-88b6-7e19b38dbeb3/4c8cace3-ab52-4afa-9367-b5be05eac78a"
					(reference "#PWR023")
					(unit 1)
				)
			)
		)
	)
	(symbol
		(lib_id "Switch:SW_Push")
		(at 100.33 95.25 90)
		(unit 1)
		(exclude_from_sim no)
		(in_bom no)
		(on_board yes)
		(dnp no)
		(fields_autoplaced yes)
		(uuid "c8485e43-4eda-43c7-b0a0-bb27a5edab9a")
		(property "Reference" "SW_RD1"
			(at 101.6 93.98 90)
			(effects
				(font
					(size 1.27 1.27)
				)
				(justify right)
			)
		)
		(property "Value" "SW_Push"
			(at 101.6 96.52 90)
			(effects
				(font
					(size 1.27 1.27)
				)
				(justify right)
			)
		)
		(property "Footprint" "buttons:Silicone_contact_1.8_5mm_D7"
			(at 95.25 95.25 0)
			(effects
				(font
					(size 1.27 1.27)
				)
				(hide yes)
			)
		)
		(property "Datasheet" "https://www.aliexpress.com/item/4001360901596.html"
			(at 95.25 95.25 0)
			(effects
				(font
					(size 1.27 1.27)
				)
				(hide yes)
			)
		)
		(property "Description" ""
			(at 100.33 95.25 0)
			(effects
				(font
					(size 1.27 1.27)
				)
				(hide yes)
			)
		)
		(property "LCSC Part #" ""
			(at 100.33 95.25 0)
			(effects
				(font
					(size 1.27 1.27)
				)
				(hide yes)
			)
		)
		(property "LCSC PIN" ""
			(at 100.33 95.25 0)
			(effects
				(font
					(size 1.27 1.27)
				)
				(hide yes)
			)
		)
		(pin "1"
			(uuid "8e9b5981-9e7d-4863-9188-38c14da5ec29")
		)
		(pin "2"
			(uuid "1015314f-38ed-4362-8b44-9f84e396f75e")
		)
		(instances
			(project "GamesMachine"
				(path "/e4a8f1f8-6edd-4300-88b6-7e19b38dbeb3/4c8cace3-ab52-4afa-9367-b5be05eac78a"
					(reference "SW_RD1")
					(unit 1)
				)
			)
		)
	)
	(symbol
		(lib_id "Switch:SW_Push")
		(at 139.7 95.25 90)
		(unit 1)
		(exclude_from_sim no)
		(in_bom no)
		(on_board yes)
		(dnp no)
		(fields_autoplaced yes)
		(uuid "cc41a46f-e7a6-4369-a70c-61421c469b32")
		(property "Reference" "SW_RL1"
			(at 140.97 93.98 90)
			(effects
				(font
					(size 1.27 1.27)
				)
				(justify right)
			)
		)
		(property "Value" "SW_Push"
			(at 140.97 96.52 90)
			(effects
				(font
					(size 1.27 1.27)
				)
				(justify right)
			)
		)
		(property "Footprint" "buttons:Silicone_contact_1.8_5mm_D7"
			(at 134.62 95.25 0)
			(effects
				(font
					(size 1.27 1.27)
				)
				(hide yes)
			)
		)
		(property "Datasheet" "https://www.aliexpress.com/item/4001360901596.html"
			(at 134.62 95.25 0)
			(effects
				(font
					(size 1.27 1.27)
				)
				(hide yes)
			)
		)
		(property "Description" ""
			(at 139.7 95.25 0)
			(effects
				(font
					(size 1.27 1.27)
				)
				(hide yes)
			)
		)
		(property "LCSC Part #" ""
			(at 139.7 95.25 0)
			(effects
				(font
					(size 1.27 1.27)
				)
				(hide yes)
			)
		)
		(property "LCSC PIN" ""
			(at 139.7 95.25 0)
			(effects
				(font
					(size 1.27 1.27)
				)
				(hide yes)
			)
		)
		(pin "1"
			(uuid "c95c2bfb-b6e8-43c2-9370-8bda6a2c739a")
		)
		(pin "2"
			(uuid "67b6e03f-3421-4c24-a74b-5a57c8aa1f24")
		)
		(instances
			(project "GamesMachine"
				(path "/e4a8f1f8-6edd-4300-88b6-7e19b38dbeb3/4c8cace3-ab52-4afa-9367-b5be05eac78a"
					(reference "SW_RL1")
					(unit 1)
				)
			)
		)
	)
	(symbol
		(lib_id "Switch:SW_Push")
		(at 149.86 63.5 90)
		(unit 1)
		(exclude_from_sim no)
		(in_bom no)
		(on_board yes)
		(dnp no)
		(fields_autoplaced yes)
		(uuid "d5d0dda9-f273-47c3-b715-ee15daa2c540")
		(property "Reference" "SW_ST1"
			(at 151.13 62.23 90)
			(effects
				(font
					(size 1.27 1.27)
				)
				(justify right)
			)
		)
		(property "Value" "SW_SMALL"
			(at 151.13 64.77 90)
			(effects
				(font
					(size 1.27 1.27)
				)
				(justify right)
			)
		)
		(property "Footprint" "buttons:Silicone_contact_1.8_5mm_D7"
			(at 144.78 63.5 0)
			(effects
				(font
					(size 1.27 1.27)
				)
				(hide yes)
			)
		)
		(property "Datasheet" "https://www.aliexpress.com/item/4001360901596.html"
			(at 144.78 63.5 0)
			(effects
				(font
					(size 1.27 1.27)
				)
				(hide yes)
			)
		)
		(property "Description" ""
			(at 149.86 63.5 0)
			(effects
				(font
					(size 1.27 1.27)
				)
				(hide yes)
			)
		)
		(property "LCSC Part #" ""
			(at 149.86 63.5 0)
			(effects
				(font
					(size 1.27 1.27)
				)
				(hide yes)
			)
		)
		(property "LCSC PIN" ""
			(at 149.86 63.5 0)
			(effects
				(font
					(size 1.27 1.27)
				)
				(hide yes)
			)
		)
		(pin "1"
			(uuid "7718e88a-668b-41d0-9e7e-fb7c1fb860dc")
		)
		(pin "2"
			(uuid "515aaa7f-3237-4168-a802-401c244389f6")
		)
		(instances
			(project "GamesMachine"
				(path "/e4a8f1f8-6edd-4300-88b6-7e19b38dbeb3/4c8cace3-ab52-4afa-9367-b5be05eac78a"
					(reference "SW_ST1")
					(unit 1)
				)
			)
		)
	)
	(symbol
		(lib_id "power:GND")
		(at 100.33 100.33 0)
		(unit 1)
		(exclude_from_sim no)
		(in_bom yes)
		(on_board yes)
		(dnp no)
		(fields_autoplaced yes)
		(uuid "e0ec10b7-8e82-4af4-a263-2ca3cf87c3b3")
		(property "Reference" "#PWR045"
			(at 100.33 106.68 0)
			(effects
				(font
					(size 1.27 1.27)
				)
				(hide yes)
			)
		)
		(property "Value" "GND"
			(at 100.33 105.41 0)
			(effects
				(font
					(size 1.27 1.27)
				)
			)
		)
		(property "Footprint" ""
			(at 100.33 100.33 0)
			(effects
				(font
					(size 1.27 1.27)
				)
				(hide yes)
			)
		)
		(property "Datasheet" ""
			(at 100.33 100.33 0)
			(effects
				(font
					(size 1.27 1.27)
				)
				(hide yes)
			)
		)
		(property "Description" ""
			(at 100.33 100.33 0)
			(effects
				(font
					(size 1.27 1.27)
				)
				(hide yes)
			)
		)
		(pin "1"
			(uuid "ee5ab037-6414-4379-b750-bbc634f79908")
		)
		(instances
			(project "GamesMachine"
				(path "/e4a8f1f8-6edd-4300-88b6-7e19b38dbeb3/4c8cace3-ab52-4afa-9367-b5be05eac78a"
					(reference "#PWR045")
					(unit 1)
				)
			)
		)
	)
	(symbol
		(lib_id "Switch:SW_Push")
		(at 63.5 95.25 90)
		(unit 1)
		(exclude_from_sim no)
		(in_bom no)
		(on_board yes)
		(dnp no)
		(fields_autoplaced yes)
		(uuid "ea74a045-31b8-4b3e-b4d5-b17514f2eb4d")
		(property "Reference" "SW_RU1"
			(at 64.77 93.98 90)
			(effects
				(font
					(size 1.27 1.27)
				)
				(justify right)
			)
		)
		(property "Value" "SW_Push"
			(at 64.77 96.52 90)
			(effects
				(font
					(size 1.27 1.27)
				)
				(justify right)
			)
		)
		(property "Footprint" "buttons:Silicone_contact_1.8_5mm_D7"
			(at 58.42 95.25 0)
			(effects
				(font
					(size 1.27 1.27)
				)
				(hide yes)
			)
		)
		(property "Datasheet" "https://www.aliexpress.com/item/4001360901596.html"
			(at 58.42 95.25 0)
			(effects
				(font
					(size 1.27 1.27)
				)
				(hide yes)
			)
		)
		(property "Description" ""
			(at 63.5 95.25 0)
			(effects
				(font
					(size 1.27 1.27)
				)
				(hide yes)
			)
		)
		(property "LCSC Part #" ""
			(at 63.5 95.25 0)
			(effects
				(font
					(size 1.27 1.27)
				)
				(hide yes)
			)
		)
		(property "LCSC PIN" ""
			(at 63.5 95.25 0)
			(effects
				(font
					(size 1.27 1.27)
				)
				(hide yes)
			)
		)
		(pin "1"
			(uuid "da3a57c0-db1e-48a2-bd4a-1a4fbd618b9e")
		)
		(pin "2"
			(uuid "2b1d2b7b-05c0-43de-a930-f2e15e3f0947")
		)
		(instances
			(project "GamesMachine"
				(path "/e4a8f1f8-6edd-4300-88b6-7e19b38dbeb3/4c8cace3-ab52-4afa-9367-b5be05eac78a"
					(reference "SW_RU1")
					(unit 1)
				)
			)
		)
	)
	(symbol
		(lib_id "Switch:SW_Push")
		(at 167.64 129.54 90)
		(unit 1)
		(exclude_from_sim no)
		(in_bom no)
		(on_board yes)
		(dnp no)
		(fields_autoplaced yes)
		(uuid "f29f4ac2-22a2-4866-afa7-17f617488aba")
		(property "Reference" "SW_LR1"
			(at 168.91 128.27 90)
			(effects
				(font
					(size 1.27 1.27)
				)
				(justify right)
			)
		)
		(property "Value" "SW_Push"
			(at 168.91 130.81 90)
			(effects
				(font
					(size 1.27 1.27)
				)
				(justify right)
			)
		)
		(property "Footprint" "buttons:Silicone_contact_1.8_5mm_D7"
			(at 162.56 129.54 0)
			(effects
				(font
					(size 1.27 1.27)
				)
				(hide yes)
			)
		)
		(property "Datasheet" "https://www.aliexpress.com/item/4001360901596.html"
			(at 162.56 129.54 0)
			(effects
				(font
					(size 1.27 1.27)
				)
				(hide yes)
			)
		)
		(property "Description" ""
			(at 167.64 129.54 0)
			(effects
				(font
					(size 1.27 1.27)
				)
				(hide yes)
			)
		)
		(property "LCSC Part #" ""
			(at 167.64 129.54 0)
			(effects
				(font
					(size 1.27 1.27)
				)
				(hide yes)
			)
		)
		(property "LCSC PIN" ""
			(at 167.64 129.54 0)
			(effects
				(font
					(size 1.27 1.27)
				)
				(hide yes)
			)
		)
		(pin "1"
			(uuid "513dcb28-dce2-4b79-8f22-954f1faa2703")
		)
		(pin "2"
			(uuid "2f74eb1e-a44a-4a18-b65a-c0489dc65a4a")
		)
		(instances
			(project "GamesMachine"
				(path "/e4a8f1f8-6edd-4300-88b6-7e19b38dbeb3/4c8cace3-ab52-4afa-9367-b5be05eac78a"
					(reference "SW_LR1")
					(unit 1)
				)
			)
		)
	)
	(symbol
		(lib_id "power:GND")
		(at 132.08 134.62 0)
		(unit 1)
		(exclude_from_sim no)
		(in_bom yes)
		(on_board yes)
		(dnp no)
		(fields_autoplaced yes)
		(uuid "fa9ee7f2-99c9-487f-b12f-b407a9596e24")
		(property "Reference" "#PWR050"
			(at 132.08 140.97 0)
			(effects
				(font
					(size 1.27 1.27)
				)
				(hide yes)
			)
		)
		(property "Value" "GND"
			(at 132.08 139.7 0)
			(effects
				(font
					(size 1.27 1.27)
				)
			)
		)
		(property "Footprint" ""
			(at 132.08 134.62 0)
			(effects
				(font
					(size 1.27 1.27)
				)
				(hide yes)
			)
		)
		(property "Datasheet" ""
			(at 132.08 134.62 0)
			(effects
				(font
					(size 1.27 1.27)
				)
				(hide yes)
			)
		)
		(property "Description" ""
			(at 132.08 134.62 0)
			(effects
				(font
					(size 1.27 1.27)
				)
				(hide yes)
			)
		)
		(pin "1"
			(uuid "8d9b624e-b894-458c-b192-0b2e33d1b2c7")
		)
		(instances
			(project "GamesMachine"
				(path "/e4a8f1f8-6edd-4300-88b6-7e19b38dbeb3/4c8cace3-ab52-4afa-9367-b5be05eac78a"
					(reference "#PWR050")
					(unit 1)
				)
			)
		)
	)
)
