(footprint "joystick-B10K-1" (version 20221018) (generator pcbnew)
  (layer "F.Cu")
  (attr through_hole)
  (fp_text reference "REF**" (at 0 -0.5 unlocked) (layer "F.SilkS")
      (effects (font (size 1 1) (thickness 0.15)))
    (tstamp 104629f3-5fb6-40e8-8a7e-688c3e2817a2)
  )
  (fp_text value "joystick-B10K-1" (at 0 1 unlocked) (layer "F.Fab")
      (effects (font (size 1 1) (thickness 0.16)))
    (tstamp e4a0e6b7-0672-4539-950c-f8458711a353)
  )
  (fp_text user "${REFERENCE}" (at 0 2.5 unlocked) (layer "F.Fab")
      (effects (font (size 1 1) (thickness 0.16)))
    (tstamp 9c8fa754-a2c3-4128-b33f-eeb38a62ad55)
  )
  (fp_line (start -8.75 -8.75) (end -3 -8.75)
    (stroke (width 0.1) (type default)) (layer "F.SilkS") (tstamp 479e84f3-6eec-4e9b-98f7-7e2ad1e0335b))
  (fp_line (start -8.75 8.75) (end -8.75 -8.75)
    (stroke (width 0.1) (type default)) (layer "F.SilkS") (tstamp ec2d4300-12ac-4c0d-a1f2-e9a7ca29c6a6))
  (fp_line (start 3 -8.75) (end 8.75 -8.75)
    (stroke (width 0.1) (type default)) (layer "F.SilkS") (tstamp 693cf72a-5cac-4c35-8ef5-693d5dbd21fd))
  (fp_line (start 8.75 -8.75) (end 8.75 -3)
    (stroke (width 0.1) (type default)) (layer "F.SilkS") (tstamp e5c9b404-d8d8-4db9-bb46-1a4b6dc36b53))
  (fp_line (start 8.75 3) (end 8.75 8.75)
    (stroke (width 0.1) (type default)) (layer "F.SilkS") (tstamp 0c24c291-4720-4b08-8d80-85494cd03653))
  (fp_line (start 8.75 8.75) (end -8.75 8.75)
    (stroke (width 0.1) (type default)) (layer "F.SilkS") (tstamp c3b2938e-49a2-41e0-89a4-dea987680851))
  (fp_circle (center 0 0) (end 2.000156 0)
    (stroke (width 0.15) (type default)) (fill none) (layer "F.SilkS") (tstamp 264ecb6d-3000-4080-82c6-5e5f45f8a36e))
  (fp_circle (center 0 0) (end 4.05 0)
    (stroke (width 0.15) (type default)) (fill none) (layer "F.SilkS") (tstamp 7c12395b-9727-4eb7-93b1-5496d492fe9b))
  (fp_rect (start -8.75 -8.75) (end 8.75 8.75)
    (stroke (width 0.1) (type default)) (fill none) (layer "F.CrtYd") (tstamp 3e9e448a-ff38-4511-8412-5d90f8735e95))
  (pad "" np_thru_hole circle (at -6 -6) (size 1.6 1.6) (drill 1.6) (layers "F&B.Cu" "*.Mask") (tstamp 40149f02-b412-434a-a06e-2bf64cde39c5))
  (pad "" np_thru_hole circle (at 5.9 6) (size 1.6 1.6) (drill 1.6) (layers "F&B.Cu" "*.Mask") (tstamp 5c467d0a-b0d9-4f19-8eac-593a75423c05))
  (pad "1" thru_hole circle (at -2 -8.6) (size 1.6 1.6) (drill 1.1) (layers "*.Cu" "*.Mask") (tstamp 7990bb32-3dae-4a5f-a065-c7583fc81030))
  (pad "2" thru_hole circle (at 0 -8.6) (size 1.6 1.6) (drill 1.1) (layers "*.Cu" "*.Mask") (tstamp c10baee8-434b-4d89-974a-a54a5db32fd4))
  (pad "3" thru_hole circle (at 2 -8.6) (size 1.6 1.6) (drill 1.1) (layers "*.Cu" "*.Mask") (tstamp de958e35-6dd0-44f7-927b-d587468c14ff))
  (pad "4" thru_hole circle (at 8.6 -2) (size 1.6 1.6) (drill 1.1) (layers "*.Cu" "*.Mask") (tstamp 08f31da7-874b-41c8-b820-9a5de142eced))
  (pad "5" thru_hole circle (at 8.6 0) (size 1.6 1.6) (drill 1.1) (layers "*.Cu" "*.Mask") (tstamp 30ff1a73-02a4-47e0-b2b6-bc7024b3e452))
  (pad "6" thru_hole circle (at 8.6 2) (size 1.6 1.6) (drill 1.1) (layers "*.Cu" "*.Mask") (tstamp dd50f3c5-7b32-475a-9e25-6b44138a2d5d))
)
