(footprint "G78_Button" (version 20221018) (generator pcbnew)
  (layer "F.Cu")
  (attr through_hole)
  (fp_text reference "REF**" (at 0 -0.5 unlocked) (layer "F.SilkS")
      (effects (font (size 1 1) (thickness 0.15)))
    (tstamp fe2976ba-577c-4990-bf97-72c775d33e16)
  )
  (fp_text value "G78_Button" (at 0 1 unlocked) (layer "F.Fab")
      (effects (font (size 1 1) (thickness 0.16)))
    (tstamp fe7bf5c9-d85c-4416-b9b0-ac2524b97e0c)
  )
  (fp_text user "${REFERENCE}" (at 0 2.5 unlocked) (layer "F.Fab")
      (effects (font (size 1 1) (thickness 0.16)))
    (tstamp de401c3d-c7c6-4cf4-af1f-ac692fb09297)
  )
  (fp_rect (start -4 -4) (end 4 4)
    (stroke (width 0.15) (type default)) (fill none) (layer "F.SilkS") (tstamp 46fad5e3-8d60-4a04-a990-762d6a147d6f))
  (pad "1" thru_hole circle (at 2.55 0) (size 1.6 1.6) (drill 0.8) (layers "*.Cu" "*.Mask") (tstamp 92c743a5-8d1c-4b83-ad71-179ce588e09e))
  (pad "2" thru_hole circle (at -2.55 0) (size 1.6 1.6) (drill 0.8) (layers "*.Cu" "*.Mask") (tstamp 2618c204-bc98-4f75-8f3c-dc989f2a5531))
  (model ":KICAD7_3DMODEL_DIR:Button_Switch_THT.3dshapes/SW_PUSH_6mm_H8mm.step"
    (offset (xyz -4 3 0))
    (scale (xyz 1.333 1.33 1.33))
    (rotate (xyz 0 0 0))
  )
)
