(footprint "Adafruit-style-joycon"
	(version 20240108)
	(generator "pcbnew")
	(generator_version "8.0")
	(layer "F.Cu")
	(property "Reference" "REF**"
		(at 0 -0.5 0)
		(unlocked yes)
		(layer "F.SilkS")
		(uuid "7bcbaeee-6194-406a-8959-675ddc6186fc")
		(effects
			(font
				(size 1 1)
				(thickness 0.1)
			)
		)
	)
	(property "Value" "Adafruit-style-joycon"
		(at 0 1 0)
		(unlocked yes)
		(layer "F.Fab")
		(uuid "4da3734f-8530-49fa-9680-e68124a4eec8")
		(effects
			(font
				(size 1 1)
				(thickness 0.15)
			)
		)
	)
	(property "Footprint" ""
		(at 0 0 0)
		(layer "F.Fab")
		(hide yes)
		(uuid "e360f88d-431f-48f8-9b96-5d3aa0318a7d")
		(effects
			(font
				(size 1.27 1.27)
				(thickness 0.15)
			)
		)
	)
	(property "Datasheet" ""
		(at 0 0 0)
		(layer "F.Fab")
		(hide yes)
		(uuid "9cedec8b-850f-4578-bf4a-ad7638ac5e2c")
		(effects
			(font
				(size 1.27 1.27)
				(thickness 0.15)
			)
		)
	)
	(property "Description" ""
		(at 0 0 0)
		(layer "F.Fab")
		(hide yes)
		(uuid "f29044f0-ebea-46ab-8d08-972a9c7cdecb")
		(effects
			(font
				(size 1.27 1.27)
				(thickness 0.15)
			)
		)
	)
	(fp_line
		(start -9.15 5.15)
		(end -7.7 5.15)
		(stroke
			(width 0.1)
			(type default)
		)
		(layer "F.SilkS")
		(uuid "9ae92dce-1e02-42b2-b80b-443fa83205d1")
	)
	(fp_line
		(start -9.15 9.05)
		(end -7.7 9.05)
		(stroke
			(width 0.1)
			(type default)
		)
		(layer "F.SilkS")
		(uuid "c01b8ee2-77b7-46c8-a377-052054ed950e")
	)
	(fp_line
		(start 5.1 -11.8)
		(end 5.1 -9.95)
		(stroke
			(width 0.1)
			(type default)
		)
		(layer "F.SilkS")
		(uuid "13df83e4-7a8f-48ba-9633-5808920c2abb")
	)
	(fp_line
		(start 9 -11.8)
		(end 9 -9.95)
		(stroke
			(width 0.1)
			(type default)
		)
		(layer "F.SilkS")
		(uuid "93ce1ede-96dd-4ed0-80ba-d21b6e3220c3")
	)
	(fp_line
		(start 12.6 -9.7)
		(end 9.3 -9.7)
		(stroke
			(width 0.1)
			(type default)
		)
		(layer "F.SilkS")
		(uuid "2856364f-0b51-4a88-8791-041d6336dabf")
	)
	(fp_line
		(start 12.6 -9.7)
		(end 13.4 -9.7)
		(stroke
			(width 0.1)
			(type default)
		)
		(layer "F.SilkS")
		(uuid "defce6fe-ede1-4785-b5dd-ffdff6d547f1")
	)
	(fp_line
		(start 13.4 -9.7)
		(end 13.4 2.3)
		(stroke
			(width 0.1)
			(type default)
		)
		(layer "F.SilkS")
		(uuid "f47921b1-4a93-49ce-8462-6809d8ebaf82")
	)
	(fp_line
		(start 13.4 2.3)
		(end 9.3 2.3)
		(stroke
			(width 0.1)
			(type default)
		)
		(layer "F.SilkS")
		(uuid "bbd72a2f-d719-4761-b495-b9cc14edbb20")
	)
	(fp_rect
		(start -7.7 9.05)
		(end 9.25 -9.95)
		(stroke
			(width 0.1)
			(type default)
		)
		(fill none)
		(layer "F.SilkS")
		(uuid "0754f6bd-5803-4b96-85d9-6ba2d8a98d48")
	)
	(fp_arc
		(start -9.15 9.05)
		(mid -11.1 7.1)
		(end -9.15 5.15)
		(stroke
			(width 0.1)
			(type default)
		)
		(layer "F.SilkS")
		(uuid "49949d2a-cd11-4662-89cc-240e2ea790ca")
	)
	(fp_arc
		(start 5.1 -11.8)
		(mid 7.05 -13.75)
		(end 9 -11.8)
		(stroke
			(width 0.1)
			(type default)
		)
		(layer "F.SilkS")
		(uuid "a1f09724-ea96-4310-8ebc-3b5dcac570fc")
	)
	(fp_circle
		(center 0 0)
		(end 8 0)
		(stroke
			(width 0.1)
			(type default)
		)
		(fill none)
		(layer "F.SilkS")
		(uuid "b3f533a5-30bf-454e-9e64-38cb968097dc")
	)
	(fp_circle
		(center -9.15 7.1)
		(end -8.35 7.1)
		(stroke
			(width 0.1)
			(type default)
		)
		(fill none)
		(layer "Dwgs.User")
		(uuid "6c7dda5e-4e34-4544-a24e-0abcc2d41d94")
	)
	(fp_circle
		(center 7.05 -11.4)
		(end 7.85 -11.4)
		(stroke
			(width 0.1)
			(type default)
		)
		(fill none)
		(layer "Dwgs.User")
		(uuid "a642952b-b609-48e8-84c0-7accac7c456d")
	)
	(fp_text user "${REFERENCE}"
		(at 0 2.5 0)
		(unlocked yes)
		(layer "F.Fab")
		(uuid "c2f6e8d8-ac4d-4997-acfe-f39a7d29302a")
		(effects
			(font
				(size 1 1)
				(thickness 0.15)
			)
		)
	)
	(pad "" np_thru_hole oval
		(at -7.7 0)
		(size 1 2.5)
		(drill oval 0.6 2)
		(layers "F&B.Cu" "*.Mask")
		(uuid "84c6430e-28b2-4a0d-adc7-6a3e7afa9620")
	)
	(pad "AD1" thru_hole circle
		(at 12.6 -8.7)
		(size 1.5 1.5)
		(drill 1.2)
		(layers "*.Cu" "*.Mask")
		(remove_unused_layers no)
		(uuid "b42bd15f-465a-4cae-aa0c-fbbbc5db2f09")
	)
	(pad "AD2" thru_hole circle
		(at 12.6 -2.7)
		(size 1.5 1.5)
		(drill 1.2)
		(layers "*.Cu" "*.Mask")
		(remove_unused_layers no)
		(uuid "03dfead3-bfb9-420c-b9fc-262b4becd3c7")
	)
	(pad "GND" thru_hole circle
		(at 12.6 -6.7)
		(size 1.5 1.5)
		(drill 1.2)
		(layers "*.Cu" "*.Mask")
		(remove_unused_layers no)
		(uuid "0663a91e-c89a-4107-8d48-3fa357b2f177")
	)
	(pad "GND" thru_hole circle
		(at 12.6 -0.7)
		(size 1.5 1.5)
		(drill 1.2)
		(layers "*.Cu" "*.Mask")
		(remove_unused_layers no)
		(uuid "c21fb055-79f5-4fbb-99b1-f31ecfac24a2")
	)
	(pad "SW" thru_hole circle
		(at 12.6 -4.7)
		(size 1.5 1.5)
		(drill 1.2)
		(layers "*.Cu" "*.Mask")
		(remove_unused_layers no)
		(uuid "5fa13733-f819-4cda-89fd-b442d50b3cea")
	)
	(pad "VCC" thru_hole circle
		(at 12.6 1.3)
		(size 1.5 1.5)
		(drill 1.2)
		(layers "*.Cu" "*.Mask")
		(remove_unused_layers no)
		(uuid "8ea248c7-9510-4600-91a5-44f9223e112c")
	)
)
