(footprint "G-Switch GT-TF003-H0185-02" (version 20221018) (generator pcbnew)
  (layer "F.Cu")
  (attr smd)
  (fp_text reference "REF**" (at 0 2.5) (layer "F.SilkS") hide
      (effects (font (size 1 1) (thickness 0.15)))
    (tstamp 7fa9e732-d8b6-4a5f-80d7-dca0ab1476ea)
  )
  (fp_text value "G-Switch GT-TF003-H0185-02" (at 0 -2.5) (layer "F.Fab")
      (effects (font (size 1 1) (thickness 0.15)))
    (tstamp c7fade25-4d2a-46ae-ac51-697e1fa6a37b)
  )
  (fp_line (start -5.25 9.6) (end -5.25 2.1)
    (stroke (width 0.15) (type default)) (layer "F.SilkS") (tstamp fb4e035c-91ea-4798-97e5-ed656be978d0))
  (fp_line (start -5.25 15.2) (end -5.25 12)
    (stroke (width 0.15) (type default)) (layer "F.SilkS") (tstamp 95608df0-2032-4347-b3b9-36f5a339a276))
  (fp_line (start 4.9 0.7) (end 8 0.7)
    (stroke (width 0.15) (type default)) (layer "F.SilkS") (tstamp 2c76e3c0-8bb3-42e5-9cd5-d31e5f790d4f))
  (fp_line (start 9.55 2.15) (end 9.55 9.55)
    (stroke (width 0.15) (type default)) (layer "F.SilkS") (tstamp 8dc5a738-bab5-4d4c-81fc-859460a31c30))
  (fp_line (start 9.55 12.05) (end 9.55 15.2)
    (stroke (width 0.15) (type default)) (layer "F.SilkS") (tstamp 06ed227d-39a6-4161-95cc-512305a6be7a))
  (fp_line (start 9.55 15.2) (end -5.25 15.2)
    (stroke (width 0.1) (type default)) (layer "F.SilkS") (tstamp e70979f9-4ac1-4efd-8f7a-7f4e4cb7375e))
  (fp_line (start -5 -1.75) (end 5 -1.75)
    (stroke (width 0.05) (type default)) (layer "F.CrtYd") (tstamp b3490705-cd9b-4982-b4ef-0febaccd1a38))
  (fp_line (start -5 1.25) (end -5 -1.75)
    (stroke (width 0.05) (type default)) (layer "F.CrtYd") (tstamp 33f9dcb7-9b37-460e-aeea-9b5d26eb04de))
  (fp_line (start 5 -1.75) (end 5 1.25)
    (stroke (width 0.05) (type default)) (layer "F.CrtYd") (tstamp 8c76b49e-fcac-43f2-b857-5da003257685))
  (fp_line (start 5 1.25) (end -5 1.25)
    (stroke (width 0.05) (type default)) (layer "F.CrtYd") (tstamp 78e3207e-2ad7-4793-8237-6987410d77f3))
  (pad "" np_thru_hole circle (at -2.8 11.2) (size 0.1 0.1) (drill 1) (layers "F&B.Cu" "*.Mask") (tstamp 8c2179dc-87e1-49e6-9e19-640cef92e744))
  (pad "" np_thru_hole circle (at 5.2 11.2) (size 0.1 0.1) (drill 1) (layers "F&B.Cu" "*.Mask") (tstamp 46774437-58f1-43c3-ad0f-dc1c64142921))
  (pad "1" smd roundrect (at -4.4 -0.3) (size 0.7 2.6) (layers "F.Cu" "F.Paste" "F.Mask") (roundrect_rratio 0.25)
    (thermal_bridge_angle 45) (tstamp 9ba713e8-49e5-4ed1-a412-8c4b5223006a))
  (pad "2" smd roundrect (at -3.3 -0.3) (size 0.7 2.6) (layers "F.Cu" "F.Paste" "F.Mask") (roundrect_rratio 0.25)
    (thermal_bridge_angle 45) (tstamp 646e738c-c179-4fe1-905d-c5b4f2d2e88b))
  (pad "3" smd roundrect (at -2.2 -0.3) (size 0.7 2.6) (layers "F.Cu" "F.Paste" "F.Mask") (roundrect_rratio 0.25)
    (thermal_bridge_angle 45) (tstamp 292fbe3e-a8d8-4fe2-8c8a-80d853a22f6d))
  (pad "4" smd roundrect (at -1.1 -0.3) (size 0.7 2.6) (layers "F.Cu" "F.Paste" "F.Mask") (roundrect_rratio 0.25)
    (thermal_bridge_angle 45) (tstamp dd50cb04-d3a6-467d-9ed2-adf686a55cea))
  (pad "5" smd roundrect (at 0 -0.3) (size 0.7 2.6) (layers "F.Cu" "F.Paste" "F.Mask") (roundrect_rratio 0.25)
    (thermal_bridge_angle 45) (tstamp 62443e69-2712-4110-99d4-151366baf70f))
  (pad "6" smd roundrect (at 1.1 -0.3) (size 0.7 2.6) (layers "F.Cu" "F.Paste" "F.Mask") (roundrect_rratio 0.25)
    (thermal_bridge_angle 45) (tstamp 7378f45d-5be4-41e0-8288-baef1b26de0f))
  (pad "7" smd roundrect (at 2.2 -0.3) (size 0.7 2.6) (layers "F.Cu" "F.Paste" "F.Mask") (roundrect_rratio 0.25)
    (thermal_bridge_angle 45) (tstamp 2095a5af-7e54-450e-9f26-a47197b20a1b))
  (pad "8" smd roundrect (at 3.3 -0.3) (size 0.7 2.6) (layers "F.Cu" "F.Paste" "F.Mask") (roundrect_rratio 0.25)
    (thermal_bridge_angle 45) (tstamp e5e2d126-5c99-4d6d-9ddf-4883e5d44bcd))
  (pad "9" smd roundrect (at 4.4 -0.3) (size 0.7 2.6) (layers "F.Cu" "F.Paste" "F.Mask") (roundrect_rratio 0.25)
    (thermal_bridge_angle 45) (tstamp 30000d89-b1a0-423d-ae57-a3420cf98b34))
  (pad "10" smd roundrect (at -6.1 1.2) (size 2.2 1.5) (layers "F.Cu" "F.Paste" "F.Mask") (roundrect_rratio 0.25) (tstamp 2540c2b2-4fd0-4c68-b7a1-d9c9f6d18eb7))
  (pad "10" smd roundrect (at -6.1 10.8) (size 2.2 2.2) (layers "F.Cu" "F.Paste" "F.Mask") (roundrect_rratio 0.25) (tstamp d1629525-c088-4d84-b690-3bfd24d1957e))
  (pad "10" smd roundrect (at 9.5 1.2) (size 2.6 1.5) (layers "F.Cu" "F.Paste" "F.Mask") (roundrect_rratio 0.25) (tstamp faec2065-7018-4f68-9ca7-8566e847ee2f))
  (pad "10" smd roundrect (at 10.4 10.8) (size 2.2 2.2) (layers "F.Cu" "F.Paste" "F.Mask") (roundrect_rratio 0.25) (tstamp a6fb24f3-b3ab-4a0a-9c53-eb6a6e8723ed))
)
