(footprint "BC4-3PD_w-Battery_holder" (version 20221018) (generator pcbnew)
  (layer "F.Cu")
  (attr smd)
  (fp_text reference "REF**" (at -6.9 -27 unlocked) (layer "F.SilkS")
      (effects (font (size 1 1) (thickness 0.1)))
    (tstamp e5b5fbc1-7e49-45cb-b32d-757c4e0e4e17)
  )
  (fp_text value "BC4-3PD_w-Battery_holder" (at -6.9 -25.5 unlocked) (layer "F.Fab")
      (effects (font (size 1 1) (thickness 0.15)))
    (tstamp a7a28ad3-dd3a-48d5-b2a4-b9aaabfaef6f)
  )
  (fp_text user "${REFERENCE}" (at -6.9 -24 unlocked) (layer "F.Fab")
      (effects (font (size 1 1) (thickness 0.15)))
    (tstamp 895a0431-0271-482e-9713-e3d7b0113aa8)
  )
  (fp_line (start -20 29.5) (end -20 -29.5)
    (stroke (width 0.1) (type default)) (layer "F.SilkS") (tstamp 04efe7f3-e539-4598-ac99-0003f2b29b3f))
  (fp_line (start -17.5 -32) (end -10 -32)
    (stroke (width 0.1) (type default)) (layer "F.SilkS") (tstamp 06bb4297-1001-43ae-85b9-2e3b21288f6b))
  (fp_line (start -17.5 32) (end -10 32)
    (stroke (width 0.1) (type default)) (layer "F.SilkS") (tstamp f4f54c03-16e1-4c5f-a1d1-03c8bcc22cf8))
  (fp_line (start -8 -38) (end -8 -34)
    (stroke (width 0.1) (type default)) (layer "F.SilkS") (tstamp 0104a99f-71d3-45b0-9eb0-0418d8118a3a))
  (fp_line (start -6 36) (end 18 36)
    (stroke (width 0.1) (type default)) (layer "F.SilkS") (tstamp 269bc51b-917c-46cf-a145-c8d5dd751887))
  (fp_line (start 8 -40) (end -6 -40)
    (stroke (width 0.1) (type default)) (layer "F.SilkS") (tstamp 0f926a30-cea4-4767-9c18-703ef87ef2c0))
  (fp_line (start 12 -36) (end 18 -36)
    (stroke (width 0.1) (type default)) (layer "F.SilkS") (tstamp 82b07ddb-6f69-49e6-a067-0070bcd549a8))
  (fp_line (start 20 -34) (end 20 34)
    (stroke (width 0.1) (type default)) (layer "F.SilkS") (tstamp abed888b-34ad-452f-b2cc-0e480be50f9d))
  (fp_rect (start -17.5 -29.5) (end 17.5 29.5)
    (stroke (width 0.1) (type default)) (fill none) (layer "F.SilkS") (tstamp df4da787-2b18-434d-b124-4bff465a8ba4))
  (fp_rect (start -2.7 -28.3) (end -11.1 -24.9)
    (stroke (width 0.1) (type default)) (fill none) (layer "F.SilkS") (tstamp a2f37cd2-75b8-4318-9d72-a9c13aa21eee))
  (fp_arc (start -20 -29.5) (mid -19.267767 -31.267767) (end -17.5 -32)
    (stroke (width 0.1) (type default)) (layer "F.SilkS") (tstamp 0c1fc63f-c1c8-4c72-a4ed-9246c8f7fcad))
  (fp_arc (start -17.5 32) (mid -19.267767 31.267767) (end -20 29.5)
    (stroke (width 0.1) (type default)) (layer "F.SilkS") (tstamp 770b61fd-de6e-462c-bd3d-77d2228b3a10))
  (fp_arc (start -10 32) (mid -8.585786 32.585786) (end -8 34)
    (stroke (width 0.1) (type default)) (layer "F.SilkS") (tstamp c5966837-3cac-4c05-b577-7cc2299cc454))
  (fp_arc (start -8 -38) (mid -7.414214 -39.414214) (end -6 -40)
    (stroke (width 0.1) (type default)) (layer "F.SilkS") (tstamp c1689da6-9641-43d4-bce4-2e36fd912d88))
  (fp_arc (start -8 -34) (mid -8.585786 -32.585786) (end -10 -32)
    (stroke (width 0.1) (type default)) (layer "F.SilkS") (tstamp 23e3b7d4-ad7b-49b5-8875-a97fa82f0811))
  (fp_arc (start -6 36) (mid -7.414214 35.414214) (end -8 34)
    (stroke (width 0.1) (type default)) (layer "F.SilkS") (tstamp 54133866-dff3-4b29-8422-ce893236ad69))
  (fp_arc (start 8 -40) (mid 9.414214 -39.414214) (end 10 -38)
    (stroke (width 0.1) (type default)) (layer "F.SilkS") (tstamp 6a8569fb-39f8-4a0b-9905-1238524932be))
  (fp_arc (start 12 -36) (mid 10.585786 -36.585786) (end 10 -38)
    (stroke (width 0.1) (type default)) (layer "F.SilkS") (tstamp 6180371e-7022-4017-b5b8-af92d56a73e7))
  (fp_arc (start 18 -36) (mid 19.414214 -35.414214) (end 20 -34)
    (stroke (width 0.1) (type default)) (layer "F.SilkS") (tstamp 9b4bb3e1-1911-4049-8910-88ce5960ae6b))
  (fp_arc (start 20 34) (mid 19.414214 35.414214) (end 18 36)
    (stroke (width 0.1) (type default)) (layer "F.SilkS") (tstamp 4620dcb8-f723-4ea9-bcc8-4dadf1574c85))
  (fp_line (start -10.4 -24) (end -9.4 -24)
    (stroke (width 0.1) (type default)) (layer "Dwgs.User") (tstamp 1a305afa-4b95-462c-9530-282f70e4c8fa))
  (fp_line (start -7.4 -24) (end -6.35 -24)
    (stroke (width 0.1) (type default)) (layer "Dwgs.User") (tstamp 98f1234d-1e6e-4597-84f2-2f4361dd5cce))
  (fp_line (start -4.4 -24) (end -3.4 -24)
    (stroke (width 0.1) (type default)) (layer "Dwgs.User") (tstamp b55b1fe4-7580-4e24-9b35-94b077e8df11))
  (fp_rect (start -17.4 -24) (end 16.7 29.3)
    (stroke (width 0.1) (type solid)) (fill none) (layer "Dwgs.User") (tstamp ad867bf2-073f-4dda-9ed1-63dcc7e31ac0))
  (fp_rect (start -10.4 -24.9) (end -9.4 -23.15)
    (stroke (width 0.1) (type default)) (fill none) (layer "Dwgs.User") (tstamp 54d0a21d-906b-42c7-a4fd-c7e486f11528))
  (fp_rect (start -7.4 -24.9) (end -6.4 -23.15)
    (stroke (width 0.1) (type default)) (fill none) (layer "Dwgs.User") (tstamp 60ae9963-ac07-4b04-944c-b046ecef4999))
  (fp_rect (start -4.4 -24.9) (end -3.4 -23.15)
    (stroke (width 0.1) (type default)) (fill none) (layer "Dwgs.User") (tstamp 8363db5c-a3ba-4ca3-8f83-63ecc6dd68b0))
  (pad "" np_thru_hole circle (at -8.4 -26.5) (size 0.9 0.9) (drill 0.9) (layers "F&B.Cu" "*.Mask") (tstamp 24ef6133-cca2-43c9-a392-cd4b26ad96d9))
  (pad "" np_thru_hole circle (at -6 -34) (size 2.2 2.2) (drill 2.2) (layers "F&B.Cu" "*.Mask") (tstamp d4d06999-55d0-41fa-b711-485946dd7e10))
  (pad "" np_thru_hole circle (at -6 34) (size 2.2 2.2) (drill 2.2) (layers "F&B.Cu" "*.Mask") (tstamp 70c9cfb1-7753-46dd-8fe3-8f7dd71514f7))
  (pad "" np_thru_hole circle (at -5.4 -26.5) (size 0.9 0.9) (drill 0.9) (layers "F&B.Cu" "*.Mask") (tstamp 4419e0c7-b2bd-4af2-a4ba-7a2e93f64c3a))
  (pad "" np_thru_hole circle (at 15 -34) (size 2.2 2.2) (drill 2.2) (layers "F&B.Cu" "*.Mask") (tstamp 8854b64c-1ad5-4293-b39d-f68c3c4ffec8))
  (pad "" np_thru_hole circle (at 15 34) (size 2.2 2.2) (drill 2.2) (layers "F&B.Cu" "*.Mask") (tstamp 6bd64bee-1c8d-42ca-b418-152ed5986b46))
  (pad "1" smd roundrect (at -9.9 -28.3) (size 1 1.7) (layers "F.Cu" "F.Paste" "F.Mask") (roundrect_rratio 0.25) (tstamp 26d0e138-f118-483b-a9b5-e981a270be71))
  (pad "2" smd roundrect (at -6.9 -28.3) (size 1 1.7) (layers "F.Cu" "F.Paste" "F.Mask") (roundrect_rratio 0.25) (tstamp c161709d-576f-4a06-b767-166b5c178794))
  (pad "2" smd roundrect (at -3.9 -28.3) (size 1 1.7) (layers "F.Cu" "F.Paste" "F.Mask") (roundrect_rratio 0.25) (tstamp d4d136f5-a190-4694-bf94-08a171255cd6))
  (pad "3" smd roundrect (at -8.05 -23.95) (size 1.7 1.5) (layers "F.Cu" "F.Paste" "F.Mask") (roundrect_rratio 0.25) (tstamp 99bc1ec9-da5f-4718-a8e0-ac47b9f77c37))
  (pad "4" smd roundrect (at -5.05 -23.95) (size 1.7 1.5) (layers "F.Cu" "F.Paste" "F.Mask") (roundrect_rratio 0.25) (tstamp b5ac6a49-74a3-4992-b75d-4f9c69a3fce1))
)
