(footprint "SOP-16_Handsolder" (version 20221018) (generator pcbnew)
  (layer "F.Cu")
  (attr smd)
  (fp_text reference "REF**" (at 0 -0.5 unlocked) (layer "F.SilkS")
      (effects (font (size 1 1) (thickness 0.15)))
    (tstamp 5998f57d-42d3-4cba-b141-83820ff788aa)
  )
  (fp_text value "SOP-16_Handsolder" (at 0 1 unlocked) (layer "F.Fab")
      (effects (font (size 1 1) (thickness 0.15)))
    (tstamp 2eb2e4cc-5072-4917-8678-651b41d9c615)
  )
  (fp_text user "${REFERENCE}" (at 0 0) (layer "F.Fab")
      (effects (font (size 0.98 0.98) (thickness 0.15)))
    (tstamp 56e8e912-a60f-4bb5-afb4-d30bc3da47f2)
  )
  (fp_line (start 0 -5.06) (end -3.5 -5.06)
    (stroke (width 0.12) (type solid)) (layer "F.SilkS") (tstamp 60f9e846-819d-4d90-a7ef-f5257facd097))
  (fp_line (start 0 -5.06) (end 1.95 -5.06)
    (stroke (width 0.12) (type solid)) (layer "F.SilkS") (tstamp 8977c9bf-e97f-43c6-9230-9692d5e57b30))
  (fp_line (start 0 5.06) (end -1.95 5.06)
    (stroke (width 0.12) (type solid)) (layer "F.SilkS") (tstamp d7f882da-e63f-4077-ad9a-0f1fbf94d963))
  (fp_line (start 0 5.06) (end 1.95 5.06)
    (stroke (width 0.12) (type solid)) (layer "F.SilkS") (tstamp 9b8c42a9-b633-4e26-b3f2-42387954ee77))
  (fp_line (start -4.7 -5.2) (end -4.7 5.2)
    (stroke (width 0.05) (type solid)) (layer "F.CrtYd") (tstamp 81bdb903-f9c9-4914-92ca-3f6ea146a9bc))
  (fp_line (start -4.7 5.2) (end 4.7 5.2)
    (stroke (width 0.05) (type solid)) (layer "F.CrtYd") (tstamp a8734d0a-2d92-4360-b553-c6883cf675bf))
  (fp_line (start 4.7 -5.2) (end -4.7 -5.2)
    (stroke (width 0.05) (type solid)) (layer "F.CrtYd") (tstamp 6ae5053e-27cb-4fea-9f0e-a0d9cf5ff511))
  (fp_line (start 4.7 5.2) (end 4.7 -5.2)
    (stroke (width 0.05) (type solid)) (layer "F.CrtYd") (tstamp 378596f7-bf8b-455c-bb5d-a56f0326b80a))
  (fp_line (start -1.95 -3.975) (end -0.975 -4.95)
    (stroke (width 0.1) (type solid)) (layer "F.Fab") (tstamp 8ec1e3c9-6e50-40bf-9ff7-45cd719cc8ba))
  (fp_line (start -1.95 4.95) (end -1.95 -3.975)
    (stroke (width 0.1) (type solid)) (layer "F.Fab") (tstamp e3fd7dc5-d5ae-4dfa-896e-2e82940b0b83))
  (fp_line (start -0.975 -4.95) (end 1.95 -4.95)
    (stroke (width 0.1) (type solid)) (layer "F.Fab") (tstamp a27afb7c-7432-4838-b7c0-9c38cc4a4427))
  (fp_line (start 1.95 -4.95) (end 1.95 4.95)
    (stroke (width 0.1) (type solid)) (layer "F.Fab") (tstamp 1161f6fe-09ff-4e40-b15b-846f4c89f4ad))
  (fp_line (start 1.95 4.95) (end -1.95 4.95)
    (stroke (width 0.1) (type solid)) (layer "F.Fab") (tstamp a85b0881-d87c-42b4-a125-7158485ac16c))
  (pad "1" smd roundrect (at -3 -4.445) (size 3 0.6) (layers "F.Cu" "F.Paste" "F.Mask") (roundrect_rratio 0.25) (tstamp 06b2dda4-03eb-413c-b94c-6cc1b78b8999))
  (pad "2" smd roundrect (at -3 -3.175) (size 3 0.6) (layers "F.Cu" "F.Paste" "F.Mask") (roundrect_rratio 0.25) (tstamp 0ab8689e-5ba2-4978-b0fb-17f9f63eec47))
  (pad "3" smd roundrect (at -3 -1.905) (size 3 0.6) (layers "F.Cu" "F.Paste" "F.Mask") (roundrect_rratio 0.25) (tstamp 3a175e0d-13dc-4e6c-9afb-ec90824d585d))
  (pad "4" smd roundrect (at -3 -0.635) (size 3 0.6) (layers "F.Cu" "F.Paste" "F.Mask") (roundrect_rratio 0.25) (tstamp 7e033bca-d4e0-4491-b99f-f03b022fd1c9))
  (pad "5" smd roundrect (at -3 0.635) (size 3 0.6) (layers "F.Cu" "F.Paste" "F.Mask") (roundrect_rratio 0.25) (tstamp ba48cb34-ec10-4417-b040-cacdbbd335dc))
  (pad "6" smd roundrect (at -3 1.905) (size 3 0.6) (layers "F.Cu" "F.Paste" "F.Mask") (roundrect_rratio 0.25) (tstamp 4a2ed0a3-de05-4cc0-bd19-dd578e835c58))
  (pad "7" smd roundrect (at -3 3.175) (size 3 0.6) (layers "F.Cu" "F.Paste" "F.Mask") (roundrect_rratio 0.25) (tstamp 4f17a505-1463-43b7-b98e-56014b356fa8))
  (pad "8" smd roundrect (at -3 4.445) (size 3 0.6) (layers "F.Cu" "F.Paste" "F.Mask") (roundrect_rratio 0.25) (tstamp b0ad71b1-2b68-4c3d-8ee9-ac23c95b762d))
  (pad "9" smd roundrect (at 3 4.445) (size 3 0.6) (layers "F.Cu" "F.Paste" "F.Mask") (roundrect_rratio 0.25) (tstamp d4c95f12-4f46-43ad-8abb-dc110789e0c8))
  (pad "10" smd roundrect (at 3 3.175) (size 3 0.6) (layers "F.Cu" "F.Paste" "F.Mask") (roundrect_rratio 0.25) (tstamp 15bfd438-c2a2-4275-b244-4e77c0e933d7))
  (pad "11" smd roundrect (at 3 1.905) (size 3 0.6) (layers "F.Cu" "F.Paste" "F.Mask") (roundrect_rratio 0.25) (tstamp 40674e20-8ad4-4a38-a237-733ebc9931e6))
  (pad "12" smd roundrect (at 3 0.635) (size 3 0.6) (layers "F.Cu" "F.Paste" "F.Mask") (roundrect_rratio 0.25) (tstamp 21e749d9-6858-43dd-bcd0-26823f2e7454))
  (pad "13" smd roundrect (at 3 -0.635) (size 3 0.6) (layers "F.Cu" "F.Paste" "F.Mask") (roundrect_rratio 0.25) (tstamp 8da6f5d3-046d-4f23-9f63-f60b03bf2859))
  (pad "14" smd roundrect (at 3 -1.905) (size 3 0.6) (layers "F.Cu" "F.Paste" "F.Mask") (roundrect_rratio 0.25) (tstamp becee768-af36-4f0f-9924-180edb029771))
  (pad "15" smd roundrect (at 3 -3.175) (size 3 0.6) (layers "F.Cu" "F.Paste" "F.Mask") (roundrect_rratio 0.25) (tstamp 9e3e156f-72fd-45b0-942f-fa1a78dbb830))
  (pad "16" smd roundrect (at 3 -4.445) (size 3 0.6) (layers "F.Cu" "F.Paste" "F.Mask") (roundrect_rratio 0.25) (tstamp 42494596-cb78-4546-8982-f3ff77f989a5))
  (model ":KICAD7_3DMODEL_DIR:Package_SO.3dshapes/SOP-16_4.4x10.4mm_P1.27mm.step"
    (offset (xyz 0 0 0))
    (scale (xyz 1 1 1))
    (rotate (xyz 0 0 0))
  )
)
