(footprint "faceplate"
	(version 20240108)
	(generator "pcbnew")
	(generator_version "8.0")
	(layer "F.Cu")
	(property "Reference" "REF**"
		(at 0 -0.5 0)
		(unlocked yes)
		(layer "F.SilkS")
		(uuid "0bf96a0a-9900-4a50-9f3c-e72cb38e3525")
		(effects
			(font
				(size 1 1)
				(thickness 0.1)
			)
		)
	)
	(property "Value" "faceplate"
		(at 0 1 0)
		(unlocked yes)
		(layer "F.Fab")
		(uuid "2f2bb5d3-6a2d-48f7-8324-62a36fc6e44d")
		(effects
			(font
				(size 1 1)
				(thickness 0.15)
			)
		)
	)
	(property "Footprint" ""
		(at 0 0 0)
		(layer "F.Fab")
		(hide yes)
		(uuid "3997e63d-46d2-4e0b-89f2-5ffb31e7eb4f")
		(effects
			(font
				(size 1.27 1.27)
				(thickness 0.15)
			)
		)
	)
	(property "Datasheet" ""
		(at 0 0 0)
		(layer "F.Fab")
		(hide yes)
		(uuid "e57fee76-e27e-4c2a-9cc2-bc140beb6d7e")
		(effects
			(font
				(size 1.27 1.27)
				(thickness 0.15)
			)
		)
	)
	(property "Description" ""
		(at 0 0 0)
		(layer "F.Fab")
		(hide yes)
		(uuid "56c2c54c-31f5-4d61-b036-610d872c64ab")
		(effects
			(font
				(size 1.27 1.27)
				(thickness 0.15)
			)
		)
	)
	(attr smd)
	(fp_line
		(start -63.5 3)
		(end -63.5 -17)
		(stroke
			(width 0.1)
			(type default)
		)
		(layer "F.SilkS")
		(uuid "f9dd0b76-6699-44d6-bdb5-765d2aab2d2b")
	)
	(fp_line
		(start -62.5 -18)
		(end -33.5 -18)
		(stroke
			(width 0.1)
			(type default)
		)
		(layer "F.SilkS")
		(uuid "46dd8466-6845-4041-bfbe-47f8ebffeb6b")
	)
	(fp_line
		(start -53.75 4)
		(end -62.5 4)
		(stroke
			(width 0.1)
			(type default)
		)
		(layer "F.SilkS")
		(uuid "dcd689ad-75cf-4302-a50c-db2cdc65dfa9")
	)
	(fp_line
		(start -53 4.75)
		(end -53 11.5)
		(stroke
			(width 0.1)
			(type default)
		)
		(layer "F.SilkS")
		(uuid "78d99308-1e80-4fa3-834d-fc05e2b4bbf7")
	)
	(fp_line
		(start -43.5 12.5)
		(end -52 12.5)
		(stroke
			(width 0.1)
			(type default)
		)
		(layer "F.SilkS")
		(uuid "238d0c69-8dd9-4c63-a739-600ac9f095c6")
	)
	(fp_line
		(start -42.5 10.5)
		(end -42.5 11.5)
		(stroke
			(width 0.1)
			(type default)
		)
		(layer "F.SilkS")
		(uuid "5d2bd96f-0914-4a17-84dc-b73c5aa571dc")
	)
	(fp_line
		(start -42.207107 9.792893)
		(end -42.207107 9.792893)
		(stroke
			(width 0.1)
			(type default)
		)
		(layer "F.SilkS")
		(uuid "e145de13-d962-4fd8-ad69-838b86ef6942")
	)
	(fp_line
		(start -33.5 9.5)
		(end -41.5 9.5)
		(stroke
			(width 0.1)
			(type default)
		)
		(layer "F.SilkS")
		(uuid "873585e6-b9a8-4ff0-a93f-b0d1b56f1dc3")
	)
	(fp_line
		(start -33.5 32.5)
		(end -33.5 28)
		(stroke
			(width 0.1)
			(type default)
		)
		(layer "F.SilkS")
		(uuid "64bed260-3125-4e72-9398-095630b3d467")
	)
	(fp_line
		(start -32.5 8.499999)
		(end -32.5 -17)
		(stroke
			(width 0.1)
			(type default)
		)
		(layer "F.SilkS")
		(uuid "4c65dfda-edff-467c-97ee-897fafb2a37e")
	)
	(fp_line
		(start -28.75 27)
		(end -32.5 27)
		(stroke
			(width 0.1)
			(type default)
		)
		(layer "F.SilkS")
		(uuid "76bfd498-7b65-43bc-8e8a-f218f2016701")
	)
	(fp_line
		(start -27.75 23)
		(end -27.749999 23)
		(stroke
			(width 0.1)
			(type default)
		)
		(layer "F.SilkS")
		(uuid "5f204eb8-3a42-4d3f-9b19-7c7b4d8dca67")
	)
	(fp_line
		(start -27.749999 23)
		(end -27.75 26)
		(stroke
			(width 0.1)
			(type default)
		)
		(layer "F.SilkS")
		(uuid "d1565579-d890-4524-a5dd-f43e1d718c80")
	)
	(fp_line
		(start -26.749999 22)
		(end -17 22)
		(stroke
			(width 0.1)
			(type default)
		)
		(layer "F.SilkS")
		(uuid "5ce563b0-fd4f-4cf2-9e34-cecdfd56dd32")
	)
	(fp_line
		(start -17 33.5)
		(end -32.5 33.5)
		(stroke
			(width 0.1)
			(type default)
		)
		(layer "F.SilkS")
		(uuid "27310e44-0ca5-4900-b552-f734256d7dad")
	)
	(fp_line
		(start -16 32.5)
		(end -16 23)
		(stroke
			(width 0.1)
			(type default)
		)
		(layer "F.SilkS")
		(uuid "55eda973-bbe2-4c90-9711-d8f7b4f5bc48")
	)
	(fp_line
		(start 16 32.5)
		(end 16 23)
		(stroke
			(width 0.1)
			(type default)
		)
		(layer "F.SilkS")
		(uuid "8493840c-5b5f-4acb-bb04-4969e1ef1f13")
	)
	(fp_line
		(start 17 33.5)
		(end 32.5 33.5)
		(stroke
			(width 0.1)
			(type default)
		)
		(layer "F.SilkS")
		(uuid "3d54759e-0ea5-47ad-971d-1da1d707e1fd")
	)
	(fp_line
		(start 26.749999 22)
		(end 17 22)
		(stroke
			(width 0.1)
			(type default)
		)
		(layer "F.SilkS")
		(uuid "6570e00c-96ba-4b32-a44a-67a9ee6b8757")
	)
	(fp_line
		(start 27.749999 23)
		(end 27.75 26)
		(stroke
			(width 0.1)
			(type default)
		)
		(layer "F.SilkS")
		(uuid "088aec48-4131-4623-ad49-4a75fdf97cf9")
	)
	(fp_line
		(start 27.75 23)
		(end 27.749999 23)
		(stroke
			(width 0.1)
			(type default)
		)
		(layer "F.SilkS")
		(uuid "ddf97526-db2e-43d5-ac88-08149287cd10")
	)
	(fp_line
		(start 28.75 27)
		(end 32.5 27)
		(stroke
			(width 0.1)
			(type default)
		)
		(layer "F.SilkS")
		(uuid "875f26d7-108d-4bc4-a955-fbf57d4afae1")
	)
	(fp_line
		(start 32.5 8.499999)
		(end 32.5 -17)
		(stroke
			(width 0.1)
			(type default)
		)
		(layer "F.SilkS")
		(uuid "5348735e-3c50-405d-b1ab-2d1bf2f6a25f")
	)
	(fp_line
		(start 33.5 9.5)
		(end 41.5 9.5)
		(stroke
			(width 0.1)
			(type default)
		)
		(layer "F.SilkS")
		(uuid "3f5d1229-0cfd-4804-8a19-f57228b279dd")
	)
	(fp_line
		(start 33.5 32.5)
		(end 33.5 28)
		(stroke
			(width 0.1)
			(type default)
		)
		(layer "F.SilkS")
		(uuid "a4758bcb-1c27-4518-a2db-ec9972c6a0eb")
	)
	(fp_line
		(start 42.207107 9.792893)
		(end 42.207107 9.792893)
		(stroke
			(width 0.1)
			(type default)
		)
		(layer "F.SilkS")
		(uuid "b578af7d-606b-474a-89af-923f0e05a07e")
	)
	(fp_line
		(start 42.5 10.5)
		(end 42.5 11.5)
		(stroke
			(width 0.1)
			(type default)
		)
		(layer "F.SilkS")
		(uuid "4e03a110-099f-4c4f-9960-42e479c6a195")
	)
	(fp_line
		(start 43.5 12.5)
		(end 52 12.5)
		(stroke
			(width 0.1)
			(type default)
		)
		(layer "F.SilkS")
		(uuid "25969c45-21e5-49f4-9adf-041f4cbe2017")
	)
	(fp_line
		(start 53 4.75)
		(end 53 11.5)
		(stroke
			(width 0.1)
			(type default)
		)
		(layer "F.SilkS")
		(uuid "b804eb63-82cc-45e0-bdf1-4c148fa58bdd")
	)
	(fp_line
		(start 53.75 4)
		(end 62.5 4)
		(stroke
			(width 0.1)
			(type default)
		)
		(layer "F.SilkS")
		(uuid "7e924ada-d944-4eee-ba7a-bbad11bf7744")
	)
	(fp_line
		(start 62.5 -18)
		(end 33.5 -18)
		(stroke
			(width 0.1)
			(type default)
		)
		(layer "F.SilkS")
		(uuid "ade78621-8c7e-4e5d-91ad-e88dde877d82")
	)
	(fp_line
		(start 63.5 3)
		(end 63.5 -17)
		(stroke
			(width 0.1)
			(type default)
		)
		(layer "F.SilkS")
		(uuid "2548c158-f312-47cf-b5ab-bcd822c42b5f")
	)
	(fp_arc
		(start -63.5 -17)
		(mid -63.207107 -17.707107)
		(end -62.5 -18)
		(stroke
			(width 0.1)
			(type default)
		)
		(layer "F.SilkS")
		(uuid "aae50e7d-ed38-4b65-9f2e-4a1a2d8ac9c5")
	)
	(fp_arc
		(start -62.5 4)
		(mid -63.207107 3.707107)
		(end -63.5 3)
		(stroke
			(width 0.1)
			(type default)
		)
		(layer "F.SilkS")
		(uuid "ce6086fa-6fac-4282-b7c6-00a1c2c0a0bf")
	)
	(fp_arc
		(start -53.75 4)
		(mid -53.21967 4.21967)
		(end -53 4.75)
		(stroke
			(width 0.1)
			(type default)
		)
		(layer "F.SilkS")
		(uuid "8954cdb4-c101-4aa7-b1e7-d55461aed030")
	)
	(fp_arc
		(start -52 12.5)
		(mid -52.707107 12.207107)
		(end -53 11.5)
		(stroke
			(width 0.1)
			(type default)
		)
		(layer "F.SilkS")
		(uuid "cd48bf8a-7d12-40b1-98a3-51c9eacdbabc")
	)
	(fp_arc
		(start -42.5 10.5)
		(mid -42.207107 9.792893)
		(end -41.5 9.5)
		(stroke
			(width 0.1)
			(type default)
		)
		(layer "F.SilkS")
		(uuid "99577907-75f0-4665-9b3c-7f04be8dcfcb")
	)
	(fp_arc
		(start -42.5 11.5)
		(mid -42.792894 12.207106)
		(end -43.5 12.5)
		(stroke
			(width 0.1)
			(type default)
		)
		(layer "F.SilkS")
		(uuid "1fd11f54-943d-449b-a2ac-1a857fa2d622")
	)
	(fp_arc
		(start -33.5 -18)
		(mid -32.79289 -17.70711)
		(end -32.5 -17)
		(stroke
			(width 0.1)
			(type default)
		)
		(layer "F.SilkS")
		(uuid "b2e1f138-aaaf-449d-a93f-9aa5cd57ffec")
	)
	(fp_arc
		(start -33.5 28)
		(mid -33.207107 27.292893)
		(end -32.5 27)
		(stroke
			(width 0.1)
			(type default)
		)
		(layer "F.SilkS")
		(uuid "fb23e2bf-e51d-4703-a42f-6b6e89c063aa")
	)
	(fp_arc
		(start -32.5 8.499999)
		(mid -32.792893 9.207106)
		(end -33.5 9.5)
		(stroke
			(width 0.1)
			(type default)
		)
		(layer "F.SilkS")
		(uuid "04e46cec-c764-4ed8-af95-819cdfdd73ff")
	)
	(fp_arc
		(start -32.5 33.5)
		(mid -33.207107 33.207107)
		(end -33.5 32.5)
		(stroke
			(width 0.1)
			(type default)
		)
		(layer "F.SilkS")
		(uuid "84e035eb-ff88-4415-8cb2-a71772f9c120")
	)
	(fp_arc
		(start -27.75 26)
		(mid -28.042893 26.707107)
		(end -28.75 27)
		(stroke
			(width 0.1)
			(type default)
		)
		(layer "F.SilkS")
		(uuid "c7347525-0494-4662-86b0-7919f3e8e3ce")
	)
	(fp_arc
		(start -27.749999 23)
		(mid -27.457106 22.292893)
		(end -26.749999 22)
		(stroke
			(width 0.1)
			(type default)
		)
		(layer "F.SilkS")
		(uuid "a4977fa2-1d23-4b1a-b0be-95c1b4e078fe")
	)
	(fp_arc
		(start -17 22)
		(mid -16.292893 22.292893)
		(end -16 23)
		(stroke
			(width 0.1)
			(type default)
		)
		(layer "F.SilkS")
		(uuid "ac19ad42-d9c0-4c15-aa51-1921c4307a3f")
	)
	(fp_arc
		(start -16 32.5)
		(mid -16.292893 33.207107)
		(end -17 33.5)
		(stroke
			(width 0.1)
			(type default)
		)
		(layer "F.SilkS")
		(uuid "f8cbcbbb-0f8f-445e-909a-06fcd5c8c62a")
	)
	(fp_arc
		(start 16 23)
		(mid 16.292893 22.292893)
		(end 17 22)
		(stroke
			(width 0.1)
			(type default)
		)
		(layer "F.SilkS")
		(uuid "833e232c-f9b5-4c60-a68d-e7d6599c85c9")
	)
	(fp_arc
		(start 17 33.5)
		(mid 16.292893 33.207107)
		(end 16 32.5)
		(stroke
			(width 0.1)
			(type default)
		)
		(layer "F.SilkS")
		(uuid "589cc341-6c0a-4bf2-844a-953020ccafbd")
	)
	(fp_arc
		(start 26.749999 22)
		(mid 27.457106 22.292893)
		(end 27.749999 23)
		(stroke
			(width 0.1)
			(type default)
		)
		(layer "F.SilkS")
		(uuid "22b48f1b-c2d3-4f9d-9815-8299932fa385")
	)
	(fp_arc
		(start 28.75 27)
		(mid 28.042893 26.707107)
		(end 27.75 26)
		(stroke
			(width 0.1)
			(type default)
		)
		(layer "F.SilkS")
		(uuid "ac03d6b5-31fa-423a-9377-c0a80d8bd155")
	)
	(fp_arc
		(start 32.5 -17)
		(mid 32.79289 -17.70711)
		(end 33.5 -18)
		(stroke
			(width 0.1)
			(type default)
		)
		(layer "F.SilkS")
		(uuid "9eee2dc8-e35c-4efb-9dde-a155bda049d6")
	)
	(fp_arc
		(start 32.5 27)
		(mid 33.207107 27.292893)
		(end 33.5 28)
		(stroke
			(width 0.1)
			(type default)
		)
		(layer "F.SilkS")
		(uuid "29558a51-0bf2-4b30-9456-3cc3625e8be0")
	)
	(fp_arc
		(start 33.5 9.5)
		(mid 32.792893 9.207106)
		(end 32.5 8.499999)
		(stroke
			(width 0.1)
			(type default)
		)
		(layer "F.SilkS")
		(uuid "0f4fcb71-3410-4dd1-88ce-b3d613497510")
	)
	(fp_arc
		(start 33.5 32.5)
		(mid 33.207107 33.207107)
		(end 32.5 33.5)
		(stroke
			(width 0.1)
			(type default)
		)
		(layer "F.SilkS")
		(uuid "d970801a-6804-4989-9c18-7f782686c650")
	)
	(fp_arc
		(start 41.5 9.5)
		(mid 42.207107 9.792893)
		(end 42.5 10.5)
		(stroke
			(width 0.1)
			(type default)
		)
		(layer "F.SilkS")
		(uuid "a631e6a0-8608-48e5-af19-6027604a53d3")
	)
	(fp_arc
		(start 43.5 12.5)
		(mid 42.792894 12.207106)
		(end 42.5 11.5)
		(stroke
			(width 0.1)
			(type default)
		)
		(layer "F.SilkS")
		(uuid "962ed6c4-01b8-4985-b5d2-123419bc27e5")
	)
	(fp_arc
		(start 53 4.75)
		(mid 53.21967 4.21967)
		(end 53.75 4)
		(stroke
			(width 0.1)
			(type default)
		)
		(layer "F.SilkS")
		(uuid "4b6fc32d-2f3c-49b1-a489-34bbfe11f38d")
	)
	(fp_arc
		(start 53 11.5)
		(mid 52.707107 12.207107)
		(end 52 12.5)
		(stroke
			(width 0.1)
			(type default)
		)
		(layer "F.SilkS")
		(uuid "53ef9d9c-63c5-487e-84d8-f4079831fad7")
	)
	(fp_arc
		(start 62.5 -18)
		(mid 63.207107 -17.707107)
		(end 63.5 -17)
		(stroke
			(width 0.1)
			(type default)
		)
		(layer "F.SilkS")
		(uuid "5767c89e-158e-4ff4-894a-31d4d66e6701")
	)
	(fp_arc
		(start 63.5 3)
		(mid 63.207107 3.707107)
		(end 62.5 4)
		(stroke
			(width 0.1)
			(type default)
		)
		(layer "F.SilkS")
		(uuid "d50a5b17-68a0-49c7-94e2-0995292579ee")
	)
	(fp_circle
		(center -60.5 -9.5)
		(end -59.23 -9.5)
		(stroke
			(width 0.1)
			(type default)
		)
		(fill none)
		(layer "Dwgs.User")
		(uuid "f0bbdf82-0e6e-46c0-837b-c683390195d4")
	)
	(fp_circle
		(center -57.25 -1.2)
		(end -53.25 -1.2)
		(stroke
			(width 0.1)
			(type default)
		)
		(fill none)
		(layer "Dwgs.User")
		(uuid "eb46ae06-a6f1-4914-a7c1-fa9b9a437918")
	)
	(fp_circle
		(center -48.25 -10.2)
		(end -44.25 -10.2)
		(stroke
			(width 0.1)
			(type default)
		)
		(fill none)
		(layer "Dwgs.User")
		(uuid "dd388f89-8f67-44f8-b1b2-25b54607e526")
	)
	(fp_circle
		(center -48.25 7.8)
		(end -44.25 7.8)
		(stroke
			(width 0.1)
			(type default)
		)
		(fill none)
		(layer "Dwgs.User")
		(uuid "037c1ed8-83b6-4b50-aea1-ac754c5c2928")
	)
	(fp_circle
		(center -39.25 -1.2)
		(end -35.25 -1.2)
		(stroke
			(width 0.1)
			(type default)
		)
		(fill none)
		(layer "Dwgs.User")
		(uuid "395d60b6-6733-43d6-b827-f6f8ae205721")
	)
	(fp_circle
		(center -31 30)
		(end -29.746 30)
		(stroke
			(width 0.1)
			(type default)
		)
		(fill none)
		(layer "Dwgs.User")
		(uuid "a8c20c2c-2422-444c-b840-715281b817b3")
	)
	(fp_circle
		(center -21.75 28)
		(end -17.75 28)
		(stroke
			(width 0.1)
			(type default)
		)
		(fill none)
		(layer "Dwgs.User")
		(uuid "658eadff-16ac-468b-9d57-0ab41ce80283")
	)
	(fp_circle
		(center 21.75 28)
		(end 25.75 28)
		(stroke
			(width 0.1)
			(type default)
		)
		(fill none)
		(layer "Dwgs.User")
		(uuid "bf259307-e3e0-47a6-9c0a-4859ffcb27e7")
	)
	(fp_circle
		(center 31 30)
		(end 32.254 30)
		(stroke
			(width 0.1)
			(type default)
		)
		(fill none)
		(layer "Dwgs.User")
		(uuid "694e0326-0fa7-426b-8e93-3892bf358a9e")
	)
	(fp_circle
		(center 39.25 -1.2)
		(end 43.25 -1.2)
		(stroke
			(width 0.1)
			(type default)
		)
		(fill none)
		(layer "Dwgs.User")
		(uuid "2604cd2e-2392-42e7-a05f-5ee650f05247")
	)
	(fp_circle
		(center 48.25 -10.2)
		(end 52.25 -10.2)
		(stroke
			(width 0.1)
			(type default)
		)
		(fill none)
		(layer "Dwgs.User")
		(uuid "c973a52d-60fa-4cf8-9758-9547e701935e")
	)
	(fp_circle
		(center 48.25 7.8)
		(end 52.25 7.8)
		(stroke
			(width 0.1)
			(type default)
		)
		(fill none)
		(layer "Dwgs.User")
		(uuid "18acda49-9a5a-4399-acb4-9250976038b7")
	)
	(fp_circle
		(center 57.25 -1.2)
		(end 61.25 -1.2)
		(stroke
			(width 0.1)
			(type default)
		)
		(fill none)
		(layer "Dwgs.User")
		(uuid "8f8930f8-45fc-479b-8f08-97aa10aed1df")
	)
	(fp_circle
		(center 60.5 -9.5)
		(end 61.754 -9.5)
		(stroke
			(width 0.1)
			(type default)
		)
		(fill none)
		(layer "Dwgs.User")
		(uuid "64cf8d8a-9a1d-4872-9b94-c03127f182e0")
	)
	(fp_text user "${REFERENCE}"
		(at 0 2.5 0)
		(unlocked yes)
		(layer "F.Fab")
		(uuid "bf3d8cbf-de40-468d-9892-d48e864c24d6")
		(effects
			(font
				(size 1 1)
				(thickness 0.15)
			)
		)
	)
	(pad "" np_thru_hole circle
		(at -34 -15)
		(size 2.2 2.2)
		(drill 2.2)
		(layers "F&B.Cu" "*.Mask")
		(uuid "3118e392-aaf2-48a1-9546-a6cae6344484")
	)
	(pad "" np_thru_hole circle
		(at -34 6)
		(size 2.2 2.2)
		(drill 2.2)
		(layers "F&B.Cu" "*.Mask")
		(uuid "330cd46e-53f1-46aa-b817-400a2df084e6")
	)
	(pad "" np_thru_hole circle
		(at 34 -15)
		(size 2.2 2.2)
		(drill 2.2)
		(layers "F&B.Cu" "*.Mask")
		(uuid "818515e1-5daa-4cd0-862d-03d4d6c8716c")
	)
	(pad "" np_thru_hole circle
		(at 34 6)
		(size 2.2 2.2)
		(drill 2.2)
		(layers "F&B.Cu" "*.Mask")
		(uuid "17db588a-a402-4fa3-9928-057cd4b3d505")
	)
)
