(footprint "SOIC-9" (version 20221018) (generator pcbnew)
  (layer "F.Cu")
  (attr smd)
  (fp_text reference "REF**" (at 0 2.5) (layer "F.SilkS")
      (effects (font (size 1 1) (thickness 0.15)))
    (tstamp 7fa9e732-d8b6-4a5f-80d7-dca0ab1476ea)
  )
  (fp_text value "SOIC-9" (at 0 -2.5) (layer "F.Fab")
      (effects (font (size 1 1) (thickness 0.15)))
    (tstamp c7fade25-4d2a-46ae-ac51-697e1fa6a37b)
  )
  (fp_line (start -5.25 -1.5) (end 5.25 -1.5)
    (stroke (width 0.12) (type default)) (layer "F.SilkS") (tstamp ba34e21d-5e2c-43bd-a4d0-1872a414db4d))
  (fp_line (start -5.25 0.7) (end -5.25 -1.5)
    (stroke (width 0.12) (type default)) (layer "F.SilkS") (tstamp 1106c721-f50a-483c-84a6-ebba35fa8772))
  (fp_line (start -4.45 1.5) (end -5.25 0.7)
    (stroke (width 0.12) (type default)) (layer "F.SilkS") (tstamp 94c231d2-e5c2-4650-9c78-0036c9c1afdf))
  (fp_line (start 5.25 -1.5) (end 5.25 1.5)
    (stroke (width 0.12) (type default)) (layer "F.SilkS") (tstamp 158bfb21-8661-4013-ae25-daed95b1f32a))
  (fp_line (start 5.25 1.5) (end -4.45 1.5)
    (stroke (width 0.12) (type default)) (layer "F.SilkS") (tstamp 621b17e6-d752-4266-9aa2-752bae982c32))
  (fp_line (start -5 -1.25) (end 5 -1.25)
    (stroke (width 0.05) (type default)) (layer "F.CrtYd") (tstamp b3490705-cd9b-4982-b4ef-0febaccd1a38))
  (fp_line (start -5 1.25) (end -5 -1.25)
    (stroke (width 0.05) (type default)) (layer "F.CrtYd") (tstamp 33f9dcb7-9b37-460e-aeea-9b5d26eb04de))
  (fp_line (start 5 -1.25) (end 5 1.25)
    (stroke (width 0.05) (type default)) (layer "F.CrtYd") (tstamp 8c76b49e-fcac-43f2-b857-5da003257685))
  (fp_line (start 5 1.25) (end -5 1.25)
    (stroke (width 0.05) (type default)) (layer "F.CrtYd") (tstamp 78e3207e-2ad7-4793-8237-6987410d77f3))
  (pad "1" smd rect (at -4.4 0) (size 0.7 2) (layers "F.Cu" "F.Paste" "F.Mask")
    (thermal_bridge_angle 45) (tstamp 9ba713e8-49e5-4ed1-a412-8c4b5223006a))
  (pad "2" smd rect (at -3.3 0) (size 0.7 2) (layers "F.Cu" "F.Paste" "F.Mask")
    (thermal_bridge_angle 45) (tstamp 646e738c-c179-4fe1-905d-c5b4f2d2e88b))
  (pad "3" smd rect (at -2.2 0) (size 0.7 2) (layers "F.Cu" "F.Paste" "F.Mask")
    (thermal_bridge_angle 45) (tstamp 292fbe3e-a8d8-4fe2-8c8a-80d853a22f6d))
  (pad "4" smd rect (at -1.1 0) (size 0.7 2) (layers "F.Cu" "F.Paste" "F.Mask")
    (thermal_bridge_angle 45) (tstamp dd50cb04-d3a6-467d-9ed2-adf686a55cea))
  (pad "5" smd rect (at 0 0) (size 0.7 2) (layers "F.Cu" "F.Paste" "F.Mask")
    (thermal_bridge_angle 45) (tstamp 62443e69-2712-4110-99d4-151366baf70f))
  (pad "6" smd rect (at 1.1 0) (size 0.7 2) (layers "F.Cu" "F.Paste" "F.Mask")
    (thermal_bridge_angle 45) (tstamp 7378f45d-5be4-41e0-8288-baef1b26de0f))
  (pad "7" smd rect (at 2.2 0) (size 0.7 2) (layers "F.Cu" "F.Paste" "F.Mask")
    (thermal_bridge_angle 45) (tstamp 2095a5af-7e54-450e-9f26-a47197b20a1b))
  (pad "8" smd rect (at 3.3 0) (size 0.7 2) (layers "F.Cu" "F.Paste" "F.Mask")
    (thermal_bridge_angle 45) (tstamp e5e2d126-5c99-4d6d-9ddf-4883e5d44bcd))
  (pad "9" smd rect (at 4.4 0) (size 0.7 2) (layers "F.Cu" "F.Paste" "F.Mask")
    (thermal_bridge_angle 45) (tstamp 30000d89-b1a0-423d-ae57-a3420cf98b34))
)
