(footprint "FUET-FS-1340_rearmount" (version 20221018) (generator pcbnew)
  (layer "F.Cu")
  (attr smd)
  (fp_text reference "REF**" (at 0 -0.5 unlocked) (layer "B.SilkS")
      (effects (font (size 1 1) (thickness 0.15)))
    (tstamp d143760d-928b-4ca5-8d52-ccb049d0547f)
  )
  (fp_text value "FUET-FS-1340_rearmount" (at 0 1 unlocked) (layer "F.Fab")
      (effects (font (size 1 1) (thickness 0.15)))
    (tstamp a9511df9-946e-4a85-80a4-aeaa3e4c04f4)
  )
  (fp_text user "+" (at -6.8 3.8 90 unlocked) (layer "B.SilkS")
      (effects (font (size 1 1) (thickness 0.15)) (justify left bottom))
    (tstamp 038c6593-f197-4de6-a0c7-ae57f2f92faf)
  )
  (fp_text user "FUET" (at -1.9 -3.7 unlocked) (layer "B.SilkS")
      (effects (font (size 1 1) (thickness 0.15)) (justify left bottom))
    (tstamp d8c4b4d4-699e-4bdd-8a94-d45b5fbe57f9)
  )
  (fp_text user "-" (at 6.6 3.6 unlocked) (layer "B.SilkS")
      (effects (font (size 1 1) (thickness 0.15)) (justify left bottom))
    (tstamp ec3253da-2798-459c-aeda-78edac56042a)
  )
  (fp_text user "${REFERENCE}" (at 0 2.5 unlocked) (layer "F.Fab")
      (effects (font (size 1 1) (thickness 0.15)))
    (tstamp 7e6a59d7-13b4-4e62-91fa-0283c55a8268)
  )
  (fp_line (start -7.3 5) (end -7.3 7.3)
    (stroke (width 0.1) (type default)) (layer "B.SilkS") (tstamp f855c98a-c023-48ad-be7c-03d2112343ae))
  (fp_line (start -7.3 7.3) (end -5 7.3)
    (stroke (width 0.1) (type default)) (layer "B.SilkS") (tstamp 7e017732-2680-4722-97e1-824a59e66ab3))
  (fp_line (start -6.5 6.5) (end -6.5 -5.5)
    (stroke (width 0.1) (type default)) (layer "B.SilkS") (tstamp 15c15b7c-ea3f-4bc6-a87a-f193dc9be6fd))
  (fp_line (start -5.5 -6.5) (end -6.5 -5.5)
    (stroke (width 0.1) (type default)) (layer "B.SilkS") (tstamp e10e3c2a-39fc-460e-b032-dfe6388690b6))
  (fp_line (start -5.5 -6.5) (end 5.5 -6.5)
    (stroke (width 0.1) (type default)) (layer "B.SilkS") (tstamp b0da1239-4964-40dd-8a15-9c50481bb5a3))
  (fp_line (start -5 5) (end -3 5)
    (stroke (width 0.1) (type default)) (layer "B.SilkS") (tstamp 1592fba3-faa3-4e01-b332-cc131e8e8ba2))
  (fp_line (start -4 4) (end -4 6)
    (stroke (width 0.1) (type default)) (layer "B.SilkS") (tstamp 6c5809e7-60c3-40e2-9651-aa9a7369a090))
  (fp_line (start 5.5 -6.5) (end 6.5 -5.5)
    (stroke (width 0.1) (type default)) (layer "B.SilkS") (tstamp 21bdac0e-b86f-4da1-a4ad-f24b1e5974e0))
  (fp_line (start 6.5 -5.5) (end 6.5 6.5)
    (stroke (width 0.1) (type default)) (layer "B.SilkS") (tstamp 7b9c3957-df16-4219-9dc9-fa7e3ea911b8))
  (fp_line (start 6.5 6.5) (end -6.5 6.5)
    (stroke (width 0.1) (type default)) (layer "B.SilkS") (tstamp ac518182-d89c-4671-8944-ec53993565d4))
  (fp_circle (center -4 5) (end -3 5)
    (stroke (width 0.1) (type default)) (fill none) (layer "B.SilkS") (tstamp e4a5700b-aa37-4210-92ad-98718346888b))
  (fp_circle (center 0 0) (end 3.25 0)
    (stroke (width 0.05) (type default)) (fill none) (layer "Edge.Cuts") (tstamp fe6bc399-3245-4bf1-bd79-cb95913c2d4a))
  (pad "0" smd roundrect (at -6.2 -3.9) (size 2 2.5) (layers "B.Cu" "B.Paste" "B.Mask") (roundrect_rratio 0.25)
    (thermal_bridge_angle 45) (tstamp 70dab6c3-bbef-4e49-b2fa-eb06877a03f2))
  (pad "0" smd roundrect (at 6.2 -3.9) (size 2 2.5) (layers "B.Cu" "B.Paste" "B.Mask") (roundrect_rratio 0.25)
    (thermal_bridge_angle 45) (tstamp 25798c88-791e-4456-9108-5bdd46fd80cf))
  (pad "1" smd roundrect (at 6.2 4.8) (size 2 2.5) (layers "B.Cu" "B.Paste" "B.Mask") (roundrect_rratio 0.25)
    (thermal_bridge_angle 45) (tstamp db0dd0d2-c3d2-4d23-b19f-74a7f332e466))
  (pad "2" smd roundrect (at -6.2 4.8) (size 2 2.5) (layers "B.Cu" "B.Paste" "B.Mask") (roundrect_rratio 0.25)
    (thermal_bridge_angle 45) (tstamp 82fcf776-2340-4aef-9194-afcd76f89083))
)
