<?xml version="1.0" encoding="utf-8"?>
<!-- Generator: Adobe Illustrator 23.0.6, SVG Export Plug-In . SVG Version: 6.00 Build 0)  -->
<svg version="1.1" id="Capa_1" xmlns="http://www.w3.org/2000/svg" xmlns:xlink="http://www.w3.org/1999/xlink" x="0px" y="0px"
	 viewBox="0 0 101 51" style="enable-background:new 0 0 101 51;" xml:space="preserve">
<style type="text/css">
	.st0{fill:none;}
	.st1{fill-rule:evenodd;clip-rule:evenodd;fill:#CF3239;}
	.st2{fill:#CF3239;}
	.st3{fill-rule:evenodd;clip-rule:evenodd;fill:#B1B0AF;}
	.st4{fill:#029FE7;}
	.st5{fill:#3F3B3A;}
</style>
<rect x="25.5" y="-24.5" transform="matrix(-1.836970e-16 1 -1 -1.836970e-16 76 -25)" class="st0" width="50" height="100"/>
<g>
	<polygon class="st1" points="1036.7,418.79 1041.71,418.79 1041.52,419.93 1037.34,423.93 1040.85,423.92 1040.65,425.15 
		1035.47,425.15 1035.69,423.88 1039.7,420.04 1036.5,420.04 	"/>
	<path class="st1" d="M1031.22,416.84c-0.11-0.12-0.27-0.2-0.44-0.28c-0.18-0.07-0.38-0.12-0.58-0.16
		c-0.25-0.04-0.49-0.06-0.67-0.07c-0.16-0.01-0.26-0.01-0.26-0.01h-2.19h-1.63l-1.46,8.82h1.36l0.54-3.27l2.64,0.01
		c0,0,1.03,0.04,1.76-0.35s0.93-1.27,0.93-1.27s0.08-0.33,0.15-0.72c0.07-0.44,0.15-0.96,0.19-1.24c0.02-0.12,0.03-0.2,0.03-0.2
		s0.02-0.09,0.02-0.23c0-0.2-0.03-0.49-0.18-0.77C1031.37,417.02,1031.3,416.93,1031.22,416.84z M1030.17,418.4
		c0,0.02-0.12,0.72-0.28,1.56c-0.06,0.32-0.31,0.49-0.59,0.55c-0.47,0.1-0.97,0.08-0.97,0.08l-2.21-0.01l0.49-2.93l2,0.01
		c0,0,0.13,0,0.32,0c0.21,0,0.5,0.01,0.73,0.04c0.2,0.03,0.36,0.07,0.41,0.13c0.07,0.08,0.09,0.19,0.1,0.29
		C1030.19,418.27,1030.17,418.39,1030.17,418.4z"/>
	<polygon class="st1" points="1048.5,416.33 1049.81,416.33 1048.34,425.15 1047.03,425.15 	"/>
	<polygon class="st1" points="1055.5,418.79 1056.76,418.79 1057.21,423.27 1059.14,418.78 1060.7,418.79 1061.16,423.28 
		1063.09,418.79 1064.4,418.79 1061.62,425.15 1060.07,425.15 1059.63,420.7 1057.67,425.15 1056.14,425.15 	"/>
	<g>
		<path class="st2" d="M1046.07,418.84c-0.37-0.12-1.01-0.14-1.55-0.14c-0.52,0.01-0.76,0.03-0.96,0.07c0,0-0.93,0.13-1.46,0.79
			c-0.53,0.65-0.69,2.08-0.69,2.08s-0.31,1.58-0.22,2.11c0.09,0.53,0.26,1.02,0.85,1.24c0.6,0.23,1.1,0.22,1.1,0.22
			s1.06,0.08,1.86-0.11c0.8-0.19,1.22-0.75,1.22-0.75s0.19-0.24,0.32-0.53c0.13-0.29,0.18-0.49,0.18-0.52l0.08-0.34l-1.36,0
			c0,0-0.07,0.9-0.81,0.98c-0.73,0.08-1.13,0.05-1.27,0.04c-0.14-0.01-0.93,0.03-0.86-0.63c0-0.01,0-0.02,0-0.04
			c0.04-0.75,0.12-0.94,0.12-0.94l4.27-0.01l0.18-1.06C1047.32,420.12,1047.17,419.2,1046.07,418.84z M1045.79,421.16l-2.93,0
			l0.12-0.46c0,0,0.1-0.37,0.3-0.52c0.2-0.15,0.46-0.18,0.71-0.2c0.24-0.02,0.89-0.07,1.42,0.04c0.18,0.04,0.34,0.13,0.39,0.28
			C1045.9,420.64,1045.79,421.16,1045.79,421.16z"/>
		<path class="st2" d="M1042.54,423.34c0,0.01,0,0.02,0,0.03C1042.53,423.42,1042.54,423.34,1042.54,423.34z"/>
	</g>
	<g>
		<path class="st2" d="M1050.6,423.34c0,0.01,0,0.02,0,0.03C1050.6,423.42,1050.6,423.34,1050.6,423.34z"/>
		<path class="st2" d="M1054.14,418.85c-0.37-0.12-1.01-0.14-1.55-0.14c-0.52,0.01-0.76,0.03-0.96,0.07c0,0-0.93,0.13-1.46,0.79
			c-0.53,0.65-0.69,2.08-0.69,2.08s-0.31,1.58-0.22,2.11c0.09,0.53,0.26,1.02,0.85,1.24c0.6,0.23,1.1,0.22,1.1,0.22
			s1.06,0.08,1.86-0.11c0.8-0.19,1.22-0.75,1.22-0.75s0.19-0.24,0.32-0.53s0.18-0.49,0.18-0.52l0.08-0.34l-1.36,0
			c0,0-0.07,0.9-0.81,0.98c-0.73,0.08-1.13,0.05-1.27,0.05c-0.14-0.01-0.93,0.03-0.86-0.63c0-0.01,0-0.02,0-0.04
			c0.04-0.75,0.12-0.94,0.12-0.94l4.27-0.01l0.18-1.06C1055.39,420.12,1055.24,419.2,1054.14,418.85z M1053.84,421.16l-2.93,0
			l0.12-0.46c0,0,0.1-0.37,0.3-0.52c0.2-0.15,0.46-0.18,0.71-0.2c0.24-0.02,0.89-0.07,1.42,0.04c0.18,0.04,0.34,0.13,0.39,0.28
			C1053.95,420.63,1053.84,421.16,1053.84,421.16z"/>
	</g>
	<path class="st1" d="M1065.91,418.79l0.84,4.65l2.38-4.65l1.34,0.01l-3.43,6.64c0,0-0.62,1.2-1.01,1.51
		c-0.38,0.3-0.62,0.44-0.94,0.47c-0.31,0.03-0.44,0.05-0.74,0l-0.32-0.06l0.2-1.19c0,0,0.53,0.1,0.85-0.03
		c0.32-0.12,0.57-0.66,0.57-0.66l0.16-0.27l-1.24-6.44L1065.91,418.79L1065.91,418.79z"/>
	<path class="st3" d="M1070.95,419.42l1.38,0l0.08-0.53c0,0,0.15-0.97,0.48-1.15c0.11-0.06,0.28-0.12,0.47-0.15
		c0.36-0.06,0.82-0.07,1.19-0.06c0.57,0.02,0.79,0.03,1.37,0.09c0.58,0.07,0.44,0.63,0.44,0.63l-0.12,0.84c0,0-0.05,0.38-0.19,0.61
		c-0.12,0.21-0.45,0.35-0.63,0.41c-0.45,0.15-2.01,0.54-2.01,0.54l-1.22,0.35c0,0-0.75,0.22-1.17,0.68c-0.42,0.47-0.59,1-0.65,1.27
		c-0.06,0.28-0.38,2.18-0.38,2.18l6.6,0l0.22-1.32l-5.22,0.01l0.09-0.54c0,0,0.06-0.55,0.29-0.74c0.07-0.06,0.11-0.13,0.52-0.28
		c0.25-0.09,1.1-0.32,1.1-0.32l1.97-0.54c0,0,1.08-0.28,1.5-0.86c0.42-0.59,0.59-1.71,0.59-1.71s0.12-1.09,0.03-1.43
		c-0.09-0.34-0.41-0.75-0.8-0.93c-0.39-0.18-0.8-0.28-1.99-0.26s-1.78,0.07-2.38,0.29c-0.6,0.22-0.95,0.62-1.17,1.19
		C1071.09,418.26,1070.95,419.42,1070.95,419.42L1070.95,419.42z"/>
	<path class="st3" d="M1083.38,421.88l0.93-5.55h-1.64l-5.1,5.48l-0.23,1.39h4.46l-0.33,1.95l1.37,0l0.32-1.95l1.26,0l0.23-1.33
		H1083.38z M1082.02,421.88l-2.89,0l3.51-3.74L1082.02,421.88z"/>
	<path class="st3" d="M1034.11,417.06h4.2c0,0,0.94-0.76,1.61-1.25c0.67-0.49,1.89-1.26,1.89-1.26l-2.38-1.11
		c0,0-2.01,1.24-2.86,1.83C1035.75,415.81,1034.11,417.06,1034.11,417.06L1034.11,417.06z"/>
	<path class="st3" d="M1043.15,413.76l-1.95-1.31c0,0,1.76-1,4.11-1.94c2.34-0.93,3.6-1.33,3.6-1.33l0.4,1.86
		c0,0-2.26,0.76-3.55,1.37C1044.42,412.99,1043.15,413.76,1043.15,413.76L1043.15,413.76z"/>
	<path class="st3" d="M1050.75,410.64l-0.34-1.91c0,0,2.41-0.64,4.61-1.05c2.21-0.41,5.13-0.61,5.13-0.61l-0.97,2.94
		c0,0-2.57-0.35-4.99-0.02C1052.31,410.22,1050.75,410.64,1050.75,410.64L1050.75,410.64z"/>
	<path class="st3" d="M1060.71,410.27l1.63-3.27c0,0,3.56-0.07,6.64,0.41c3.07,0.47,5.89,1.2,5.82,1.24l-7.79,4.08
		c0,0-1.82-1.15-4.08-1.86C1061.64,410.48,1060.71,410.27,1060.71,410.27L1060.71,410.27z"/>
	<path class="st3" d="M1068.4,413.61l1.71,1.3h14.08c0,0-0.03-0.45-0.4-1.1c-0.23-0.4-0.66-0.83-1.1-1.28
		c-0.16-0.16-0.81-0.67-1.3-0.98c-1.24-0.81-1.94-1.12-3.23-1.7L1068.4,413.61L1068.4,413.61z"/>
	<path class="st2" d="M1035.03,418.79c-0.53,0-1.03,0.21-1.45,0.44l0.07-0.44h-1.4l-1.12,6.33h1.4l0.62-3.51
		c0.13-0.71,0.66-1.59,1.7-1.59l0.72,0l0.22-1.23H1035.03z"/>
</g>
<g>
	<path class="st4" d="M27.43,16.72c-1.64,0-2.96,1.31-2.96,2.94v12.46c0,1.62,1.33,2.94,2.96,2.94h12.58c1.64,0,2.96-1.32,2.96-2.94
		v-0.13c-0.06-0.02-4.81-1.99-7.23-3.14c-1.63,1.99-3.73,3.19-5.92,3.19c-3.69,0-4.95-3.2-3.2-5.31c0.38-0.46,1.03-0.9,2.04-1.14
		c1.57-0.38,4.08,0.24,6.43,1.01c0.42-0.77,0.78-1.62,1.04-2.52H28.9v-0.73h3.73v-1.3h-4.52v-0.73h4.52v-1.86c0,0,0-0.31,0.32-0.31
		h1.82v2.17h4.47v0.73h-4.47v1.3h3.65c-0.35,1.42-0.88,2.72-1.54,3.86c1.11,0.4,2.1,0.77,2.84,1.02c2.47,0.82,3.16,0.92,3.25,0.93
		v-9.5c0-1.62-1.33-2.94-2.96-2.94L27.43,16.72L27.43,16.72z M29.46,26.66c-0.16,0-0.32,0.01-0.48,0.03
		c-0.46,0.05-1.33,0.25-1.8,0.66c-1.42,1.23-0.57,3.48,2.31,3.48c1.67,0,3.35-1.06,4.66-2.76C32.45,27.24,30.99,26.64,29.46,26.66
		L29.46,26.66z"/>
	<path class="st5" d="M75.15,29.47l-0.83,1.78l-0.84-1.78h-0.82l1.28,2.46v1.72h0.75v-1.72l0-0.01l1.27-2.45H75.15z M69.11,30.54
		l0.58,1.73H68.5L69.11,30.54z M69.87,32.81l0.28,0.84h0.79l-1.55-4.18h-0.6l-1.55,4.18h0.79l0.29-0.84H69.87z M63.99,31.47h-0.84
		v-1.43h0.84c0.42,0,0.67,0.37,0.67,0.72C64.66,31.1,64.43,31.47,63.99,31.47 M64.03,29.47H62.4v4.18h0.76v-1.61h0.88
		c0.82,0,1.39-0.53,1.39-1.29S64.85,29.47,64.03,29.47 M58.57,33.65h0.76v-4.18h-0.76V33.65z M53.24,29.47v4.18h2.55v-0.57H54v-3.61
		L53.24,29.47z M48.93,30.54l0.58,1.73h-1.19L48.93,30.54z M49.69,32.81l0.28,0.84h0.79l-1.55-4.18h-0.6l-1.55,4.18h0.79l0.29-0.84
		H49.69z M55.02,21.29h-3.25v-1.16h3.77v-0.72h-3.77v-1.47H50.1c-0.18,0-0.33,0.15-0.33,0.34v1.12h-3.74v0.72h3.74v1.16h-3.16v0.72
		h6.29c0,0-0.35,1.35-2.07,2.8c-1.55-1.16-2.06-2.09-2.06-2.09h-1.69c0.68,1.18,1.65,2.12,2.7,2.86c-0.96,0.62-2.2,1.22-3.81,1.69
		v0.86c0,0,2.48-0.47,4.88-1.87c2.4,1.39,4.81,1.87,4.81,1.87v-0.82c-1.54-0.56-2.77-1.17-3.73-1.76
		C53.32,24.54,54.53,23.15,55.02,21.29 M65.57,18.09h-1.69v1.76h-4.17v0.71h4.17v6.31c-0.01,0.14-0.13,0.26-0.27,0.26h-0.86v0.73
		h2.19c0.35-0.01,0.62-0.3,0.63-0.65v-6.65h0.69v-0.71h-0.69L65.57,18.09z M62.01,21.74c-0.06-0.13-0.19-0.21-0.33-0.21h-1.41
		l1.1,3.43h1.67L62.01,21.74z M57.85,18.01l-1.94,4.56h1.49v5.42h1.63V20.8h-0.59l1.23-2.79L57.85,18.01z M76.71,27.74l-0.59-1.99
		c-0.04-0.13-0.16-0.22-0.29-0.22h-1.58l0.46,1.53h-1.85v-2.97h3.64v-0.71h-3.64v-1.4h3.64v-0.71h-9.08v0.71h3.64v1.4h-3.64v0.71
		h3.64v2.97h-3.64v0.71h9.3L76.71,27.74L76.71,27.74z M69.31,19.6h5.3v1.04h1.89V19.4c0,0,0,0,0-0.01c0-0.28-0.22-0.5-0.49-0.51
		h-3.06v-0.97h-1.98v0.97h-3.55v1.75h1.89L69.31,19.6z"/>
</g>
</svg>
