   9
sisl-version=1 cell= 4.91362818 0.00000000 0.00000000 -2.45681409 4.25911676 0.00000000 0.00000000 0.00000000 40.51491471  nsc= 1 1 1
C   1.24451922  0.69974469  19.94989855
C   -0.01028483  1.42528592  19.98362867
C   -0.00027979  2.84083210  20.00006598
C   -1.22853262  3.54948634  20.00070492
C   3.68562838  0.70970844  20.00069457
C   2.45977743  1.42104128  19.99917561
C   2.45744450  2.84016579  20.00026330
C   1.22856210  3.55008812  20.00036900
H   0.81594996  0.94275125  21.07165745

