<svg width="24" height="24" viewBox="0 0 24 24" fill="none" xmlns="http://www.w3.org/2000/svg">
<path d="M5 5.08679C5 4.81065 5.22386 4.58679 5.5 4.58679V4.58679C5.77614 4.58679 6 4.81065 6 5.08679V15.5C6 15.7761 5.77614 16 5.5 16V16C5.22386 16 5 15.7761 5 15.5V5.08679Z" fill="white"/>
<path d="M5.5 6.50007C5.5 6.50007 5.5 5 9.50607 5.14289C12.1032 5.14289 13.1424 5.63753 13.1424 7.0001C13.1424 8.36268 13.1424 15.5001 13.1424 15.5001" stroke="white" stroke-linecap="round"/>
<path d="M18.8551 4.57141V17.7989C18.8573 20 18.8551 20 15.4287 20" stroke="white" stroke-linecap="round"/>
</svg>
