<svg width="24" height="24" viewBox="0 0 24 24" fill="none" xmlns="http://www.w3.org/2000/svg">
<path d="M4 18V12.4C4 10.1722 4.84285 8.03561 6.34315 6.4603C7.84344 4.885 9.87827 4 12 4C14.1217 4 16.1566 4.885 17.6569 6.4603C19.1571 8.03561 20 10.1722 20 12.4V18" stroke="white" stroke-linecap="round" stroke-linejoin="round"/>
<path d="M20 18.2857C20 18.7404 19.8127 19.1764 19.4793 19.4979C19.1459 19.8194 18.6937 20 18.2222 20H17.3333C16.8618 20 16.4097 19.8194 16.0763 19.4979C15.7429 19.1764 15.5556 18.7404 15.5556 18.2857V15.7143C15.5556 15.2596 15.7429 14.8236 16.0763 14.5021C16.4097 14.1806 16.8618 14 17.3333 14H20V18.2857ZM4 18.2857C4 18.7404 4.1873 19.1764 4.5207 19.4979C4.8541 19.8194 5.30628 20 5.77778 20H6.66667C7.13816 20 7.59035 19.8194 7.92375 19.4979C8.25714 19.1764 8.44444 18.7404 8.44444 18.2857V15.7143C8.44444 15.2596 8.25714 14.8236 7.92375 14.5021C7.59035 14.1806 7.13816 14 6.66667 14H4V18.2857Z" stroke="white" stroke-linecap="round" stroke-linejoin="round"/>
</svg>
