4
Lattice="2.46748 0.0 0.0 1.23374 2.1369 0.0 0.0 0.0 6.554959" Properties=species:S:1:pos:R:3 pbc="T T T"
C        0.00000000       0.00000000       1.63873975
C        1.23374000       0.71230000       1.63873975
C        0.00000000       0.00000000       4.91621925
C        2.46748000       1.42460000       4.91621925
