EventTime;CoffeeCount;CakeCount;TableNumber;ScentType;EventType;CorrectCoffeeDelivery;CorrectCakeDelivery;FirstCoffeeOrCake;Location;Rotation
1/9/2023 3:44:14 PM;;;;Ocean;;;;;;
1/9/2023 3:44:18 PM;;;;Ocean;;;;;;
1/9/2023 3:44:22 PM;;;;Ocean;;;;;;
1/9/2023 3:44:26 PM;;;;Ocean;;;;;;
1/9/2023 3:44:26 PM;;;;;GameBegin/Quit;;;;;
