EventTime;CoffeeCount;CakeCount;TableNumber;ScentType;EventType
11/28/2022 10:36:54 AM;;;;;GameBegin/Quit;;
11/28/2022 10:36:59 AM;;;;Ocean;;;
11/28/2022 10:37:03 AM;;;;Ocean;;;
11/28/2022 10:37:07 AM;;;;Ocean;;;
11/28/2022 10:37:11 AM;;;;Ocean;;;
11/28/2022 10:37:15 AM;;;;Ocean;;;
11/28/2022 10:37:17 AM;;;;Ocean;;;
11/28/2022 10:37:17 AM;;;;Coffee;;;
11/28/2022 10:37:19 AM;;;;Ocean;;;
11/28/2022 10:37:19 AM;;;;Coffee;;;
11/28/2022 10:37:21 AM;;;;Ocean;;;
11/28/2022 10:37:21 AM;;;;Coffee;;;
11/28/2022 10:37:23 AM;;;;Ocean;;;
11/28/2022 10:37:23 AM;;;;Coffee;;;
11/28/2022 10:37:25 AM;;;;Ocean;;;
11/28/2022 10:37:25 AM;;;;Coffee;;;
11/28/2022 10:37:27 AM;;;;Ocean;;;
11/28/2022 10:37:27 AM;;;;Coffee;;;
11/28/2022 10:37:28 AM;;;;;GameBegin/Quit;;
