EventTime;CoffeeCount;CakeCount;TableNumber;ScentType;EventType;CorrectCoffeeDelivery;CorrectCakeDelivery;FirstCoffeeOrCake
12/1/2022 11:08:36 PM;;;;;GameBegin/Quit;;;
12/1/2022 11:08:40 PM;;;;Ocean;;;;
12/1/2022 11:08:44 PM;;;;Ocean;;;;
12/1/2022 11:08:48 PM;;;;Ocean;;;;
12/1/2022 11:08:52 PM;;;;;GameBegin/Quit;;;
