EventTime;CoffeeCount;CakeCount;TableNumber;ScentType;EventType
1/5/2023 1:46:50 PM;;;;;GameBegin/Quit
1/5/2023 1:46:54 PM;;;;Ocean;
1/5/2023 1:46:58 PM;;;;Ocean;
1/5/2023 1:47:02 PM;;;;Ocean;
1/5/2023 1:47:06 PM;;;;Ocean;
1/5/2023 1:47:10 PM;;;;Ocean;
1/5/2023 1:47:14 PM;;;;Ocean;
1/5/2023 1:47:14 PM;;;;Coffee;
1/5/2023 1:47:14 PM;;;;DarkChocolate;
1/5/2023 1:47:16 PM;;;;Ocean;
1/5/2023 1:47:16 PM;;;;Coffee;
1/5/2023 1:47:16 PM;;;;DarkChocolate;
1/5/2023 1:47:18 PM;;;;Ocean;
1/5/2023 1:47:18 PM;;;;Coffee;
1/5/2023 1:47:18 PM;;;;DarkChocolate;
1/5/2023 1:47:20 PM;;;;Ocean;
1/5/2023 1:47:20 PM;;;;Coffee;
1/5/2023 1:47:20 PM;;;;DarkChocolate;
1/5/2023 1:47:22 PM;;;;Ocean;
1/5/2023 1:47:22 PM;;;;Coffee;
1/5/2023 1:47:22 PM;;;;DarkChocolate;
1/5/2023 1:47:24 PM;;;;Ocean;
1/5/2023 1:47:24 PM;;;;Coffee;
1/5/2023 1:47:24 PM;;;;DarkChocolate;
1/5/2023 1:47:27 PM;;;;Ocean;
1/5/2023 1:47:27 PM;;;;Coffee;
1/5/2023 1:47:27 PM;;;;DarkChocolate;
1/5/2023 1:47:29 PM;;;;Ocean;
1/5/2023 1:47:29 PM;;;;Coffee;
1/5/2023 1:47:29 PM;;;;DarkChocolate;
1/5/2023 1:47:31 PM;;;;Ocean;
1/5/2023 1:47:31 PM;;;;Coffee;
1/5/2023 1:47:31 PM;;;;DarkChocolate;
1/5/2023 1:47:33 PM;;;;Ocean;
1/5/2023 1:47:33 PM;;;;Coffee;
1/5/2023 1:47:33 PM;;;;DarkChocolate;
1/5/2023 1:47:35 PM;;;;Ocean;
1/5/2023 1:47:35 PM;;;;Coffee;
1/5/2023 1:47:35 PM;;;;DarkChocolate;
1/5/2023 1:47:39 PM;;;;Ocean;
1/5/2023 1:47:43 PM;;;;Ocean;
1/5/2023 1:47:45 PM;;;;Ocean;
1/5/2023 1:47:47 PM;;;;Ocean;
1/5/2023 1:47:51 PM;;;;Ocean;
1/5/2023 1:47:53 PM;;;;Ocean;
1/5/2023 1:47:55 PM;;;;Ocean;
1/5/2023 1:47:57 PM;;;;Ocean;
1/5/2023 1:48:01 PM;;;;Ocean;
1/5/2023 1:48:05 PM;;;;Ocean;
1/5/2023 1:48:09 PM;;;;Ocean;
1/5/2023 1:48:13 PM;;;;Ocean;
1/5/2023 1:48:17 PM;;;;Ocean;
1/5/2023 1:48:21 PM;;;;Ocean;
1/5/2023 1:48:21 PM;;;;;GameBegin/Quit
