EventTime;CoffeeCount;CakeCount;TableNumber;ScentType;EventType
11/23/2022 11:18:50 AM;;;;;GameBegin/Quit
11/23/2022 11:18:55 AM;;;;Ocean;
11/23/2022 11:18:59 AM;;;;Ocean;
11/23/2022 11:19:01 AM;;;;;GameBegin/Quit
