EventTime;CoffeeCount;CakeCount;TableNumber;ScentType;EventType;CorrectCoffeeDelivery;CorrectCakeDelivery;FirstCoffeeOrCake;Location;Rotation
12/13/2022 2:41:34 PM;;;;;GameBegin/Quit;;;;;
12/13/2022 2:41:39 PM;;;;Ocean;;;;;;
12/13/2022 2:41:43 PM;;;;Ocean;;;;;;
12/13/2022 2:41:47 PM;;;;Ocean;;;;;;
12/13/2022 2:41:51 PM;;;;;;;;Cake;;
12/13/2022 2:41:51 PM;;;;Ocean;;;;;;
12/13/2022 2:41:55 PM;;;;Ocean;;;;;;
12/13/2022 2:41:57 PM;;;;Ocean;;;;;;
12/13/2022 2:41:57 PM;;;;DarkChocolate;;;;;;
12/13/2022 2:41:58 PM;0;2;PicnicTable1;;;False;False;;;
12/13/2022 2:41:59 PM;;;;Ocean;;;;;;
12/13/2022 2:41:59 PM;;;;DarkChocolate;;;;;;
12/13/2022 2:42:00 PM;0;2;PicnicTable1;;;False;False;;;
12/13/2022 2:42:01 PM;;;;Ocean;;;;;;
12/13/2022 2:42:01 PM;;;;DarkChocolate;;;;;;
12/13/2022 2:42:05 PM;;;;Ocean;;;;;;
12/13/2022 2:42:05 PM;;;;DarkChocolate;;;;;;
12/13/2022 2:42:07 PM;;;;Ocean;;;;;;
12/13/2022 2:42:07 PM;;;;DarkChocolate;;;;;;
12/13/2022 2:42:09 PM;;;;Ocean;;;;;;
12/13/2022 2:42:09 PM;;;;DarkChocolate;;;;;;
12/13/2022 2:42:10 PM;;;;;GameBegin/Quit;;;;;
