EventTime;CoffeeCount;CakeCount;TableNumber;ScentType;EventType;CorrectCoffeeDelivery;CorrectCakeDelivery;FirstCoffeeOrCake;Location;Rotation
12/15/2022 3:47:21 PM;;;;;GameBegin/Quit;;;;;
12/15/2022 3:47:26 PM;;;;Ocean;;;;;;
12/15/2022 3:47:30 PM;;;;Ocean;;;;;;
12/15/2022 3:47:34 PM;;;;Ocean;;;;;;
12/15/2022 3:47:38 PM;;;;Ocean;;;;;;
12/15/2022 3:47:39 PM;;;;;;;;Cake;;
12/15/2022 3:47:42 PM;;;;Ocean;;;;;;
12/15/2022 3:47:46 PM;;;;Ocean;;;;;;
12/15/2022 3:47:46 PM;;;;DarkChocolate;;;;;;
12/15/2022 3:47:48 PM;;;;Ocean;;;;;;
12/15/2022 3:47:48 PM;;;;DarkChocolate;;;;;;
12/15/2022 3:47:48 PM;0;4;PicnicTable1;;;True;False;;;
12/15/2022 3:47:50 PM;;;;Ocean;;;;;;
12/15/2022 3:47:50 PM;;;;DarkChocolate;;;;;;
12/15/2022 3:47:54 PM;;;;Ocean;;;;;;
12/15/2022 3:47:56 PM;;;;Ocean;;;;;;
12/15/2022 3:47:56 PM;;;;DarkChocolate;;;;;;
12/15/2022 3:47:56 PM;0;3;PicnicTable2;;;True;False;;;
12/15/2022 3:47:57 PM;0;3;PicnicTable2;;;True;False;;;
12/15/2022 3:47:58 PM;;;;Ocean;;;;;;
12/15/2022 3:47:58 PM;;;;DarkChocolate;;;;;;
12/15/2022 3:48:00 PM;;;;Ocean;;;;;;
12/15/2022 3:48:00 PM;;;;DarkChocolate;;;;;;
12/15/2022 3:48:02 PM;;;;Ocean;;;;;;
12/15/2022 3:48:02 PM;;;;DarkChocolate;;;;;;
12/15/2022 3:48:04 PM;;;;Ocean;;;;;;
12/15/2022 3:48:04 PM;;;;DarkChocolate;;;;;;
12/15/2022 3:48:06 PM;;;;Ocean;;;;;;
12/15/2022 3:48:10 PM;;;;Ocean;;;;;;
12/15/2022 3:48:10 PM;;;;DarkChocolate;;;;;;
12/15/2022 3:48:14 PM;;;;Ocean;;;;;;
12/15/2022 3:48:18 PM;;;;Ocean;;;;;;
12/15/2022 3:48:19 PM;;;;;;;;Cake;;
12/15/2022 3:48:22 PM;;;;Ocean;;;;;;
12/15/2022 3:48:22 PM;;;;DarkChocolate;;;;;;
12/15/2022 3:48:23 PM;0;4;PicnicTable1;;;True;False;;;
12/15/2022 3:48:24 PM;;;;Ocean;;;;;;
12/15/2022 3:48:24 PM;;;;Coffee;;;;;;
12/15/2022 3:48:24 PM;;;;DarkChocolate;;;;;;
12/15/2022 3:48:26 PM;;;;Ocean;;;;;;
12/15/2022 3:48:26 PM;;;;Coffee;;;;;;
12/15/2022 3:48:26 PM;;;;DarkChocolate;;;;;;
12/15/2022 3:48:28 PM;;;;Ocean;;;;;;
12/15/2022 3:48:28 PM;;;;Coffee;;;;;;
12/15/2022 3:48:28 PM;;;;DarkChocolate;;;;;;
12/15/2022 3:48:30 PM;;;;Ocean;;;;;;
12/15/2022 3:48:30 PM;;;;Coffee;;;;;;
12/15/2022 3:48:30 PM;;;;DarkChocolate;;;;;;
12/15/2022 3:48:32 PM;;;;Ocean;;;;;;
12/15/2022 3:48:32 PM;;;;Coffee;;;;;;
12/15/2022 3:48:32 PM;;;;DarkChocolate;;;;;;
12/15/2022 3:48:33 PM;;;;;GameBegin/Quit;;;;;
