EventTime;CoffeeCount;CakeCount;TableNumber;ScentType;EventType
10/31/2022 2:22:53 PM;;;;;GameBegin/Quit
10/31/2022 2:22:57 PM;;;;Ocean;
10/31/2022 2:23:01 PM;;;;Ocean;
10/31/2022 2:23:05 PM;;;;Ocean;
10/31/2022 2:23:09 PM;;;;Ocean;
10/31/2022 2:23:13 PM;;;;Ocean;
10/31/2022 2:23:17 PM;;;;Ocean;
10/31/2022 2:23:21 PM;;;;Ocean;
10/31/2022 2:23:21 PM;;;;Coffee;
10/31/2022 2:23:23 PM;;;;Ocean;
10/31/2022 2:23:23 PM;;;;Coffee;
10/31/2022 2:23:25 PM;;;;Ocean;
10/31/2022 2:23:25 PM;;;;Coffee;
10/31/2022 2:23:27 PM;;;;Ocean;
10/31/2022 2:23:31 PM;;;;Ocean;
10/31/2022 2:23:31 PM;;;;Coffee;
10/31/2022 2:23:34 PM;;;;Ocean;
10/31/2022 2:23:34 PM;;;;Coffee;
10/31/2022 2:23:34 PM;;;;DarkChocolate;
10/31/2022 2:23:36 PM;;;;Ocean;
10/31/2022 2:23:36 PM;;;;Coffee;
10/31/2022 2:23:36 PM;;;;DarkChocolate;
10/31/2022 2:23:38 PM;;;;Ocean;
10/31/2022 2:23:38 PM;;;;Coffee;
10/31/2022 2:23:38 PM;;;;DarkChocolate;
10/31/2022 2:23:40 PM;;;;Ocean;
10/31/2022 2:23:40 PM;;;;Coffee;
10/31/2022 2:23:40 PM;;;;DarkChocolate;
10/31/2022 2:23:42 PM;;;;Ocean;
10/31/2022 2:23:42 PM;;;;Coffee;
10/31/2022 2:23:46 PM;;;;Ocean;
10/31/2022 2:23:46 PM;;;;Coffee;
10/31/2022 2:23:48 PM;;;;Ocean;
10/31/2022 2:23:48 PM;;;;Coffee;
10/31/2022 2:23:50 PM;;;;Ocean;
10/31/2022 2:23:50 PM;;;;Coffee;
10/31/2022 2:23:52 PM;;;;Ocean;
10/31/2022 2:23:52 PM;;;;Coffee;
10/31/2022 2:23:54 PM;;;;Ocean;
10/31/2022 2:23:54 PM;;;;Coffee;
10/31/2022 2:23:56 PM;;;;Ocean;
10/31/2022 2:23:56 PM;;;;Coffee;
10/31/2022 2:23:58 PM;;;;Ocean;
10/31/2022 2:23:58 PM;;;;Coffee;
10/31/2022 2:24:00 PM;;;;Ocean;
10/31/2022 2:24:00 PM;;;;Coffee;
10/31/2022 2:24:02 PM;;;;Ocean;
10/31/2022 2:24:06 PM;;;;Ocean;
10/31/2022 2:24:10 PM;;;;Ocean;
10/31/2022 2:24:14 PM;;;;Ocean;
10/31/2022 2:24:18 PM;;;;Ocean;
10/31/2022 2:24:22 PM;;;;Ocean;
10/31/2022 2:24:26 PM;;;;Ocean;
10/31/2022 2:24:30 PM;;;;Ocean;
10/31/2022 2:24:34 PM;;;;Ocean;
10/31/2022 2:24:38 PM;;;;Ocean;
10/31/2022 2:24:42 PM;;;;Ocean;
10/31/2022 2:24:46 PM;;;;Ocean;
10/31/2022 2:24:49 PM;;;;;GameBegin/Quit
