EventTime;CoffeeCount;CakeCount;TableNumber;ScentType;EventType;CorrectCoffeeDelivery;CorrectCakeDelivery;FirstCoffeeOrCake;Location;Rotation
1/9/2023 3:21:04 PM;;;;Ocean;;;;;;
1/9/2023 3:21:08 PM;;;;Ocean;;;;;;
1/9/2023 3:21:12 PM;;;;Ocean;;;;;;
1/9/2023 3:21:13 PM;;;;;GameBegin/Quit;;;;;
