EventTime;CoffeeCount;CakeCount;TableNumber;ScentType;EventType;CorrectCoffeeDelivery;CorrectCakeDelivery;FirstCoffeeOrCake;Location;Rotation
1/5/2023 11:49:23 AM;;;;;GameBegin/Quit;;;;;
1/5/2023 11:49:28 AM;;;;Ocean;;;;;;
1/5/2023 11:49:32 AM;;;;Ocean;;;;;;
1/5/2023 11:49:36 AM;;;;Ocean;;;;;;
1/5/2023 11:49:38 AM;;;;Ocean;;;;;;
1/5/2023 11:49:38 AM;;;;DarkChocolate;;;;;;
1/5/2023 11:49:40 AM;;;;Ocean;;;;;;
1/5/2023 11:49:40 AM;;;;DarkChocolate;;;;;;
1/5/2023 11:49:44 AM;;;;Ocean;;;;;;
1/5/2023 11:49:44 AM;;;;DarkChocolate;;;;;;
1/5/2023 11:49:48 AM;;;;Ocean;;;;;;
1/5/2023 11:49:48 AM;;;;DarkChocolate;;;;;;
1/5/2023 11:49:50 AM;;;;Ocean;;;;;;
1/5/2023 11:49:50 AM;;;;DarkChocolate;;;;;;
1/5/2023 11:49:52 AM;;;;Ocean;;;;;;
1/5/2023 11:49:52 AM;;;;DarkChocolate;;;;;;
1/5/2023 11:49:54 AM;;;;Ocean;;;;;;
1/5/2023 11:49:54 AM;;;;DarkChocolate;;;;;;
1/5/2023 11:49:56 AM;;;;Ocean;;;;;;
1/5/2023 11:49:56 AM;;;;DarkChocolate;;;;;;
1/5/2023 11:49:58 AM;;;;Ocean;;;;;;
1/5/2023 11:49:58 AM;;;;DarkChocolate;;;;;;
1/5/2023 11:50:00 AM;;;;Ocean;;;;;;
1/5/2023 11:50:00 AM;;;;DarkChocolate;;;;;;
1/5/2023 11:50:02 AM;;;;Ocean;;;;;;
1/5/2023 11:50:02 AM;;;;DarkChocolate;;;;;;
1/5/2023 11:50:04 AM;;;;Ocean;;;;;;
1/5/2023 11:50:04 AM;;;;DarkChocolate;;;;;;
1/5/2023 11:50:05 AM;;;;;GameBegin/Quit;;;;;
