EventTime;CoffeeCount;CakeCount;TableNumber;ScentType;EventType
11/20/2022 5:10:06 PM;;;;Ocean;
11/20/2022 5:10:10 PM;;;;Ocean;
11/20/2022 5:10:14 PM;3;0;PicnicTable1;;
11/20/2022 5:10:14 PM;;;;Ocean;
11/20/2022 5:10:14 PM;;;;Coffee;
11/20/2022 5:10:16 PM;;;;Ocean;
11/20/2022 5:10:16 PM;;;;Coffee;
11/20/2022 5:10:20 PM;;;;Ocean;
11/20/2022 5:10:24 PM;4;0;PicnicTable2;;
11/20/2022 5:10:24 PM;;;;Ocean;
11/20/2022 5:10:24 PM;;;;Coffee;
11/20/2022 5:10:26 PM;;;;Ocean;
11/20/2022 5:10:26 PM;;;;Coffee;
11/20/2022 5:10:26 PM;;;;DarkChocolate;
11/20/2022 5:10:26 PM;4;4;PicnicTable2;;
11/20/2022 5:10:28 PM;;;;Ocean;
11/20/2022 5:10:28 PM;;;;Coffee;
11/20/2022 5:10:28 PM;;;;DarkChocolate;
11/20/2022 5:10:32 PM;;;;Ocean;
11/20/2022 5:10:36 PM;;;;Ocean;
11/20/2022 5:10:36 PM;;;;Coffee;
11/20/2022 5:10:40 PM;;;;Ocean;
11/20/2022 5:10:40 PM;;;;Coffee;
11/20/2022 5:10:40 PM;;;;DarkChocolate;
11/20/2022 5:10:41 PM;3;3;PicnicTable1;;
11/20/2022 5:10:42 PM;;;;Ocean;
11/20/2022 5:10:42 PM;;;;Coffee;
11/20/2022 5:10:42 PM;;;;DarkChocolate;
11/20/2022 5:10:44 PM;;;;Ocean;
11/20/2022 5:10:44 PM;;;;Coffee;
11/20/2022 5:10:44 PM;;;;DarkChocolate;
11/20/2022 5:10:44 PM;3;3;PicnicTable1;;
11/20/2022 5:10:45 PM;3;3;PicnicTable1;;
11/20/2022 5:10:46 PM;;;;Ocean;
11/20/2022 5:10:46 PM;;;;Coffee;
11/20/2022 5:10:46 PM;;;;DarkChocolate;
11/20/2022 5:10:48 PM;;;;Ocean;
11/20/2022 5:10:48 PM;;;;Coffee;
11/20/2022 5:10:48 PM;;;;DarkChocolate;
11/20/2022 5:10:52 PM;;;;Ocean;
11/20/2022 5:10:56 PM;;;;Ocean;
11/20/2022 5:11:00 PM;;;;Ocean;
11/20/2022 5:11:02 PM;0;0;PicnicTable1;;
11/20/2022 5:11:04 PM;2;0;PicnicTable1;;
11/20/2022 5:11:04 PM;;;;Ocean;
11/20/2022 5:11:04 PM;;;;Coffee;
11/20/2022 5:11:05 PM;2;0;PicnicTable1;;
11/20/2022 5:11:06 PM;;;;Ocean;
11/20/2022 5:11:06 PM;;;;Coffee;
11/20/2022 5:11:06 PM;2;0;PicnicTable1;;
11/20/2022 5:11:07 PM;2;0;PicnicTable1;;
11/20/2022 5:11:08 PM;;;;Ocean;
11/20/2022 5:11:08 PM;;;;Coffee;
11/20/2022 5:11:10 PM;;;;Ocean;
11/20/2022 5:11:14 PM;2;0;PicnicTable2;;
11/20/2022 5:11:14 PM;;;;Ocean;
11/20/2022 5:11:14 PM;;;;Coffee;
11/20/2022 5:11:16 PM;2;2;PicnicTable2;;
11/20/2022 5:11:16 PM;;;;Ocean;
11/20/2022 5:11:16 PM;;;;Coffee;
11/20/2022 5:11:16 PM;;;;DarkChocolate;
11/20/2022 5:11:18 PM;;;;Ocean;
11/20/2022 5:11:18 PM;;;;Coffee;
11/20/2022 5:11:18 PM;;;;DarkChocolate;
11/20/2022 5:11:21 PM;2;0;PicnicTable1;;
11/20/2022 5:11:22 PM;;;;Ocean;
11/20/2022 5:11:22 PM;;;;Coffee;
11/20/2022 5:11:24 PM;;;;Ocean;
11/20/2022 5:11:24 PM;;;;Coffee;
11/20/2022 5:11:25 PM;2;0;PicnicTable1;;
11/20/2022 5:11:26 PM;;;;Ocean;
11/20/2022 5:11:26 PM;;;;Coffee;
11/20/2022 5:11:28 PM;;;;Ocean;
11/20/2022 5:11:28 PM;;;;Coffee;
11/20/2022 5:11:29 PM;2;0;PicnicTable1;;
11/20/2022 5:11:30 PM;;;;Ocean;
11/20/2022 5:11:30 PM;;;;Coffee;
11/20/2022 5:11:32 PM;;;;Ocean;
11/20/2022 5:11:32 PM;;;;Coffee;
11/20/2022 5:11:36 PM;;;;Ocean;
11/20/2022 5:11:40 PM;;;;Ocean;
11/20/2022 5:11:42 PM;;;;Ocean;
11/20/2022 5:11:42 PM;;;;Coffee;
11/20/2022 5:11:44 PM;;;;Ocean;
11/20/2022 5:11:44 PM;;;;Coffee;
11/20/2022 5:11:45 PM;3;0;PicnicTable1;;
11/20/2022 5:11:46 PM;;;;Ocean;
11/20/2022 5:11:46 PM;;;;Coffee;
11/20/2022 5:11:48 PM;3;0;PicnicTable1;;
11/20/2022 5:11:48 PM;;;;Ocean;
11/20/2022 5:11:48 PM;;;;Coffee;
11/20/2022 5:11:50 PM;;;;Ocean;
11/20/2022 5:11:54 PM;;;;Ocean;
11/20/2022 5:11:58 PM;;;;Ocean;
11/20/2022 5:11:59 PM;3;0;PicnicTable2;;
11/20/2022 5:12:00 PM;;;;Ocean;
11/20/2022 5:12:00 PM;;;;Coffee;
11/20/2022 5:12:03 PM;;;;Ocean;
11/20/2022 5:12:03 PM;;;;Coffee;
11/20/2022 5:12:03 PM;;;;DarkChocolate;
11/20/2022 5:12:03 PM;3;3;PicnicTable2;;
11/20/2022 5:12:05 PM;;;;Ocean;
11/20/2022 5:12:05 PM;;;;Coffee;
11/20/2022 5:12:05 PM;;;;DarkChocolate;
11/20/2022 5:12:09 PM;;;;Ocean;
11/20/2022 5:12:13 PM;;;;Ocean;
11/20/2022 5:12:13 PM;;;;Coffee;
11/20/2022 5:12:16 PM;3;4;PicnicTable1;;
11/20/2022 5:12:17 PM;;;;Ocean;
11/20/2022 5:12:17 PM;;;;Coffee;
11/20/2022 5:12:17 PM;;;;DarkChocolate;
11/20/2022 5:12:19 PM;;;;Ocean;
11/20/2022 5:12:19 PM;;;;Coffee;
11/20/2022 5:12:19 PM;;;;DarkChocolate;
11/20/2022 5:12:20 PM;3;4;PicnicTable1;;
11/20/2022 5:12:21 PM;;;;Ocean;
11/20/2022 5:12:21 PM;;;;Coffee;
11/20/2022 5:12:21 PM;;;;DarkChocolate;
11/20/2022 5:12:23 PM;;;;Ocean;
11/20/2022 5:12:27 PM;;;;Ocean;
11/20/2022 5:12:31 PM;;;;Ocean;
11/20/2022 5:12:35 PM;;;;Ocean;
11/20/2022 5:12:39 PM;;;;Ocean;
11/20/2022 5:12:39 PM;;;;;GameBegin/Quit
