EventTime;CoffeeCount;CakeCount;TableNumber;ScentType;EventType;CorrectCoffeeDelivery;CorrectCakeDelivery;FirstCoffeeOrCake
12/1/2022 3:44:43 PM;;;;;GameBegin/Quit;;;
12/1/2022 3:44:47 PM;;;;Ocean;;;;
12/1/2022 3:44:51 PM;;;;Ocean;;;;
12/1/2022 3:44:55 PM;;;;Ocean;;;;
12/1/2022 3:44:58 PM;;;;;GameBegin/Quit;;;
