EventTime;CoffeeCount;CakeCount;TableNumber;ScentType;EventType
11/23/2022 1:15:36 PM;;;;;GameBegin/Quit
11/23/2022 1:15:40 PM;;;;Ocean;
11/23/2022 1:15:44 PM;;;;Ocean;
11/23/2022 1:15:46 PM;;;;;GameBegin/Quit
