EventTime;CoffeeCount;CakeCount;TableNumber;ScentType;EventType
11/4/2022 12:02:27 AM;;;;;GameBegin/Quit
11/4/2022 12:02:32 AM;;;;Ocean;
11/4/2022 12:02:36 AM;;;;Ocean;
11/4/2022 12:02:40 AM;;;;Ocean;
11/4/2022 12:02:44 AM;;;;Ocean;
11/4/2022 12:02:48 AM;;;;Ocean;
11/4/2022 12:02:50 AM;;;;Ocean;
11/4/2022 12:02:52 AM;;;;Ocean;
11/4/2022 12:02:52 AM;;;;Coffee;
11/4/2022 12:02:54 AM;;;;Ocean;
11/4/2022 12:02:54 AM;;;;Coffee;
11/4/2022 12:02:58 AM;;;;Ocean;
11/4/2022 12:03:02 AM;;;;Ocean;
11/4/2022 12:03:06 AM;;;;Ocean;
11/4/2022 12:03:10 AM;;;;Ocean;
11/4/2022 12:03:14 AM;;;;Ocean;
11/4/2022 12:03:16 AM;;;;;GameBegin/Quit
