EventTime;CoffeeCount;CakeCount;TableNumber;ScentType;EventType;CorrectCoffeeDelivery;CorrectCakeDelivery;FirstCoffeeOrCake;Location;Rotation
1/9/2023 3:40:36 PM;;;;;GameBegin/Quit;;;;;
1/9/2023 3:40:41 PM;;;;Ocean;;;;;;
1/9/2023 3:40:45 PM;;;;Ocean;;;;;;
1/9/2023 3:40:48 PM;;;;;GameBegin/Quit;;;;;
