EventTime;CoffeeCount;CakeCount;TableNumber;ScentType;EventType;CorrectCoffeeDelivery;CorrectCakeDelivery;FirstCoffeeOrCake;Location;Rotation
12/15/2022 3:41:12 PM;;;;;GameBegin/Quit;;;;;
12/15/2022 3:41:16 PM;;;;Ocean;;;;;;
12/15/2022 3:41:20 PM;;;;Ocean;;;;;;
12/15/2022 3:41:24 PM;;;;Ocean;;;;;;
12/15/2022 3:41:28 PM;;;;Ocean;;;;;;
12/15/2022 3:41:31 PM;;;;;;;;Coffee;;
12/15/2022 3:41:32 PM;;;;Ocean;;;;;;
12/15/2022 3:41:36 PM;;;;Ocean;;;;;;
12/15/2022 3:41:40 PM;;;;Ocean;;;;;;
12/15/2022 3:41:44 PM;;;;Ocean;;;;;;
12/15/2022 3:41:49 PM;;;;Ocean;;;;;;
12/15/2022 3:41:53 PM;;;;Ocean;;;;;;
12/15/2022 3:41:57 PM;;;;Ocean;;;;;;
12/15/2022 3:42:01 PM;;;;Ocean;;;;;;
12/15/2022 3:42:05 PM;;;;Ocean;;;;;;
12/15/2022 3:42:09 PM;;;;Ocean;;;;;;
12/15/2022 3:42:13 PM;;;;Ocean;;;;;;
12/15/2022 3:42:17 PM;;;;Ocean;;;;;;
12/15/2022 3:42:20 PM;;;;;;;;Coffee;;
12/15/2022 3:42:21 PM;;;;Ocean;;;;;;
12/15/2022 3:42:22 PM;;;;;;;;Coffee;;
12/15/2022 3:42:25 PM;;;;Ocean;;;;;;
12/15/2022 3:42:29 PM;;;;Ocean;;;;;;
12/15/2022 3:42:33 PM;;;;Ocean;;;;;;
12/15/2022 3:42:37 PM;;;;Ocean;;;;;;
12/15/2022 3:42:41 PM;;;;Ocean;;;;;;
12/15/2022 3:42:45 PM;;;;Ocean;;;;;;
12/15/2022 3:42:49 PM;;;;Ocean;;;;;;
12/15/2022 3:42:53 PM;;;;;GameBegin/Quit;;;;;
