EventTime;CoffeeCount;CakeCount;TableNumber;ScentType;EventType
11/8/2022 4:36:13 PM;;;;Ocean;
11/8/2022 4:36:17 PM;;;;Ocean;
11/8/2022 4:36:21 PM;;;;Ocean;
11/8/2022 4:36:25 PM;;;;Ocean;
11/8/2022 4:36:25 PM;;;;Coffee;
11/8/2022 4:36:25 PM;;;;DarkChocolate;
11/8/2022 4:36:28 PM;1;1;PicnicTable1;;
11/8/2022 4:36:29 PM;;;;Ocean;
11/8/2022 4:36:29 PM;;;;Coffee;
11/8/2022 4:36:29 PM;;;;DarkChocolate;
11/8/2022 4:36:31 PM;;;;Ocean;
11/8/2022 4:36:31 PM;;;;Coffee;
11/8/2022 4:36:31 PM;;;;DarkChocolate;
11/8/2022 4:36:33 PM;;;;Ocean;
11/8/2022 4:36:33 PM;;;;Coffee;
11/8/2022 4:36:33 PM;;;;DarkChocolate;
11/8/2022 4:36:35 PM;;;;Ocean;
11/8/2022 4:36:35 PM;;;;Coffee;
11/8/2022 4:36:35 PM;;;;DarkChocolate;
11/8/2022 4:36:37 PM;;;;Ocean;
11/8/2022 4:36:37 PM;;;;Coffee;
11/8/2022 4:36:37 PM;;;;DarkChocolate;
11/8/2022 4:36:39 PM;;;;Ocean;
11/8/2022 4:36:39 PM;;;;Coffee;
11/8/2022 4:36:39 PM;;;;DarkChocolate;
11/8/2022 4:36:41 PM;;;;Ocean;
11/8/2022 4:36:41 PM;;;;Coffee;
11/8/2022 4:36:41 PM;;;;DarkChocolate;
11/8/2022 4:36:43 PM;;;;Ocean;
11/8/2022 4:36:43 PM;;;;Coffee;
11/8/2022 4:36:43 PM;;;;DarkChocolate;
11/8/2022 4:36:44 PM;1;1;PicnicTable1;;
11/8/2022 4:36:45 PM;1;1;PicnicTable1;;
11/8/2022 4:36:45 PM;;;;Ocean;
11/8/2022 4:36:45 PM;;;;Coffee;
11/8/2022 4:36:45 PM;;;;DarkChocolate;
11/8/2022 4:36:47 PM;;;;Ocean;
11/8/2022 4:36:47 PM;;;;Coffee;
11/8/2022 4:36:47 PM;;;;DarkChocolate;
11/8/2022 4:36:49 PM;;;;Ocean;
11/8/2022 4:36:53 PM;;;;Ocean;
11/8/2022 4:36:55 PM;;;;Ocean;
11/8/2022 4:36:57 PM;;;;Ocean;
11/8/2022 4:36:59 PM;;;;Ocean;
11/8/2022 4:37:01 PM;;;;;GameBegin/Quit
