EventTime;CoffeeCount;CakeCount;TableNumber;ScentType;EventType
11/20/2022 4:47:16 PM;;;;;GameBegin/Quit
11/20/2022 4:47:20 PM;;;;Ocean;
11/20/2022 4:47:24 PM;;;;Ocean;
11/20/2022 4:47:28 PM;;;;Ocean;
11/20/2022 4:47:32 PM;;;;Ocean;
11/20/2022 4:47:36 PM;;;;Ocean;
11/20/2022 4:47:40 PM;;;;Ocean;
11/20/2022 4:47:44 PM;;;;Ocean;
11/20/2022 4:47:48 PM;;;;Ocean;
11/20/2022 4:47:52 PM;;;;Ocean;
11/20/2022 4:47:56 PM;;;;Ocean;
11/20/2022 4:47:58 PM;;;;Ocean;
11/20/2022 4:47:58 PM;;;;Coffee;
11/20/2022 4:48:01 PM;;;;Ocean;
11/20/2022 4:48:01 PM;;;;Coffee;
11/20/2022 4:48:03 PM;;;;Ocean;
11/20/2022 4:48:03 PM;;;;Coffee;
11/20/2022 4:48:07 PM;;;;Ocean;
11/20/2022 4:48:09 PM;;;;Ocean;
11/20/2022 4:48:09 PM;;;;Coffee;
11/20/2022 4:48:11 PM;;;;Ocean;
11/20/2022 4:48:11 PM;;;;Coffee;
11/20/2022 4:48:11 PM;;;;DarkChocolate;
11/20/2022 4:48:13 PM;;;;Ocean;
11/20/2022 4:48:13 PM;;;;Coffee;
11/20/2022 4:48:13 PM;;;;DarkChocolate;
11/20/2022 4:48:17 PM;;;;Ocean;
11/20/2022 4:48:17 PM;;;;Coffee;
11/20/2022 4:48:19 PM;;;;Ocean;
11/20/2022 4:48:19 PM;;;;Coffee;
11/20/2022 4:48:21 PM;;;;Ocean;
11/20/2022 4:48:21 PM;;;;Coffee;
11/20/2022 4:48:25 PM;;;;Ocean;
11/20/2022 4:48:29 PM;;;;Ocean;
11/20/2022 4:48:33 PM;;;;Ocean;
11/20/2022 4:48:35 PM;;;;Ocean;
11/20/2022 4:48:37 PM;;;;Ocean;
11/20/2022 4:48:39 PM;;;;Ocean;
11/20/2022 4:48:41 PM;;;;Ocean;
11/20/2022 4:48:43 PM;;;;Ocean;
11/20/2022 4:48:45 PM;;;;Ocean;
11/20/2022 4:48:47 PM;;;;Ocean;
11/20/2022 4:48:49 PM;;;;Ocean;
11/20/2022 4:48:51 PM;;;;Ocean;
11/20/2022 4:48:53 PM;;;;Ocean;
11/20/2022 4:48:55 PM;;;;Ocean;
11/20/2022 4:48:57 PM;;;;Ocean;
11/20/2022 4:48:59 PM;;;;Ocean;
11/20/2022 4:49:01 PM;;;;Ocean;
11/20/2022 4:49:03 PM;;;;Ocean;
11/20/2022 4:49:05 PM;;;;Ocean;
11/20/2022 4:49:07 PM;;;;Ocean;
11/20/2022 4:49:08 PM;;;;;GameBegin/Quit
