%YAML 1.1
%TAG !u! tag:unity3d.com,2011:
--- !u!162 &1
EditorUserSettings:
  m_ObjectHideFlags: 0
  serializedVersion: 4
  m_ConfigSettings:
    RecentlyUsedScenePath-0:
      value: 2242470311464679080f0f2a50064c0313190c232d24357f092c103cd1e33136e7a923e7ee2e26
      flags: 0
    RecentlyUsedScenePath-1:
      value: 22424703114646720a0005361500501413050b651f212b20212c5d04e3f4312aa2d43ee8e33f2d731d07e2334a2b0f36e613
      flags: 0
    RecentlyUsedScenePath-2:
      value: 22424703114646680e0b0227036c6c111b07142f1f2b233e28694c7df7ee3d2cfb
      flags: 0
    RecentlyUsedScenePath-3:
      value: 22424703114646680e0b0227036c721518021d6439262f2434
      flags: 0
    RecentlyUsedScenePath-4:
      value: 224247031146467a264e3f162507763f56362a1e630b29362b2c1873c1f52477d1e433e7e22970192103e22c083b4f2afc031d12
      flags: 0
    RecentlyUsedScenePath-5:
      value: 2242470311464678181e1f6d3426521f56041b2f222d69142824127df7ee3d2cfb
      flags: 0
    RecentlyUsedScenePath-6:
      value: 2242470311464676020a092e036c72051104570e292529701e2a183de7af303defe878fce9332b25
      flags: 0
    RecentlyUsedScenePath-7:
      value: 22424703114646680e0b0227036c6c1506120a2b382d0f3e3e3d0f26e1f43d37ecf478fce9332b25
      flags: 0
    RecentlyUsedScenePath-8:
      value: 22424703114646680e0b0227036c72151802563f22213229
      flags: 0
    RecentlyUsedScenePath-9:
      value: 22424703114646680e0b0227036c6c111b07142f1f2b233e2867083debf42d
      flags: 0
    vcSharedLogLevel:
      value: 0d5e400f0650
      flags: 0
  m_VCAutomaticAdd: 1
  m_VCDebugCom: 0
  m_VCDebugCmd: 0
  m_VCDebugOut: 0
  m_SemanticMergeMode: 2
  m_VCShowFailedCheckout: 1
  m_VCOverwriteFailedCheckoutAssets: 1
  m_VCProjectOverlayIcons: 1
  m_VCHierarchyOverlayIcons: 1
  m_VCOtherOverlayIcons: 1
  m_VCAllowAsyncUpdate: 1
