EventTime;CoffeeCount;CakeCount;TableNumber;ScentType;EventType;CorrectCoffeeDelivery;CorrectCakeDelivery;FirstCoffeeOrCake;Location;Rotation
12/19/2022 6:49:52 PM;;;;;GameBegin/Quit;;;;;
12/19/2022 6:49:57 PM;;;;Ocean;;;;;;
12/19/2022 6:50:01 PM;;;;Ocean;;;;;;
12/19/2022 6:50:05 PM;;;;Ocean;;;;;;
12/19/2022 6:50:09 PM;;;;Ocean;;;;;;
12/19/2022 6:50:09 PM;;;;;;;;Cake;;
12/19/2022 6:50:13 PM;;;;Ocean;;;;;;
12/19/2022 6:50:15 PM;;;;Ocean;;;;;;
12/19/2022 6:50:17 PM;;;;Ocean;;;;;;
12/19/2022 6:50:19 PM;;;;Ocean;;;;;;
12/19/2022 6:50:20 PM;0;0;PicnicTable1;;;False;False;;;
12/19/2022 6:50:21 PM;;;;Ocean;;;;;;
12/19/2022 6:50:23 PM;;;;Ocean;;;;;;
12/19/2022 6:50:27 PM;;;;Ocean;;;;;;
12/19/2022 6:50:31 PM;;;;Ocean;;;;;;
12/19/2022 6:50:35 PM;;;;Ocean;;;;;;
12/19/2022 6:50:39 PM;;;;Ocean;;;;;;
12/19/2022 6:50:43 PM;;;;Ocean;;;;;;
12/19/2022 6:50:46 PM;0;0;PicnicTable2;;;False;False;;;
12/19/2022 6:50:47 PM;0;0;PicnicTable2;;;False;False;;;
12/19/2022 6:50:47 PM;;;;Ocean;;;;;;
12/19/2022 6:50:49 PM;;;;Ocean;;;;;;
12/19/2022 6:50:51 PM;;;;Ocean;;;;;;
12/19/2022 6:50:53 PM;;;;Ocean;;;;;;
12/19/2022 6:50:54 PM;0;0;PicnicTable2;;;False;False;;;
12/19/2022 6:50:55 PM;;;;Ocean;;;;;;
12/19/2022 6:50:55 PM;0;0;PicnicTable2;;;False;False;;;
12/19/2022 6:50:57 PM;0;0;PicnicTable2;;;False;False;;;
12/19/2022 6:50:57 PM;;;;Ocean;;;;;;
12/19/2022 6:50:59 PM;;;;Ocean;;;;;;
12/19/2022 6:51:01 PM;;;;Ocean;;;;;;
12/19/2022 6:51:03 PM;;;;Ocean;;;;;;
12/19/2022 6:51:04 PM;;;;;GameBegin/Quit;;;;;
