EventTime;CoffeeCount;CakeCount;TableNumber;ScentType;EventType
11/24/2022 11:46:37 AM;;;;Ocean;
11/24/2022 11:46:41 AM;;;;Ocean;
11/24/2022 11:46:45 AM;;;;Ocean;
11/24/2022 11:46:45 AM;;;;;GameBegin/Quit
