EventTime;CoffeeCount;CakeCount;TableNumber;ScentType;EventType;CorrectCoffeeDelivery;CorrectCakeDelivery;FirstCoffeeOrCake;Location;Rotation
12/19/2022 7:03:00 PM;;;;;GameBegin/Quit;;;;;
12/19/2022 7:03:04 PM;;;;Ocean;;;;;;
12/19/2022 7:03:08 PM;;;;Ocean;;;;;;
12/19/2022 7:03:09 PM;;;;;;;;Coffee;;
12/19/2022 7:03:12 PM;;;;Ocean;;;;;;
12/19/2022 7:03:16 PM;;;;Ocean;;;;;;
12/19/2022 7:03:20 PM;;;;Ocean;;;;;;
12/19/2022 7:03:24 PM;;;;Ocean;;;;;;
12/19/2022 7:03:28 PM;;;;Ocean;;;;;;
12/19/2022 7:03:32 PM;;;;Ocean;;;;;;
12/19/2022 7:03:36 PM;;;;Ocean;;;;;;
12/19/2022 7:03:40 PM;;;;Ocean;;;;;;
12/19/2022 7:03:44 PM;;;;Ocean;;;;;;
12/19/2022 7:03:48 PM;;;;Ocean;;;;;;
12/19/2022 7:03:52 PM;;;;Ocean;;;;;;
12/19/2022 7:03:56 PM;;;;Ocean;;;;;;
12/19/2022 7:04:00 PM;;;;Ocean;;;;;;
12/19/2022 7:04:04 PM;;;;Ocean;;;;;;
12/19/2022 7:04:08 PM;;;;Ocean;;;;;;
12/19/2022 7:04:12 PM;;;;Ocean;;;;;;
12/19/2022 7:04:16 PM;;;;Ocean;;;;;;
12/19/2022 7:04:20 PM;;;;Ocean;;;;;;
12/19/2022 7:04:24 PM;;;;Ocean;;;;;;
12/19/2022 7:04:28 PM;;;;Ocean;;;;;;
12/19/2022 7:04:32 PM;;;;Ocean;;;;;;
12/19/2022 7:04:36 PM;;;;Ocean;;;;;;
12/19/2022 7:04:41 PM;;;;Ocean;;;;;;
12/19/2022 7:04:45 PM;;;;Ocean;;;;;;
12/19/2022 7:04:46 PM;;;;;GameBegin/Quit;;;;;
