EventTime;CoffeeCount;CakeCount;TableNumber;ScentType;EventType
11/24/2022 11:39:11 AM;;;;Ocean;
11/24/2022 11:39:15 AM;;;;Ocean;
11/24/2022 11:39:19 AM;;;;Ocean;
11/24/2022 11:39:21 AM;;;;Ocean;
11/24/2022 11:39:23 AM;;;;Ocean;
11/24/2022 11:39:25 AM;;;;;GameBegin/Quit
