EventTime;CoffeeCount;CakeCount;TableNumber;ScentType;EventType
10/26/2022 12:12:02 AM;;;;;GameBegin/Quit
10/26/2022 12:12:07 AM;;;;Ocean;
10/26/2022 12:12:11 AM;;;;Ocean;
10/26/2022 12:12:15 AM;;;;Ocean;
10/26/2022 12:12:19 AM;;;;Ocean;
10/26/2022 12:12:23 AM;;;;Ocean;
10/26/2022 12:12:27 AM;;;;Ocean;
10/26/2022 12:12:28 AM;;;;;GameBegin/Quit
