EventTime;CoffeeCount;CakeCount;TableNumber;ScentType;EventType;CorrectCoffeeDelivery;CorrectCakeDelivery;FirstCoffeeOrCake;Location;Rotation
1/5/2023 2:30:01 PM;;;;Ocean;;;;;;
1/5/2023 2:30:05 PM;;;;Ocean;;;;;;
1/5/2023 2:30:09 PM;;;;Ocean;;;;;;
1/5/2023 2:30:09 PM;;;;Coffee;;;;;;
1/5/2023 2:30:09 PM;;;;DarkChocolate;;;;;;
1/5/2023 2:30:10 PM;1;1;PicnicTable1;;;False;False;;;
1/5/2023 2:30:11 PM;;;;Ocean;;;;;;
1/5/2023 2:30:11 PM;;;;Coffee;;;;;;
1/5/2023 2:30:11 PM;;;;DarkChocolate;;;;;;
1/5/2023 2:30:12 PM;1;1;PicnicTable1;;;False;False;;;
1/5/2023 2:30:13 PM;;;;Ocean;;;;;;
1/5/2023 2:30:13 PM;;;;Coffee;;;;;;
1/5/2023 2:30:13 PM;;;;DarkChocolate;;;;;;
1/5/2023 2:30:17 PM;;;;Ocean;;;;;;
1/5/2023 2:30:20 PM;0;0;PicnicTable2;;;False;False;;;
1/5/2023 2:30:21 PM;;;;Ocean;;;;;;
1/5/2023 2:30:23 PM;;;;Ocean;;;;;;
1/5/2023 2:30:24 PM;0;0;PicnicTable2;;;False;False;;;
1/5/2023 2:30:25 PM;;;;Ocean;;;;;;
1/5/2023 2:30:27 PM;;;;Ocean;;;;;;
1/5/2023 2:30:29 PM;;;;Ocean;;;;;;
1/5/2023 2:30:29 PM;0;0;PicnicTable2;;;False;False;;;
1/5/2023 2:30:31 PM;;;;Ocean;;;;;;
1/5/2023 2:30:33 PM;;;;Ocean;;;;;;
1/5/2023 2:30:35 PM;;;;Ocean;;;;;;
1/5/2023 2:30:37 PM;;;;Ocean;;;;;;
1/5/2023 2:30:39 PM;;;;Ocean;;;;;;
1/5/2023 2:30:41 PM;;;;Ocean;;;;;;
1/5/2023 2:30:41 PM;;;;;GameBegin/Quit;;;;;
