EventTime;CoffeeCount;CakeCount;TableNumber;ScentType;EventType;CorrectCoffeeDelivery;CorrectCakeDelivery;FirstCoffeeOrCake
12/1/2022 11:25:46 PM;;;;;GameBegin/Quit;;;
12/1/2022 11:25:50 PM;;;;Ocean;;;;
12/1/2022 11:25:54 PM;;;;Ocean;;;;
12/1/2022 11:25:56 PM;;;;;GameBegin/Quit;;;
