EventTime;CoffeeCount;CakeCount;TableNumber;ScentType;EventType;CorrectCoffeeDelivery;CorrectCakeDelivery;FirstCoffeeOrCake;Location;Rotation
12/15/2022 3:45:34 PM;;;;;GameBegin/Quit;;;;;
12/15/2022 3:45:35 PM;;;;;;;;Cake;;
12/15/2022 3:45:38 PM;;;;Ocean;;;;;;
12/15/2022 3:45:42 PM;;;;Ocean;;;;;;
12/15/2022 3:45:47 PM;;;;Ocean;;;;;;
12/15/2022 3:45:51 PM;;;;Ocean;;;;;;
12/15/2022 3:45:54 PM;;;;;GameBegin/Quit;;;;;
