EventTime;CoffeeCount;CakeCount;TableNumber;ScentType;EventType;CorrectCoffeeDelivery;CorrectCakeDelivery;FirstCoffeeOrCake
12/2/2022 12:04:42 AM;;;;;GameBegin/Quit;;;
12/2/2022 12:04:46 AM;;;;Ocean;;;;
12/2/2022 12:04:50 AM;;;;Ocean;;;;
12/2/2022 12:04:54 AM;;;;Ocean;;;;
12/2/2022 12:04:58 AM;;;;Ocean;;;;
12/2/2022 12:05:02 AM;;;;Ocean;;;;
12/2/2022 12:05:06 AM;;;;Ocean;;;;
12/2/2022 12:05:10 AM;;;;Ocean;;;;
12/2/2022 12:05:14 AM;;;;Ocean;;;;
12/2/2022 12:05:18 AM;;;;Ocean;;;;
12/2/2022 12:05:22 AM;;;;Ocean;;;;
12/2/2022 12:05:26 AM;;;;Ocean;;;;
12/2/2022 12:05:27 AM;;;;;GameBegin/Quit;;;
