EventTime;CoffeeCount;CakeCount;TableNumber;ScentType;EventType;CorrectCoffeeDelivery;CorrectCakeDelivery;FirstCoffeeOrCake
12/1/2022 2:41:33 PM;;;;Ocean;;;;
12/1/2022 2:41:37 PM;;;;Ocean;;;;
12/1/2022 2:41:41 PM;;;;Ocean;;;;
12/1/2022 2:41:45 PM;;;;Ocean;;;;
12/1/2022 2:41:48 PM;;;;;GameBegin/Quit;;;
