EventTime;CoffeeCount;CakeCount;TableNumber;ScentType;EventType;CorrectCoffeeDelivery;CorrectCakeDelivery;FirstCoffeeOrCake;Location;Rotation
12/16/2022 8:54:19 AM;;;;;GameBegin/Quit;;;;;
12/16/2022 8:54:23 AM;;;;Ocean;;;;;;
12/16/2022 8:54:27 AM;;;;Ocean;;;;;;
12/16/2022 8:54:31 AM;;;;Ocean;;;;;;
12/16/2022 8:54:35 AM;;;;Ocean;;;;;;
12/16/2022 8:54:39 AM;;;;Ocean;;;;;;
12/16/2022 8:54:43 AM;;;;Ocean;;;;;;
12/16/2022 8:54:47 AM;;;;Ocean;;;;;;
12/16/2022 8:54:48 AM;;;;;;;;Cake;;
12/16/2022 8:54:51 AM;;;;Ocean;;;;;;
12/16/2022 8:54:53 AM;;;;Ocean;;;;;;
12/16/2022 8:54:54 AM;0;1;PicnicTable1;;;True;False;;;
12/16/2022 8:54:55 AM;;;;Ocean;;;;;;
12/16/2022 8:54:55 AM;;;;DarkChocolate;;;;;;
12/16/2022 8:54:58 AM;;;;Ocean;;;;;;
12/16/2022 8:54:58 AM;;;;DarkChocolate;;;;;;
12/16/2022 8:55:00 AM;;;;Ocean;;;;;;
12/16/2022 8:55:04 AM;;;;Ocean;;;;;;
12/16/2022 8:55:06 AM;;;;Ocean;;;;;;
12/16/2022 8:55:06 AM;;;;DarkChocolate;;;;;;
12/16/2022 8:55:08 AM;;;;Ocean;;;;;;
12/16/2022 8:55:08 AM;;;;DarkChocolate;;;;;;
12/16/2022 8:55:10 AM;;;;Ocean;;;;;;
12/16/2022 8:55:10 AM;;;;DarkChocolate;;;;;;
12/16/2022 8:55:10 AM;0;4;PicnicTable2;;;True;False;;;
12/16/2022 8:55:12 AM;;;;Ocean;;;;;;
12/16/2022 8:55:16 AM;;;;Ocean;;;;;;
12/16/2022 8:55:16 AM;;;;DarkChocolate;;;;;;
12/16/2022 8:55:20 AM;;;;Ocean;;;;;;
12/16/2022 8:55:24 AM;;;;Ocean;;;;;;
12/16/2022 8:55:27 AM;;;;;;;;Cake;;
12/16/2022 8:55:28 AM;;;;Ocean;;;;;;
12/16/2022 8:55:32 AM;;;;Ocean;;;;;;
12/16/2022 8:55:34 AM;0;1;PicnicTable1;;;True;False;;;
12/16/2022 8:55:36 AM;;;;Ocean;;;;;;
12/16/2022 8:55:36 AM;;;;DarkChocolate;;;;;;
12/16/2022 8:55:38 AM;0;1;PicnicTable1;;;True;False;;;
12/16/2022 8:55:38 AM;;;;Ocean;;;;;;
12/16/2022 8:55:38 AM;;;;DarkChocolate;;;;;;
12/16/2022 8:55:40 AM;;;;Ocean;;;;;;
12/16/2022 8:55:40 AM;;;;DarkChocolate;;;;;;
12/16/2022 8:55:40 AM;0;1;PicnicTable1;;;True;False;;;
12/16/2022 8:55:42 AM;;;;Ocean;;;;;;
12/16/2022 8:55:42 AM;;;;DarkChocolate;;;;;;
12/16/2022 8:55:46 AM;0;4;PicnicTable2;;;True;False;;;
12/16/2022 8:55:46 AM;;;;Ocean;;;;;;
12/16/2022 8:55:46 AM;;;;DarkChocolate;;;;;;
12/16/2022 8:55:48 AM;;;;Ocean;;;;;;
12/16/2022 8:55:48 AM;;;;DarkChocolate;;;;;;
12/16/2022 8:55:52 AM;;;;Ocean;;;;;;
12/16/2022 8:55:52 AM;;;;DarkChocolate;;;;;;
12/16/2022 8:55:54 AM;;;;Ocean;;;;;;
12/16/2022 8:55:58 AM;;;;Ocean;;;;;;
12/16/2022 8:56:02 AM;;;;;;;;Cake;;
12/16/2022 8:56:02 AM;;;;Ocean;;;;;;
12/16/2022 8:56:06 AM;;;;Ocean;;;;;;
12/16/2022 8:56:07 AM;0;0;PicnicTable1;;;False;False;;;
12/16/2022 8:56:08 AM;;;;Ocean;;;;;;
12/16/2022 8:56:10 AM;;;;Ocean;;;;;;
12/16/2022 8:56:16 AM;;;;Ocean;;;;;;
12/16/2022 8:56:16 AM;0;0;PicnicTable2;;;False;False;;;
12/16/2022 8:56:18 AM;;;;Ocean;;;;;;
12/16/2022 8:56:22 AM;;;;Ocean;;;;;;
12/16/2022 8:56:26 AM;;;;Ocean;;;;;;
12/16/2022 8:56:30 AM;;;;;;;;Cake;;
12/16/2022 8:56:30 AM;;;;Ocean;;;;;;
12/16/2022 8:56:34 AM;;;;Ocean;;;;;;
12/16/2022 8:56:36 AM;0;0;PicnicTable1;;;False;False;;;
12/16/2022 8:56:36 AM;;;;Ocean;;;;;;
12/16/2022 8:56:38 AM;;;;Ocean;;;;;;
12/16/2022 8:56:40 AM;0;0;PicnicTable1;;;False;False;;;
12/16/2022 8:56:40 AM;;;;Ocean;;;;;;
12/16/2022 8:56:42 AM;;;;Ocean;;;;;;
12/16/2022 8:56:45 AM;0;0;PicnicTable2;;;False;False;;;
12/16/2022 8:56:46 AM;;;;Ocean;;;;;;
12/16/2022 8:56:50 AM;;;;Ocean;;;;;;
12/16/2022 8:56:52 AM;;;;Ocean;;;;;;
12/16/2022 8:56:56 AM;;;;Ocean;;;;;;
12/16/2022 8:56:59 AM;;;;;;;;Cake;;
12/16/2022 8:57:00 AM;;;;Ocean;;;;;;
12/16/2022 8:57:04 AM;0;0;PicnicTable1;;;False;False;;;
12/16/2022 8:57:05 AM;;;;Ocean;;;;;;
12/16/2022 8:57:07 AM;;;;Ocean;;;;;;
12/16/2022 8:57:11 AM;;;;Ocean;;;;;;
12/16/2022 8:57:12 AM;0;0;PicnicTable2;;;False;False;;;
12/16/2022 8:57:13 AM;;;;Ocean;;;;;;
12/16/2022 8:57:15 AM;;;;Ocean;;;;;;
12/16/2022 8:57:19 AM;;;;Ocean;;;;;;
12/16/2022 8:57:23 AM;;;;Ocean;;;;;;
12/16/2022 8:57:27 AM;;;;Ocean;;;;;;
12/16/2022 8:57:30 AM;;;;;;;;Cake;;
12/16/2022 8:57:31 AM;;;;Ocean;;;;;;
12/16/2022 8:57:35 AM;;;;Ocean;;;;;;
12/16/2022 8:57:36 AM;0;0;PicnicTable1;;;False;False;;;
12/16/2022 8:57:37 AM;;;;Ocean;;;;;;
12/16/2022 8:57:39 AM;;;;Ocean;;;;;;
12/16/2022 8:57:42 AM;0;0;PicnicTable2;;;False;False;;;
12/16/2022 8:57:43 AM;;;;Ocean;;;;;;
12/16/2022 8:57:47 AM;;;;Ocean;;;;;;
12/16/2022 8:57:49 AM;;;;Ocean;;;;;;
12/16/2022 8:57:53 AM;;;;Ocean;;;;;;
12/16/2022 8:57:57 AM;;;;Ocean;;;;;;
12/16/2022 8:58:01 AM;;;;Ocean;;;;;;
12/16/2022 8:58:05 AM;;;;Ocean;;;;;;
12/16/2022 8:58:09 AM;;;;Ocean;;;;;;
12/16/2022 8:58:13 AM;;;;Ocean;;;;;;
12/16/2022 8:58:17 AM;;;;Ocean;;;;;;
12/16/2022 8:58:19 AM;;;;;GameBegin/Quit;;;;;
