EventTime;CoffeeCount;CakeCount;TableNumber;ScentType;EventType;CorrectCoffeeDelivery;CorrectCakeDelivery;FirstCoffeeOrCake;Location;Rotation
1/10/2023 12:58:01 PM;;;;Ocean;;;;;;
1/10/2023 12:58:05 PM;;;;Ocean;;;;;;
1/10/2023 12:58:09 PM;;;;Ocean;;;;;;
1/10/2023 12:58:13 PM;;;;Ocean;;;;;;
1/10/2023 12:58:17 PM;;;;Ocean;;;;;;
1/10/2023 12:58:21 PM;;;;Ocean;;;;;;
1/10/2023 12:58:25 PM;;;;;;;;Cake;;
1/10/2023 12:58:25 PM;;;;Ocean;;;;;;
1/10/2023 12:58:29 PM;;;;Ocean;;;;;;
1/10/2023 12:58:29 PM;;;;Coffee;;;;;;
1/10/2023 12:58:29 PM;;;;DarkChocolate;;;;;;
1/10/2023 12:58:31 PM;;;;Ocean;;;;;;
1/10/2023 12:58:31 PM;;;;Coffee;;;;;;
1/10/2023 12:58:31 PM;;;;DarkChocolate;;;;;;
1/10/2023 12:58:33 PM;;;;Ocean;;;;;;
1/10/2023 12:58:33 PM;;;;Coffee;;;;;;
1/10/2023 12:58:33 PM;;;;DarkChocolate;;;;;;
1/10/2023 12:58:35 PM;;;;Ocean;;;;;;
1/10/2023 12:58:35 PM;;;;Coffee;;;;;;
1/10/2023 12:58:35 PM;;;;DarkChocolate;;;;;;
1/10/2023 12:58:37 PM;;;;Ocean;;;;;;
1/10/2023 12:58:37 PM;;;;Coffee;;;;;;
1/10/2023 12:58:37 PM;;;;DarkChocolate;;;;;;
1/10/2023 12:58:39 PM;;;;Ocean;;;;;;
1/10/2023 12:58:39 PM;;;;Coffee;;;;;;
1/10/2023 12:58:39 PM;;;;DarkChocolate;;;;;;
1/10/2023 12:58:41 PM;;;;Ocean;;;;;;
1/10/2023 12:58:41 PM;;;;Coffee;;;;;;
1/10/2023 12:58:41 PM;;;;DarkChocolate;;;;;;
1/10/2023 12:58:43 PM;;;;Ocean;;;;;;
1/10/2023 12:58:43 PM;;;;Coffee;;;;;;
1/10/2023 12:58:43 PM;;;;DarkChocolate;;;;;;
1/10/2023 12:58:45 PM;;;;Ocean;;;;;;
1/10/2023 12:58:45 PM;;;;Coffee;;;;;;
1/10/2023 12:58:45 PM;;;;DarkChocolate;;;;;;
1/10/2023 12:58:47 PM;;;;Ocean;;;;;;
1/10/2023 12:58:47 PM;;;;Coffee;;;;;;
1/10/2023 12:58:47 PM;;;;DarkChocolate;;;;;;
1/10/2023 12:58:49 PM;;;;Ocean;;;;;;
1/10/2023 12:58:49 PM;;;;Coffee;;;;;;
1/10/2023 12:58:49 PM;;;;DarkChocolate;;;;;;
1/10/2023 12:58:51 PM;;;;Ocean;;;;;;
1/10/2023 12:58:51 PM;;;;Coffee;;;;;;
1/10/2023 12:58:51 PM;;;;DarkChocolate;;;;;;
1/10/2023 12:58:53 PM;;;;Ocean;;;;;;
1/10/2023 12:58:53 PM;;;;Coffee;;;;;;
1/10/2023 12:58:53 PM;;;;DarkChocolate;;;;;;
1/10/2023 12:58:54 PM;;;;;GameBegin/Quit;;;;;
