EventTime;CoffeeCount;CakeCount;TableNumber;ScentType;EventType;CorrectCoffeeDelivery;CorrectCakeDelivery;FirstCoffeeOrCake
12/1/2022 11:06:08 PM;;;;Ocean;;;;
12/1/2022 11:06:12 PM;;;;Ocean;;;;
12/1/2022 11:06:16 PM;;;;Ocean;;;;
12/1/2022 11:06:20 PM;;;;;GameBegin/Quit;;;
