EventTime;CoffeeCount;CakeCount;TableNumber;ScentType;EventType;CorrectCoffeeDelivery;CorrectCakeDelivery;FirstCoffeeOrCake
12/1/2022 11:52:30 PM;;;;;GameBegin/Quit;;;
12/1/2022 11:52:35 PM;;;;Ocean;;;;
12/1/2022 11:52:39 PM;;;;Ocean;;;;
12/1/2022 11:52:43 PM;;;;Ocean;;;;
12/1/2022 11:52:47 PM;;;;Ocean;;;;
12/1/2022 11:52:51 PM;;;;Ocean;;;;
12/1/2022 11:52:54 PM;;;;;GameBegin/Quit;;;
