EventTime;CoffeeCount;CakeCount;TableNumber;ScentType;EventType
11/11/2022 11:00:14 AM;;;;;GameBegin/Quit
11/11/2022 11:00:19 AM;;;;Ocean;
11/11/2022 11:00:23 AM;;;;Ocean;
11/11/2022 11:00:27 AM;;;;Ocean;
11/11/2022 11:00:31 AM;;;;Ocean;
11/11/2022 11:00:35 AM;;;;Ocean;
11/11/2022 11:00:35 AM;;;;Coffee;
11/11/2022 11:00:35 AM;;;;DarkChocolate;
11/11/2022 11:00:37 AM;;;;Ocean;
11/11/2022 11:00:37 AM;;;;Coffee;
11/11/2022 11:00:37 AM;;;;DarkChocolate;
11/11/2022 11:00:39 AM;;;;Ocean;
11/11/2022 11:00:39 AM;;;;Coffee;
11/11/2022 11:00:39 AM;;;;DarkChocolate;
11/11/2022 11:00:41 AM;;;;Ocean;
11/11/2022 11:00:41 AM;;;;Coffee;
11/11/2022 11:00:41 AM;;;;DarkChocolate;
11/11/2022 11:00:43 AM;;;;Ocean;
11/11/2022 11:00:43 AM;;;;Coffee;
11/11/2022 11:00:43 AM;;;;DarkChocolate;
11/11/2022 11:00:47 AM;;;;Ocean;
11/11/2022 11:00:49 AM;;;;Ocean;
11/11/2022 11:00:51 AM;;;;Ocean;
11/11/2022 11:00:53 AM;;;;Ocean;
11/11/2022 11:00:55 AM;;;;Ocean;
11/11/2022 11:00:57 AM;;;;Ocean;
11/11/2022 11:00:59 AM;;;;Ocean;
11/11/2022 11:01:01 AM;;;;Ocean;
11/11/2022 11:01:03 AM;;;;Ocean;
11/11/2022 11:01:05 AM;;;;Ocean;
11/11/2022 11:01:07 AM;;;;Ocean;
11/11/2022 11:01:09 AM;;;;Ocean;
11/11/2022 11:01:11 AM;;;;Ocean;
11/11/2022 11:01:13 AM;;;;Ocean;
11/11/2022 11:01:13 AM;;;;;GameBegin/Quit
