EventTime;CoffeeCount;CakeCount;TableNumber;ScentType;EventType
11/8/2022 5:38:28 PM;;;;Ocean;
11/8/2022 5:38:32 PM;;;;Ocean;
11/8/2022 5:38:32 PM;;;;Coffee;
11/8/2022 5:38:32 PM;;;;DarkChocolate;
11/8/2022 5:38:36 PM;;;;Ocean;
11/8/2022 5:38:36 PM;;;;Coffee;
11/8/2022 5:38:36 PM;;;;DarkChocolate;
11/8/2022 5:38:38 PM;;;;Ocean;
11/8/2022 5:38:38 PM;;;;Coffee;
11/8/2022 5:38:38 PM;;;;DarkChocolate;
11/8/2022 5:38:40 PM;;;;Ocean;
11/8/2022 5:38:40 PM;;;;Coffee;
11/8/2022 5:38:40 PM;;;;DarkChocolate;
11/8/2022 5:38:42 PM;;;;Ocean;
11/8/2022 5:38:42 PM;;;;Coffee;
11/8/2022 5:38:42 PM;;;;DarkChocolate;
11/8/2022 5:38:44 PM;;;;Ocean;
11/8/2022 5:38:44 PM;;;;Coffee;
11/8/2022 5:38:44 PM;;;;DarkChocolate;
11/8/2022 5:38:46 PM;;;;Ocean;
11/8/2022 5:38:46 PM;;;;Coffee;
11/8/2022 5:38:46 PM;;;;DarkChocolate;
11/8/2022 5:38:48 PM;;;;Ocean;
11/8/2022 5:38:48 PM;;;;Coffee;
11/8/2022 5:38:48 PM;;;;DarkChocolate;
11/8/2022 5:38:50 PM;;;;Ocean;
11/8/2022 5:38:50 PM;;;;Coffee;
11/8/2022 5:38:50 PM;;;;DarkChocolate;
11/8/2022 5:38:52 PM;;;;Ocean;
11/8/2022 5:38:52 PM;;;;Coffee;
11/8/2022 5:38:52 PM;;;;DarkChocolate;
11/8/2022 5:38:54 PM;;;;Ocean;
11/8/2022 5:38:54 PM;;;;Coffee;
11/8/2022 5:38:54 PM;;;;DarkChocolate;
11/8/2022 5:38:56 PM;;;;Ocean;
11/8/2022 5:38:56 PM;;;;Coffee;
11/8/2022 5:38:56 PM;;;;DarkChocolate;
11/8/2022 5:38:58 PM;;;;Ocean;
11/8/2022 5:38:58 PM;;;;Coffee;
11/8/2022 5:38:58 PM;;;;DarkChocolate;
11/8/2022 5:38:59 PM;;;;;GameBegin/Quit
