EventTime;CoffeeCount;CakeCount;TableNumber;ScentType;EventType
10/26/2022 12:22:05 AM;;;;Ocean;
10/26/2022 12:22:09 AM;;;;Ocean;
10/26/2022 12:22:14 AM;;;;Ocean;
10/26/2022 12:22:17 AM;;;;;GameBegin/Quit
