EventTime;CoffeeCount;CakeCount;TableNumber;ScentType;EventType;CorrectCoffeeDelivery;CorrectCakeDelivery;FirstCoffeeOrCake
12/1/2022 3:37:39 PM;;;;;GameBegin/Quit;;;
12/1/2022 3:37:43 PM;;;;Ocean;;;;
12/1/2022 3:37:47 PM;;;;Ocean;;;;
12/1/2022 3:37:51 PM;;;;Ocean;;;;
12/1/2022 3:37:55 PM;;;;Ocean;;;;
12/1/2022 3:37:59 PM;;;;Ocean;;;;
12/1/2022 3:38:01 PM;;;;;GameBegin/Quit;;;
