EventTime;CoffeeCount;CakeCount;TableNumber;ScentType;EventType;CorrectCoffeeDelivery;CorrectCakeDelivery;FirstCoffeeOrCake;Location;Rotation
12/20/2022 3:33:18 AM;;;;Ocean;;;;;;
12/20/2022 3:33:22 AM;;;;Ocean;;;;;;
12/20/2022 3:33:26 AM;;;;Ocean;;;;;;
12/20/2022 3:33:31 AM;;;;Ocean;;;;;;
12/20/2022 3:33:32 AM;;;;;GameBegin/Quit;;;;;
