EventTime;CoffeeCount;CakeCount;TableNumber;ScentType;EventType;CorrectCoffeeDelivery;CorrectCakeDelivery;FirstCoffeeOrCake
12/1/2022 10:09:05 PM;;;;;GameBegin/Quit;;;
12/1/2022 10:09:09 PM;;;;Ocean;;;;
12/1/2022 10:09:13 PM;;;;Ocean;;;;
12/1/2022 10:09:17 PM;;;;Ocean;;;;
12/1/2022 10:09:21 PM;;;;Ocean;;;;
12/1/2022 10:09:25 PM;;;;Ocean;;;;
12/1/2022 10:09:29 PM;;;;Ocean;;;;
12/1/2022 10:09:33 PM;;;;Ocean;;;;
12/1/2022 10:09:37 PM;;;;Ocean;;;;
12/1/2022 10:09:41 PM;;;;Ocean;;;;
12/1/2022 10:09:43 PM;;;;Ocean;;;;
12/1/2022 10:09:45 PM;;;;Ocean;;;;
12/1/2022 10:09:47 PM;;;;Ocean;;;;
12/1/2022 10:09:49 PM;;;;Ocean;;;;
12/1/2022 10:09:52 PM;;;;Ocean;;;;
12/1/2022 10:09:54 PM;;;;Ocean;;;;
12/1/2022 10:09:56 PM;;;;Ocean;;;;
12/1/2022 10:09:58 PM;;;;Ocean;;;;
12/1/2022 10:10:00 PM;;;;Ocean;;;;
12/1/2022 10:10:02 PM;;;;Ocean;;;;
12/1/2022 10:10:04 PM;;;;Ocean;;;;
12/1/2022 10:10:06 PM;;;;Ocean;;;;
12/1/2022 10:10:08 PM;;;;Ocean;;;;
12/1/2022 10:10:10 PM;;;;Ocean;;;;
12/1/2022 10:10:12 PM;;;;Ocean;;;;
12/1/2022 10:10:14 PM;;;;Ocean;;;;
12/1/2022 10:10:16 PM;;;;Ocean;;;;
12/1/2022 10:10:18 PM;;;;Ocean;;;;
12/1/2022 10:10:20 PM;;;;Ocean;;;;
12/1/2022 10:10:22 PM;;;;Ocean;;;;
12/1/2022 10:10:24 PM;;;;Ocean;;;;
12/1/2022 10:10:28 PM;;;;Ocean;;;;
12/1/2022 10:10:30 PM;;;;Ocean;;;;
12/1/2022 10:10:32 PM;;;;Ocean;;;;
12/1/2022 10:10:36 PM;;;;Ocean;;;;
12/1/2022 10:10:40 PM;;;;Ocean;;;;
12/1/2022 10:10:44 PM;;;;Ocean;;;;
12/1/2022 10:10:48 PM;;;;Ocean;;;;
12/1/2022 10:10:52 PM;;;;Ocean;;;;
12/1/2022 10:10:56 PM;;;;Ocean;;;;
12/1/2022 10:11:00 PM;;;;Ocean;;;;
12/1/2022 10:11:04 PM;;;;Ocean;;;;
12/1/2022 10:11:08 PM;;;;Ocean;;;;
12/1/2022 10:11:12 PM;;;;Ocean;;;;
12/1/2022 10:11:16 PM;;;;Ocean;;;;
12/1/2022 10:11:20 PM;;;;Ocean;;;;
12/1/2022 10:11:24 PM;;;;Ocean;;;;
12/1/2022 10:11:28 PM;;;;Ocean;;;;
12/1/2022 10:11:32 PM;;;;Ocean;;;;
12/1/2022 10:11:36 PM;;;;Ocean;;;;
12/1/2022 10:11:40 PM;;;;Ocean;;;;
12/1/2022 10:11:41 PM;;;;;GameBegin/Quit;;;
