EventTime;CoffeeCount;CakeCount;TableNumber;ScentType;EventType;CorrectCoffeeDelivery;CorrectCakeDelivery;FirstCoffeeOrCake
12/1/2022 10:17:08 PM;;;;Ocean;;;;
12/1/2022 10:17:12 PM;;;;Ocean;;;;
12/1/2022 10:17:16 PM;;;;Ocean;;;;
12/1/2022 10:17:20 PM;;;;Ocean;;;;
12/1/2022 10:17:21 PM;;;;;GameBegin/Quit;;;
