EventTime;CoffeeCount;CakeCount;TableNumber;ScentType;EventType
11/3/2022 10:19:38 PM;;;;Ocean;
11/3/2022 10:19:55 PM;;;;Ocean;
11/3/2022 10:20:13 PM;;;;Ocean;
11/3/2022 10:20:31 PM;;;;Ocean;
11/3/2022 10:20:31 PM;;;;;GameBegin/Quit
