EventTime;CoffeeCount;CakeCount;TableNumber;ScentType;EventType
11/24/2022 1:48:16 PM;;;;;GameBegin/Quit
11/24/2022 1:48:20 PM;;;;Ocean;
11/24/2022 1:48:24 PM;;;;Ocean;
11/24/2022 1:48:29 PM;;;;Ocean;
11/24/2022 1:48:33 PM;;;;Ocean;
11/24/2022 1:48:33 PM;;;;;GameBegin/Quit
