EventTime;CoffeeCount;CakeCount;TableNumber;ScentType;EventType;CorrectCoffeeDelivery;CorrectCakeDelivery;FirstCoffeeOrCake
12/6/2022 2:48:29 PM;;;;;GameBegin/Quit;;;
12/6/2022 2:48:34 PM;;;;Ocean;;;;
12/6/2022 2:48:38 PM;;;;Ocean;;;;
12/6/2022 2:48:42 PM;;;;Ocean;;;;
12/6/2022 2:48:46 PM;;;;Ocean;;;;
12/6/2022 2:48:48 PM;;;;Ocean;;;;
12/6/2022 2:48:50 PM;;;;Ocean;;;;
12/6/2022 2:48:54 PM;;;;Ocean;;;;
12/6/2022 2:48:56 PM;;;;Ocean;;;;
12/6/2022 2:48:56 PM;;;;DarkChocolate;;;;
12/6/2022 2:48:58 PM;;;;Ocean;;;;
12/6/2022 2:49:02 PM;;;;Ocean;;;;
12/6/2022 2:49:06 PM;;;;Ocean;;;;
12/6/2022 2:49:10 PM;;;;Ocean;;;;
12/6/2022 2:49:14 PM;;;;Ocean;;;;
12/6/2022 2:49:18 PM;;;;Ocean;;;;
12/6/2022 2:49:22 PM;;;;Ocean;;;;
12/6/2022 2:49:24 PM;;;;Ocean;;;;
12/6/2022 2:49:26 PM;;;;Ocean;;;;
12/6/2022 2:49:26 PM;;;;;GameBegin/Quit;;;
