EventTime;CoffeeCount;CakeCount;TableNumber;ScentType;EventType
10/26/2022 12:28:17 AM;;;;;GameBegin/Quit
10/26/2022 12:28:21 AM;;;;Ocean;
10/26/2022 12:28:25 AM;;;;Ocean;
10/26/2022 12:28:29 AM;;;;Ocean;
10/26/2022 12:28:33 AM;;;;Ocean;
10/26/2022 12:28:35 AM;;;;Ocean;
10/26/2022 12:28:37 AM;;;;Ocean;
10/26/2022 12:28:39 AM;;;;Ocean;
10/26/2022 12:28:42 AM;;;;Ocean;
10/26/2022 12:28:44 AM;;;;Ocean;
10/26/2022 12:28:46 AM;;;;Ocean;
10/26/2022 12:28:48 AM;;;;Ocean;
10/26/2022 12:28:50 AM;;;;Ocean;
10/26/2022 12:28:52 AM;;;;Ocean;
10/26/2022 12:28:54 AM;;;;Ocean;
10/26/2022 12:28:56 AM;;;;Ocean;
10/26/2022 12:28:58 AM;;;;Ocean;
10/26/2022 12:29:00 AM;;;;Ocean;
10/26/2022 12:29:04 AM;;;;Ocean;
10/26/2022 12:29:08 AM;;;;Ocean;
10/26/2022 12:29:08 AM;;;;;GameBegin/Quit
