EventTime;CoffeeCount;CakeCount;TableNumber;ScentType;EventType;CorrectCoffeeDelivery;CorrectCakeDelivery;FirstCoffeeOrCake
12/19/2022 9:59:18 PM;;;;Ocean;;;;
12/19/2022 9:59:22 PM;;;;Ocean;;;;
12/19/2022 9:59:26 PM;;;;Ocean;;;;
12/19/2022 9:59:26 PM;;;;;;;;Cake
12/19/2022 9:59:30 PM;;;;Ocean;;;;
12/19/2022 9:59:32 PM;;;;Ocean;;;;
12/19/2022 9:59:32 PM;;;;DarkChocolate;;;;
12/19/2022 9:59:34 PM;;;;Ocean;;;;
12/19/2022 9:59:34 PM;;;;DarkChocolate;;;;
12/19/2022 9:59:34 PM;0;2;PicnicTable1;;;False;False;
12/19/2022 9:59:36 PM;;;;Ocean;;;;
12/19/2022 9:59:36 PM;;;;DarkChocolate;;;;
12/19/2022 9:59:38 PM;;;;Ocean;;;;
12/19/2022 9:59:42 PM;;;;Ocean;;;;
12/19/2022 9:59:46 PM;;;;Ocean;;;;
12/19/2022 9:59:46 PM;;;;DarkChocolate;;;;
12/19/2022 9:59:47 PM;0;2;PicnicTable2;;;False;False;
12/19/2022 9:59:48 PM;;;;Ocean;;;;
12/19/2022 9:59:48 PM;;;;DarkChocolate;;;;
12/19/2022 9:59:52 PM;;;;Ocean;;;;
12/19/2022 9:59:52 PM;;;;DarkChocolate;;;;
12/19/2022 9:59:54 PM;;;;Ocean;;;;
12/19/2022 9:59:54 PM;;;;Coffee;;;;
12/19/2022 9:59:54 PM;;;;DarkChocolate;;;;
12/19/2022 9:59:56 PM;;;;Ocean;;;;
12/19/2022 9:59:56 PM;;;;Coffee;;;;
12/19/2022 9:59:56 PM;;;;DarkChocolate;;;;
12/19/2022 9:59:58 PM;7;2;PicnicTable2;;;False;False;
12/19/2022 9:59:58 PM;;;;Ocean;;;;
12/19/2022 9:59:58 PM;;;;Coffee;;;;
12/19/2022 9:59:58 PM;;;;DarkChocolate;;;;
12/19/2022 10:00:00 PM;7;2;PicnicTable2;;;False;False;
12/19/2022 10:00:00 PM;;;;Ocean;;;;
12/19/2022 10:00:00 PM;;;;Coffee;;;;
12/19/2022 10:00:00 PM;;;;DarkChocolate;;;;
12/19/2022 10:00:02 PM;;;;Ocean;;;;
12/19/2022 10:00:06 PM;;;;Ocean;;;;
12/19/2022 10:00:06 PM;;;;DarkChocolate;;;;
12/19/2022 10:00:08 PM;;;;Ocean;;;;
12/19/2022 10:00:08 PM;;;;Coffee;;;;
12/19/2022 10:00:08 PM;;;;DarkChocolate;;;;
12/19/2022 10:00:08 PM;2;2;PicnicTable1;;;False;False;
12/19/2022 10:00:10 PM;;;;Ocean;;;;
12/19/2022 10:00:10 PM;;;;Coffee;;;;
12/19/2022 10:00:10 PM;;;;DarkChocolate;;;;
12/19/2022 10:00:12 PM;;;;Ocean;;;;
12/19/2022 10:00:12 PM;;;;Coffee;;;;
12/19/2022 10:00:12 PM;;;;DarkChocolate;;;;
12/19/2022 10:00:14 PM;2;2;PicnicTable1;;;False;False;
12/19/2022 10:00:14 PM;;;;Ocean;;;;
12/19/2022 10:00:14 PM;;;;Coffee;;;;
12/19/2022 10:00:14 PM;;;;DarkChocolate;;;;
12/19/2022 10:00:16 PM;;;;Ocean;;;;
12/19/2022 10:00:16 PM;;;;Coffee;;;;
12/19/2022 10:00:16 PM;;;;DarkChocolate;;;;
12/19/2022 10:00:18 PM;;;;Ocean;;;;
12/19/2022 10:00:22 PM;;;;Ocean;;;;
12/19/2022 10:00:24 PM;;;;;;;;Cake
12/19/2022 10:00:26 PM;;;;Ocean;;;;
12/19/2022 10:00:26 PM;;;;;;;;Cake
12/19/2022 10:00:30 PM;;;;Ocean;;;;
12/19/2022 10:00:30 PM;0;0;PicnicTable1;;;True;True;
12/19/2022 10:00:32 PM;;;;Ocean;;;;
12/19/2022 10:00:32 PM;;;;DarkChocolate;;;;
12/19/2022 10:00:33 PM;0;2;PicnicTable1;;;True;False;
12/19/2022 10:00:34 PM;;;;Ocean;;;;
12/19/2022 10:00:34 PM;;;;DarkChocolate;;;;
12/19/2022 10:00:36 PM;0;2;PicnicTable1;;;True;False;
12/19/2022 10:00:36 PM;;;;Ocean;;;;
12/19/2022 10:00:36 PM;;;;DarkChocolate;;;;
12/19/2022 10:00:38 PM;;;;Ocean;;;;
12/19/2022 10:00:42 PM;;;;Ocean;;;;
12/19/2022 10:00:44 PM;;;;Ocean;;;;
12/19/2022 10:00:44 PM;;;;DarkChocolate;;;;
12/19/2022 10:00:45 PM;0;4;PicnicTable2;;;True;False;
12/19/2022 10:00:46 PM;;;;Ocean;;;;
12/19/2022 10:00:46 PM;;;;DarkChocolate;;;;
12/19/2022 10:00:48 PM;;;;Ocean;;;;
12/19/2022 10:00:48 PM;;;;Coffee;;;;
12/19/2022 10:00:48 PM;;;;DarkChocolate;;;;
12/19/2022 10:00:50 PM;10;4;PicnicTable2;;;False;False;
12/19/2022 10:00:50 PM;;;;Ocean;;;;
12/19/2022 10:00:50 PM;;;;Coffee;;;;
12/19/2022 10:00:50 PM;;;;DarkChocolate;;;;
12/19/2022 10:00:52 PM;;;;Ocean;;;;
12/19/2022 10:00:52 PM;;;;DarkChocolate;;;;
12/19/2022 10:00:56 PM;5;2;PicnicTable1;;;False;False;
12/19/2022 10:00:56 PM;;;;Ocean;;;;
12/19/2022 10:00:56 PM;;;;Coffee;;;;
12/19/2022 10:00:56 PM;;;;DarkChocolate;;;;
12/19/2022 10:00:57 PM;5;2;PicnicTable1;;;False;False;
12/19/2022 10:00:58 PM;;;;Ocean;;;;
12/19/2022 10:00:58 PM;;;;Coffee;;;;
12/19/2022 10:00:58 PM;;;;DarkChocolate;;;;
12/19/2022 10:01:00 PM;;;;Ocean;;;;
12/19/2022 10:01:04 PM;;;;Ocean;;;;
12/19/2022 10:01:08 PM;;;;Ocean;;;;
12/19/2022 10:01:11 PM;;;;;GameBegin/Quit;;;
