EventTime;CoffeeCount;CakeCount;TableNumber;ScentType;EventType
10/26/2022 12:26:43 AM;;;;Ocean;
10/26/2022 12:26:47 AM;;;;Ocean;
10/26/2022 12:26:51 AM;;;;Ocean;
10/26/2022 12:26:55 AM;;;;Ocean;
10/26/2022 12:26:59 AM;;;;Ocean;
10/26/2022 12:27:01 AM;;;;Ocean;
10/26/2022 12:27:03 AM;;;;Ocean;
10/26/2022 12:27:03 AM;;;;Coffee;
10/26/2022 12:27:05 AM;;;;Ocean;
10/26/2022 12:27:05 AM;;;;Coffee;
10/26/2022 12:27:07 AM;;;;Ocean;
10/26/2022 12:27:07 AM;;;;Coffee;
10/26/2022 12:27:09 AM;;;;Ocean;
10/26/2022 12:27:09 AM;;;;Coffee;
10/26/2022 12:27:10 AM;9;0;PicnicTable1;;
10/26/2022 12:27:11 AM;;;;Ocean;
10/26/2022 12:27:11 AM;;;;Coffee;
10/26/2022 12:27:12 AM;9;0;PicnicTable1;;
10/26/2022 12:27:13 AM;;;;Ocean;
10/26/2022 12:27:13 AM;;;;Coffee;
10/26/2022 12:27:15 AM;;;;Ocean;
10/26/2022 12:27:15 AM;;;;Coffee;
10/26/2022 12:27:17 AM;;;;Ocean;
10/26/2022 12:27:17 AM;;;;Coffee;
10/26/2022 12:27:19 AM;;;;Ocean;
10/26/2022 12:27:19 AM;;;;Coffee;
10/26/2022 12:27:21 AM;;;;Ocean;
10/26/2022 12:27:21 AM;;;;Coffee;
10/26/2022 12:27:23 AM;;;;Ocean;
10/26/2022 12:27:23 AM;;;;Coffee;
10/26/2022 12:27:25 AM;;;;Ocean;
10/26/2022 12:27:25 AM;;;;Coffee;
10/26/2022 12:27:27 AM;;;;Ocean;
10/26/2022 12:27:27 AM;;;;Coffee;
10/26/2022 12:27:29 AM;;;;Ocean;
10/26/2022 12:27:29 AM;;;;Coffee;
10/26/2022 12:27:31 AM;;;;Ocean;
10/26/2022 12:27:31 AM;;;;Coffee;
10/26/2022 12:27:33 AM;;;;Ocean;
10/26/2022 12:27:33 AM;;;;Coffee;
10/26/2022 12:27:35 AM;;;;Ocean;
10/26/2022 12:27:35 AM;;;;Coffee;
10/26/2022 12:27:37 AM;;;;Ocean;
10/26/2022 12:27:37 AM;;;;Coffee;
10/26/2022 12:27:39 AM;;;;Ocean;
10/26/2022 12:27:39 AM;;;;Coffee;
10/26/2022 12:27:41 AM;;;;Ocean;
10/26/2022 12:27:41 AM;;;;Coffee;
10/26/2022 12:27:43 AM;;;;Ocean;
10/26/2022 12:27:43 AM;;;;Coffee;
10/26/2022 12:27:45 AM;;;;Ocean;
10/26/2022 12:27:45 AM;;;;Coffee;
10/26/2022 12:27:47 AM;;;;Ocean;
10/26/2022 12:27:47 AM;;;;Coffee;
10/26/2022 12:27:47 AM;;;;;GameBegin/Quit
