EventTime;CoffeeCount;CakeCount;TableNumber;ScentType;EventType
10/26/2022 12:19:29 AM;;;;;GameBegin/Quit
10/26/2022 12:19:34 AM;;;;Ocean;
10/26/2022 12:19:38 AM;;;;Ocean;
10/26/2022 12:19:42 AM;;;;Ocean;
10/26/2022 12:19:46 AM;;;;;GameBegin/Quit
