EventTime;CoffeeCount;CakeCount;TableNumber;ScentType;EventType
10/26/2022 1:13:23 AM;;;;Ocean;
10/26/2022 1:13:27 AM;;;;Ocean;
10/26/2022 1:13:31 AM;;;;Ocean;
10/26/2022 1:13:33 AM;0;0;PicnicTable1;;
10/26/2022 1:13:35 AM;;;;Ocean;
10/26/2022 1:13:35 AM;;;;DarkChocolate;
10/26/2022 1:13:37 AM;;;;Ocean;
10/26/2022 1:13:37 AM;;;;DarkChocolate;
10/26/2022 1:13:38 AM;0;3;PicnicTable1;;
10/26/2022 1:13:39 AM;;;;Ocean;
10/26/2022 1:13:39 AM;;;;DarkChocolate;
10/26/2022 1:13:41 AM;;;;Ocean;
10/26/2022 1:13:41 AM;;;;DarkChocolate;
10/26/2022 1:13:43 AM;;;;Ocean;
10/26/2022 1:13:43 AM;;;;DarkChocolate;
10/26/2022 1:13:45 AM;0;3;PicnicTable1;;
10/26/2022 1:13:45 AM;;;;Ocean;
10/26/2022 1:13:45 AM;;;;DarkChocolate;
10/26/2022 1:13:47 AM;;;;Ocean;
10/26/2022 1:13:47 AM;;;;DarkChocolate;
10/26/2022 1:13:49 AM;;;;Ocean;
10/26/2022 1:13:53 AM;;;;Ocean;
10/26/2022 1:13:53 AM;;;;DarkChocolate;
10/26/2022 1:13:55 AM;0;1;PicnicTable2;;
10/26/2022 1:13:55 AM;;;;Ocean;
10/26/2022 1:13:55 AM;;;;DarkChocolate;
10/26/2022 1:13:57 AM;0;1;PicnicTable2;;
10/26/2022 1:13:57 AM;;;;Ocean;
10/26/2022 1:13:57 AM;;;;DarkChocolate;
10/26/2022 1:13:59 AM;;;;Ocean;
10/26/2022 1:13:59 AM;;;;DarkChocolate;
10/26/2022 1:14:01 AM;;;;Ocean;
10/26/2022 1:14:01 AM;;;;DarkChocolate;
10/26/2022 1:14:02 AM;0;1;PicnicTable2;;
10/26/2022 1:14:03 AM;;;;Ocean;
10/26/2022 1:14:03 AM;;;;DarkChocolate;
10/26/2022 1:14:06 AM;;;;Ocean;
10/26/2022 1:14:06 AM;;;;DarkChocolate;
10/26/2022 1:14:08 AM;;;;Ocean;
10/26/2022 1:14:08 AM;;;;DarkChocolate;
10/26/2022 1:14:10 AM;;;;Ocean;
10/26/2022 1:14:10 AM;;;;DarkChocolate;
10/26/2022 1:14:14 AM;;;;Ocean;
10/26/2022 1:14:14 AM;;;;DarkChocolate;
10/26/2022 1:14:16 AM;;;;Ocean;
10/26/2022 1:14:16 AM;;;;Coffee;
10/26/2022 1:14:16 AM;;;;DarkChocolate;
10/26/2022 1:14:17 AM;1;3;PicnicTable1;;
10/26/2022 1:14:18 AM;;;;Ocean;
10/26/2022 1:14:18 AM;;;;Coffee;
10/26/2022 1:14:18 AM;;;;DarkChocolate;
10/26/2022 1:14:22 AM;;;;Ocean;
10/26/2022 1:14:22 AM;;;;DarkChocolate;
10/26/2022 1:14:26 AM;;;;Ocean;
10/26/2022 1:14:26 AM;;;;DarkChocolate;
10/26/2022 1:14:27 AM;;;;;GameBegin/Quit
