EventTime;CoffeeCount;CakeCount;TableNumber;ScentType;EventType;CorrectCoffeeDelivery;CorrectCakeDelivery;FirstCoffeeOrCake;Location;Rotation
1/9/2023 3:39:21 PM;;;;Ocean;;;;;;
1/9/2023 3:39:25 PM;;;;Ocean;;;;;;
1/9/2023 3:39:29 PM;;;;Ocean;;;;;;
1/9/2023 3:39:33 PM;;;;Ocean;;;;;;
1/9/2023 3:39:37 PM;;;;Ocean;;;;;;
1/9/2023 3:39:41 PM;;;;Ocean;;;;;;
1/9/2023 3:39:45 PM;;;;Ocean;;;;;;
1/9/2023 3:39:49 PM;;;;Ocean;;;;;;
1/9/2023 3:39:53 PM;;;;Ocean;;;;;;
1/9/2023 3:39:55 PM;;;;;GameBegin/Quit;;;;;
