EventTime;CoffeeCount;CakeCount;TableNumber;ScentType;EventType;CorrectCoffeeDelivery;CorrectCakeDelivery;FirstCoffeeOrCake;Location;Rotation
1/9/2023 2:00:49 PM;;;;Ocean;;;;;;
1/9/2023 2:00:53 PM;;;;Ocean;;;;;;
1/9/2023 2:00:57 PM;;;;Ocean;;;;;;
1/9/2023 2:01:01 PM;;;;Ocean;;;;;;
1/9/2023 2:01:05 PM;;;;Ocean;;;;;;
1/9/2023 2:01:09 PM;;;;Ocean;;;;;;
1/9/2023 2:01:13 PM;;;;Ocean;;;;;;
1/9/2023 2:01:13 PM;;;;;;;;Cake;;
1/9/2023 2:01:17 PM;;;;Ocean;;;;;;
1/9/2023 2:01:17 PM;;;;Coffee;;;;;;
1/9/2023 2:01:17 PM;;;;DarkChocolate;;;;;;
1/9/2023 2:01:19 PM;;;;Ocean;;;;;;
1/9/2023 2:01:19 PM;;;;Coffee;;;;;;
1/9/2023 2:01:19 PM;;;;DarkChocolate;;;;;;
1/9/2023 2:01:21 PM;;;;Ocean;;;;;;
1/9/2023 2:01:21 PM;;;;Coffee;;;;;;
1/9/2023 2:01:21 PM;;;;DarkChocolate;;;;;;
1/9/2023 2:01:23 PM;;;;Ocean;;;;;;
1/9/2023 2:01:23 PM;;;;Coffee;;;;;;
1/9/2023 2:01:23 PM;;;;DarkChocolate;;;;;;
1/9/2023 2:01:25 PM;;;;Ocean;;;;;;
1/9/2023 2:01:25 PM;;;;Coffee;;;;;;
1/9/2023 2:01:25 PM;;;;DarkChocolate;;;;;;
1/9/2023 2:01:27 PM;;;;Ocean;;;;;;
1/9/2023 2:01:27 PM;;;;Coffee;;;;;;
1/9/2023 2:01:27 PM;;;;DarkChocolate;;;;;;
1/9/2023 2:01:29 PM;;;;Ocean;;;;;;
1/9/2023 2:01:29 PM;;;;Coffee;;;;;;
1/9/2023 2:01:29 PM;;;;DarkChocolate;;;;;;
1/9/2023 2:01:32 PM;;;;Ocean;;;;;;
1/9/2023 2:01:32 PM;;;;Coffee;;;;;;
1/9/2023 2:01:32 PM;;;;DarkChocolate;;;;;;
1/9/2023 2:01:34 PM;;;;Ocean;;;;;;
1/9/2023 2:01:34 PM;;;;Coffee;;;;;;
1/9/2023 2:01:34 PM;;;;DarkChocolate;;;;;;
1/9/2023 2:01:36 PM;;;;Ocean;;;;;;
1/9/2023 2:01:36 PM;;;;Coffee;;;;;;
1/9/2023 2:01:36 PM;;;;DarkChocolate;;;;;;
1/9/2023 2:01:38 PM;;;;Ocean;;;;;;
1/9/2023 2:01:38 PM;;;;Coffee;;;;;;
1/9/2023 2:01:38 PM;;;;DarkChocolate;;;;;;
1/9/2023 2:01:40 PM;;;;Ocean;;;;;;
1/9/2023 2:01:40 PM;;;;Coffee;;;;;;
1/9/2023 2:01:40 PM;;;;DarkChocolate;;;;;;
1/9/2023 2:01:42 PM;;;;Ocean;;;;;;
1/9/2023 2:01:42 PM;;;;Coffee;;;;;;
1/9/2023 2:01:42 PM;;;;DarkChocolate;;;;;;
1/9/2023 2:01:44 PM;;;;Ocean;;;;;;
1/9/2023 2:01:44 PM;;;;Coffee;;;;;;
1/9/2023 2:01:44 PM;;;;DarkChocolate;;;;;;
1/9/2023 2:01:46 PM;;;;Ocean;;;;;;
1/9/2023 2:01:46 PM;;;;Coffee;;;;;;
1/9/2023 2:01:46 PM;;;;DarkChocolate;;;;;;
1/9/2023 2:01:48 PM;;;;Ocean;;;;;;
1/9/2023 2:01:48 PM;;;;Coffee;;;;;;
1/9/2023 2:01:48 PM;;;;DarkChocolate;;;;;;
1/9/2023 2:01:50 PM;;;;Ocean;;;;;;
1/9/2023 2:01:50 PM;;;;Coffee;;;;;;
1/9/2023 2:01:50 PM;;;;DarkChocolate;;;;;;
1/9/2023 2:01:52 PM;;;;Ocean;;;;;;
1/9/2023 2:01:52 PM;;;;Coffee;;;;;;
1/9/2023 2:01:52 PM;;;;DarkChocolate;;;;;;
1/9/2023 2:01:53 PM;;;;;GameBegin/Quit;;;;;
