EventTime;CoffeeCount;CakeCount;TableNumber;ScentType;EventType
11/21/2022 1:36:16 PM;;;;Ocean;
11/21/2022 1:36:20 PM;;;;Ocean;
11/21/2022 1:36:24 PM;;;;Ocean;
11/21/2022 1:36:28 PM;;;;Ocean;
11/21/2022 1:36:32 PM;;;;Ocean;
11/21/2022 1:36:36 PM;;;;Ocean;
11/21/2022 1:36:40 PM;;;;Ocean;
11/21/2022 1:36:44 PM;;;;Ocean;
11/21/2022 1:36:48 PM;;;;Ocean;
11/21/2022 1:36:52 PM;;;;Ocean;
11/21/2022 1:36:56 PM;;;;Ocean;
11/21/2022 1:37:00 PM;;;;Ocean;
11/21/2022 1:37:04 PM;;;;;GameBegin/Quit
