EventTime;CoffeeCount;CakeCount;TableNumber;ScentType;EventType;CorrectCoffeeDelivery;CorrectCakeDelivery;FirstCoffeeOrCake;Location;Rotation
1/9/2023 3:59:39 PM;;;;Ocean;;;;;;
1/9/2023 3:59:43 PM;;;;Ocean;;;;;;
1/9/2023 3:59:47 PM;;;;Ocean;;;;;;
1/9/2023 3:59:51 PM;;;;Ocean;;;;;;
1/9/2023 3:59:55 PM;;;;Ocean;;;;;;
1/9/2023 3:59:59 PM;;;;Ocean;;;;;;
1/9/2023 4:00:03 PM;;;;Ocean;;;;;;
1/9/2023 4:00:07 PM;;;;Ocean;;;;;;
1/9/2023 4:00:11 PM;;;;Ocean;;;;;;
1/9/2023 4:00:15 PM;;;;Ocean;;;;;;
1/9/2023 4:00:19 PM;;;;Ocean;;;;;;
1/9/2023 4:00:23 PM;;;;Ocean;;;;;;
1/9/2023 4:00:27 PM;;;;Ocean;;;;;;
1/9/2023 4:00:31 PM;;;;Ocean;;;;;;
1/9/2023 4:00:35 PM;;;;Ocean;;;;;;
1/9/2023 4:00:39 PM;;;;Ocean;;;;;;
1/9/2023 4:00:43 PM;;;;Ocean;;;;;;
1/9/2023 4:00:47 PM;;;;Ocean;;;;;;
1/9/2023 4:00:51 PM;;;;Ocean;;;;;;
1/9/2023 4:00:55 PM;;;;Ocean;;;;;;
1/9/2023 4:00:59 PM;;;;Ocean;;;;;;
1/9/2023 4:01:03 PM;;;;Ocean;;;;;;
1/9/2023 4:01:07 PM;;;;Ocean;;;;;;
1/9/2023 4:01:11 PM;;;;Ocean;;;;;;
1/9/2023 4:01:15 PM;;;;Ocean;;;;;;
1/9/2023 4:01:19 PM;;;;Ocean;;;;;;
1/9/2023 4:01:23 PM;;;;Ocean;;;;;;
1/9/2023 4:01:27 PM;;;;Ocean;;;;;;
1/9/2023 4:01:31 PM;;;;Ocean;;;;;;
1/9/2023 4:01:35 PM;;;;Ocean;;;;;;
1/9/2023 4:01:39 PM;;;;Ocean;;;;;;
1/9/2023 4:01:43 PM;;;;Ocean;;;;;;
1/9/2023 4:01:47 PM;;;;Ocean;;;;;;
1/9/2023 4:01:51 PM;;;;Ocean;;;;;;
1/9/2023 4:01:55 PM;;;;Ocean;;;;;;
1/9/2023 4:01:59 PM;;;;Ocean;;;;;;
1/9/2023 4:02:03 PM;;;;Ocean;;;;;;
1/9/2023 4:02:07 PM;;;;Ocean;;;;;;
1/9/2023 4:02:11 PM;;;;Ocean;;;;;;
1/9/2023 4:02:15 PM;;;;Ocean;;;;;;
1/9/2023 4:02:19 PM;;;;Ocean;;;;;;
1/9/2023 4:02:23 PM;;;;Ocean;;;;;;
1/9/2023 4:02:27 PM;;;;Ocean;;;;;;
1/9/2023 4:02:31 PM;;;;Ocean;;;;;;
1/9/2023 4:02:35 PM;;;;Ocean;;;;;;
1/9/2023 4:02:39 PM;;;;Ocean;;;;;;
1/9/2023 4:02:43 PM;;;;Ocean;;;;;;
1/9/2023 4:02:47 PM;;;;Ocean;;;;;;
1/9/2023 4:02:51 PM;;;;Ocean;;;;;;
1/9/2023 4:02:55 PM;;;;Ocean;;;;;;
1/9/2023 4:02:59 PM;;;;Ocean;;;;;;
1/9/2023 4:03:03 PM;;;;Ocean;;;;;;
1/9/2023 4:03:07 PM;;;;Ocean;;;;;;
1/9/2023 4:03:11 PM;;;;Ocean;;;;;;
1/9/2023 4:03:15 PM;;;;Ocean;;;;;;
1/9/2023 4:03:19 PM;;;;Ocean;;;;;;
1/9/2023 4:03:23 PM;;;;Ocean;;;;;;
1/9/2023 4:03:27 PM;;;;Ocean;;;;;;
1/9/2023 4:03:31 PM;;;;Ocean;;;;;;
1/9/2023 4:03:35 PM;;;;Ocean;;;;;;
1/9/2023 4:03:39 PM;;;;Ocean;;;;;;
1/9/2023 4:03:43 PM;;;;Ocean;;;;;;
1/9/2023 4:03:47 PM;;;;Ocean;;;;;;
1/9/2023 4:03:51 PM;;;;Ocean;;;;;;
1/9/2023 4:03:55 PM;;;;Ocean;;;;;;
1/9/2023 4:03:59 PM;;;;Ocean;;;;;;
1/9/2023 4:04:03 PM;;;;Ocean;;;;;;
1/9/2023 4:04:07 PM;;;;Ocean;;;;;;
1/9/2023 4:04:11 PM;;;;Ocean;;;;;;
1/9/2023 4:04:15 PM;;;;Ocean;;;;;;
1/9/2023 4:04:19 PM;;;;Ocean;;;;;;
1/9/2023 4:04:23 PM;;;;Ocean;;;;;;
1/9/2023 4:04:27 PM;;;;Ocean;;;;;;
1/9/2023 4:04:31 PM;;;;Ocean;;;;;;
1/9/2023 4:04:35 PM;;;;Ocean;;;;;;
1/9/2023 4:04:39 PM;;;;Ocean;;;;;;
1/9/2023 4:04:43 PM;;;;Ocean;;;;;;
1/9/2023 4:04:47 PM;;;;Ocean;;;;;;
1/9/2023 4:04:51 PM;;;;Ocean;;;;;;
1/9/2023 4:04:55 PM;;;;Ocean;;;;;;
1/9/2023 4:04:59 PM;;;;Ocean;;;;;;
1/9/2023 4:05:03 PM;;;;Ocean;;;;;;
1/9/2023 4:05:07 PM;;;;Ocean;;;;;;
1/9/2023 4:05:11 PM;;;;;GameBegin/Quit;;;;;
