EventTime;CoffeeCount;CakeCount;TableNumber;ScentType;EventType;CorrectCoffeeDelivery;CorrectCakeDelivery;FirstCoffeeOrCake;Location;Rotation
1/10/2023 1:12:24 PM;;;;Ocean;;;;;;
1/10/2023 1:12:26 PM;;;;;;;;Coffee;;
1/10/2023 1:12:28 PM;;;;Ocean;;;;;;
1/10/2023 1:12:32 PM;;;;Ocean;;;;;;
1/10/2023 1:12:32 PM;;;;Coffee;;;;;;
1/10/2023 1:12:32 PM;;;;DarkChocolate;;;;;;
1/10/2023 1:12:34 PM;;;;Ocean;;;;;;
1/10/2023 1:12:34 PM;;;;Coffee;;;;;;
1/10/2023 1:12:34 PM;;;;DarkChocolate;;;;;;
1/10/2023 1:12:36 PM;;;;Ocean;;;;;;
1/10/2023 1:12:36 PM;;;;Coffee;;;;;;
1/10/2023 1:12:36 PM;;;;DarkChocolate;;;;;;
1/10/2023 1:12:38 PM;;;;Ocean;;;;;;
1/10/2023 1:12:38 PM;;;;Coffee;;;;;;
1/10/2023 1:12:38 PM;;;;DarkChocolate;;;;;;
1/10/2023 1:12:40 PM;;;;Ocean;;;;;;
1/10/2023 1:12:40 PM;;;;Coffee;;;;;;
1/10/2023 1:12:40 PM;;;;DarkChocolate;;;;;;
1/10/2023 1:12:42 PM;;;;Ocean;;;;;;
1/10/2023 1:12:42 PM;;;;Coffee;;;;;;
1/10/2023 1:12:42 PM;;;;DarkChocolate;;;;;;
1/10/2023 1:12:44 PM;;;;Ocean;;;;;;
1/10/2023 1:12:44 PM;;;;Coffee;;;;;;
1/10/2023 1:12:44 PM;;;;DarkChocolate;;;;;;
1/10/2023 1:12:46 PM;;;;Ocean;;;;;;
1/10/2023 1:12:46 PM;;;;Coffee;;;;;;
1/10/2023 1:12:46 PM;;;;DarkChocolate;;;;;;
1/10/2023 1:12:48 PM;;;;Ocean;;;;;;
1/10/2023 1:12:48 PM;;;;Coffee;;;;;;
1/10/2023 1:12:48 PM;;;;DarkChocolate;;;;;;
1/10/2023 1:12:50 PM;;;;Ocean;;;;;;
1/10/2023 1:12:50 PM;;;;Coffee;;;;;;
1/10/2023 1:12:50 PM;;;;DarkChocolate;;;;;;
1/10/2023 1:12:52 PM;;;;Ocean;;;;;;
1/10/2023 1:12:52 PM;;;;Coffee;;;;;;
1/10/2023 1:12:52 PM;;;;DarkChocolate;;;;;;
1/10/2023 1:12:54 PM;;;;Ocean;;;;;;
1/10/2023 1:12:54 PM;;;;Coffee;;;;;;
1/10/2023 1:12:54 PM;;;;DarkChocolate;;;;;;
1/10/2023 1:12:56 PM;;;;Ocean;;;;;;
1/10/2023 1:12:56 PM;;;;Coffee;;;;;;
1/10/2023 1:12:56 PM;;;;DarkChocolate;;;;;;
1/10/2023 1:12:58 PM;;;;Ocean;;;;;;
1/10/2023 1:12:58 PM;;;;Coffee;;;;;;
1/10/2023 1:12:58 PM;;;;DarkChocolate;;;;;;
1/10/2023 1:13:00 PM;;;;Ocean;;;;;;
1/10/2023 1:13:00 PM;;;;Coffee;;;;;;
1/10/2023 1:13:00 PM;;;;DarkChocolate;;;;;;
1/10/2023 1:13:01 PM;;;;;GameBegin/Quit;;;;;
