EventTime;CoffeeCount;CakeCount;TableNumber;ScentType;EventType
11/11/2022 12:37:01 PM;;;;Ocean;
11/11/2022 12:37:05 PM;;;;Ocean;
11/11/2022 12:37:09 PM;;;;Ocean;
11/11/2022 12:37:13 PM;;;;Ocean;
11/11/2022 12:37:17 PM;;;;Ocean;
11/11/2022 12:37:19 PM;;;;Ocean;
11/11/2022 12:37:19 PM;;;;Coffee;
11/11/2022 12:37:21 PM;4;0;PicnicTable1;;
11/11/2022 12:37:22 PM;;;;Ocean;
11/11/2022 12:37:22 PM;;;;Coffee;
11/11/2022 12:37:24 PM;4;0;PicnicTable1;;
11/11/2022 12:37:24 PM;;;;Ocean;
11/11/2022 12:37:24 PM;;;;Coffee;
11/11/2022 12:37:26 PM;;;;Ocean;
11/11/2022 12:37:26 PM;;;;Coffee;
11/11/2022 12:37:28 PM;;;;Ocean;
11/11/2022 12:37:32 PM;;;;Ocean;
11/11/2022 12:37:32 PM;;;;Coffee;
11/11/2022 12:37:32 PM;2;0;PicnicTable2;;
11/11/2022 12:37:33 PM;2;0;PicnicTable2;;
11/11/2022 12:37:34 PM;;;;Ocean;
11/11/2022 12:37:34 PM;;;;Coffee;
11/11/2022 12:37:34 PM;;;;DarkChocolate;
11/11/2022 12:37:36 PM;;;;Ocean;
11/11/2022 12:37:36 PM;;;;Coffee;
11/11/2022 12:37:36 PM;;;;DarkChocolate;
11/11/2022 12:37:36 PM;2;3;PicnicTable2;;
11/11/2022 12:37:38 PM;;;;Ocean;
11/11/2022 12:37:38 PM;;;;Coffee;
11/11/2022 12:37:38 PM;;;;DarkChocolate;
11/11/2022 12:37:38 PM;2;3;PicnicTable2;;
11/11/2022 12:37:40 PM;;;;Ocean;
11/11/2022 12:37:40 PM;;;;Coffee;
11/11/2022 12:37:40 PM;;;;DarkChocolate;
11/11/2022 12:37:44 PM;;;;Ocean;
11/11/2022 12:37:44 PM;;;;Coffee;
11/11/2022 12:37:48 PM;;;;Ocean;
11/11/2022 12:37:48 PM;;;;Coffee;
11/11/2022 12:37:48 PM;;;;DarkChocolate;
11/11/2022 12:37:50 PM;4;3;PicnicTable1;;
11/11/2022 12:37:50 PM;;;;Ocean;
11/11/2022 12:37:50 PM;;;;Coffee;
11/11/2022 12:37:50 PM;;;;DarkChocolate;
11/11/2022 12:37:52 PM;;;;Ocean;
11/11/2022 12:37:56 PM;;;;Ocean;
11/11/2022 12:38:00 PM;;;;Ocean;
11/11/2022 12:38:04 PM;;;;Ocean;
11/11/2022 12:38:08 PM;;;;Ocean;
11/11/2022 12:38:12 PM;;;;Ocean;
11/11/2022 12:38:16 PM;;;;Ocean;
11/11/2022 12:38:18 PM;;;;;GameBegin/Quit
