EventTime;CoffeeCount;CakeCount;TableNumber;ScentType;EventType
10/26/2022 12:17:08 AM;;;;;GameBegin/Quit
10/26/2022 12:17:13 AM;;;;Ocean;
10/26/2022 12:17:17 AM;;;;Ocean;
10/26/2022 12:17:21 AM;;;;Ocean;
10/26/2022 12:17:25 AM;;;;Ocean;
10/26/2022 12:17:29 AM;;;;Ocean;
10/26/2022 12:17:33 AM;;;;Ocean;
10/26/2022 12:17:37 AM;;;;Ocean;
10/26/2022 12:17:41 AM;;;;Ocean;
10/26/2022 12:17:43 AM;;;;Ocean;
10/26/2022 12:17:45 AM;;;;Ocean;
10/26/2022 12:17:45 AM;;;;Coffee;
10/26/2022 12:17:47 AM;;;;Ocean;
10/26/2022 12:17:47 AM;;;;Coffee;
10/26/2022 12:17:49 AM;;;;Ocean;
10/26/2022 12:17:49 AM;;;;Coffee;
10/26/2022 12:17:51 AM;;;;Ocean;
10/26/2022 12:17:51 AM;;;;Coffee;
10/26/2022 12:17:53 AM;;;;Ocean;
10/26/2022 12:17:53 AM;;;;Coffee;
10/26/2022 12:17:55 AM;;;;Ocean;
10/26/2022 12:17:55 AM;;;;Coffee;
10/26/2022 12:17:57 AM;;;;Ocean;
10/26/2022 12:18:01 AM;;;;Ocean;
10/26/2022 12:18:01 AM;;;;Coffee;
10/26/2022 12:18:03 AM;;;;Ocean;
10/26/2022 12:18:03 AM;;;;Coffee;
10/26/2022 12:18:05 AM;;;;Ocean;
10/26/2022 12:18:05 AM;;;;Coffee;
10/26/2022 12:18:05 AM;;;;DarkChocolate;
10/26/2022 12:18:07 AM;;;;Ocean;
10/26/2022 12:18:07 AM;;;;Coffee;
10/26/2022 12:18:07 AM;;;;DarkChocolate;
10/26/2022 12:18:09 AM;;;;Ocean;
10/26/2022 12:18:09 AM;;;;Coffee;
10/26/2022 12:18:09 AM;;;;DarkChocolate;
10/26/2022 12:18:13 AM;;;;Ocean;
10/26/2022 12:18:13 AM;;;;Coffee;
10/26/2022 12:18:17 AM;;;;Ocean;
10/26/2022 12:18:17 AM;;;;Coffee;
10/26/2022 12:18:19 AM;;;;Ocean;
10/26/2022 12:18:19 AM;;;;Coffee;
10/26/2022 12:18:19 AM;;;;DarkChocolate;
10/26/2022 12:18:21 AM;;;;Ocean;
10/26/2022 12:18:21 AM;;;;Coffee;
10/26/2022 12:18:21 AM;;;;DarkChocolate;
10/26/2022 12:18:25 AM;;;;Ocean;
10/26/2022 12:18:25 AM;;;;Coffee;
10/26/2022 12:18:25 AM;;;;DarkChocolate;
10/26/2022 12:18:29 AM;;;;Ocean;
10/26/2022 12:18:33 AM;;;;Ocean;
10/26/2022 12:18:37 AM;;;;Ocean;
10/26/2022 12:18:41 AM;;;;Ocean;
10/26/2022 12:18:45 AM;;;;Ocean;
10/26/2022 12:18:50 AM;;;;Ocean;
10/26/2022 12:18:54 AM;;;;Ocean;
10/26/2022 12:18:58 AM;;;;Ocean;
10/26/2022 12:19:02 AM;;;;Ocean;
10/26/2022 12:19:06 AM;;;;Ocean;
10/26/2022 12:19:10 AM;;;;Ocean;
10/26/2022 12:19:14 AM;;;;Ocean;
10/26/2022 12:19:17 AM;;;;;GameBegin/Quit
