EventTime;CoffeeCount;CakeCount;TableNumber;ScentType;EventType;CorrectCoffeeDelivery;CorrectCakeDelivery;FirstCoffeeOrCake;Location;Rotation
1/5/2023 11:25:24 AM;;;;Ocean;;;;;;
1/5/2023 11:25:24 AM;;;;;;;;Cake;;
1/5/2023 11:25:28 AM;;;;Ocean;;;;;;
1/5/2023 11:25:32 AM;;;;Ocean;;;;;;
1/5/2023 11:25:32 AM;;;;DarkChocolate;;;;;;
1/5/2023 11:25:34 AM;;;;Ocean;;;;;;
1/5/2023 11:25:34 AM;;;;DarkChocolate;;;;;;
1/5/2023 11:25:36 AM;;;;Ocean;;;;;;
1/5/2023 11:25:36 AM;;;;DarkChocolate;;;;;;
1/5/2023 11:25:38 AM;;;;Ocean;;;;;;
1/5/2023 11:25:38 AM;;;;DarkChocolate;;;;;;
1/5/2023 11:25:40 AM;;;;Ocean;;;;;;
1/5/2023 11:25:40 AM;;;;DarkChocolate;;;;;;
1/5/2023 11:25:42 AM;;;;Ocean;;;;;;
1/5/2023 11:25:42 AM;;;;DarkChocolate;;;;;;
1/5/2023 11:25:44 AM;;;;Ocean;;;;;;
1/5/2023 11:25:44 AM;;;;DarkChocolate;;;;;;
1/5/2023 11:25:46 AM;;;;Ocean;;;;;;
1/5/2023 11:25:46 AM;;;;DarkChocolate;;;;;;
1/5/2023 11:25:48 AM;;;;Ocean;;;;;;
1/5/2023 11:25:48 AM;;;;DarkChocolate;;;;;;
1/5/2023 11:25:50 AM;;;;Ocean;;;;;;
1/5/2023 11:25:50 AM;;;;DarkChocolate;;;;;;
1/5/2023 11:25:52 AM;;;;Ocean;;;;;;
1/5/2023 11:25:52 AM;;;;DarkChocolate;;;;;;
1/5/2023 11:25:53 AM;;;;;GameBegin/Quit;;;;;
