EventTime;CoffeeCount;CakeCount;TableNumber;ScentType;EventType;CorrectCoffeeDelivery;CorrectCakeDelivery;FirstCoffeeOrCake
12/1/2022 11:59:43 PM;;;;Ocean;;;;
12/1/2022 11:59:47 PM;;;;Ocean;;;;
12/1/2022 11:59:51 PM;;;;Ocean;;;;
12/1/2022 11:59:54 PM;;;;;GameBegin/Quit;;;
