EventTime;CoffeeCount;CakeCount;TableNumber;ScentType;EventType;CorrectCoffeeDelivery;CorrectCakeDelivery;FirstCoffeeOrCake;Location;Rotation
1/5/2023 11:42:45 AM;;;;;GameBegin/Quit;;;;;
1/5/2023 11:42:50 AM;;;;Ocean;;;;;;
1/5/2023 11:42:54 AM;;;;Ocean;;;;;;
1/5/2023 11:42:58 AM;;;;Ocean;;;;;;
1/5/2023 11:43:00 AM;;;;Ocean;;;;;;
1/5/2023 11:43:00 AM;;;;Coffee;;;;;;
1/5/2023 11:43:02 AM;;;;Ocean;;;;;;
1/5/2023 11:43:02 AM;;;;Coffee;;;;;;
1/5/2023 11:43:04 AM;;;;Ocean;;;;;;
1/5/2023 11:43:04 AM;;;;Coffee;;;;;;
1/5/2023 11:43:06 AM;;;;Ocean;;;;;;
1/5/2023 11:43:06 AM;;;;Coffee;;;;;;
1/5/2023 11:43:08 AM;;;;Ocean;;;;;;
1/5/2023 11:43:08 AM;;;;Coffee;;;;;;
1/5/2023 11:43:10 AM;;;;Ocean;;;;;;
1/5/2023 11:43:10 AM;;;;Coffee;;;;;;
1/5/2023 11:43:12 AM;;;;Ocean;;;;;;
1/5/2023 11:43:12 AM;;;;Coffee;;;;;;
1/5/2023 11:43:14 AM;;;;Ocean;;;;;;
1/5/2023 11:43:14 AM;;;;Coffee;;;;;;
1/5/2023 11:43:16 AM;;;;Ocean;;;;;;
1/5/2023 11:43:16 AM;;;;Coffee;;;;;;
1/5/2023 11:43:18 AM;;;;Ocean;;;;;;
1/5/2023 11:43:18 AM;;;;Coffee;;;;;;
1/5/2023 11:43:20 AM;;;;Ocean;;;;;;
1/5/2023 11:43:20 AM;;;;Coffee;;;;;;
1/5/2023 11:43:22 AM;;;;Ocean;;;;;;
1/5/2023 11:43:22 AM;;;;Coffee;;;;;;
1/5/2023 11:43:24 AM;;;;Ocean;;;;;;
1/5/2023 11:43:24 AM;;;;Coffee;;;;;;
1/5/2023 11:43:26 AM;;;;Ocean;;;;;;
1/5/2023 11:43:30 AM;;;;Ocean;;;;;;
1/5/2023 11:43:30 AM;;;;Coffee;;;;;;
1/5/2023 11:43:32 AM;;;;Ocean;;;;;;
1/5/2023 11:43:32 AM;;;;Coffee;;;;;;
1/5/2023 11:43:34 AM;;;;Ocean;;;;;;
1/5/2023 11:43:34 AM;;;;Coffee;;;;;;
1/5/2023 11:43:36 AM;;;;Ocean;;;;;;
1/5/2023 11:43:36 AM;;;;Coffee;;;;;;
1/5/2023 11:43:38 AM;;;;Ocean;;;;;;
1/5/2023 11:43:38 AM;;;;Coffee;;;;;;
1/5/2023 11:43:40 AM;;;;Ocean;;;;;;
1/5/2023 11:43:40 AM;;;;Coffee;;;;;;
1/5/2023 11:43:42 AM;;;;Ocean;;;;;;
1/5/2023 11:43:42 AM;;;;Coffee;;;;;;
1/5/2023 11:43:44 AM;;;;Ocean;;;;;;
1/5/2023 11:43:44 AM;;;;Coffee;;;;;;
1/5/2023 11:43:46 AM;;;;Ocean;;;;;;
1/5/2023 11:43:46 AM;;;;Coffee;;;;;;
1/5/2023 11:43:48 AM;;;;Ocean;;;;;;
1/5/2023 11:43:48 AM;;;;Coffee;;;;;;
1/5/2023 11:43:50 AM;;;;Ocean;;;;;;
1/5/2023 11:43:50 AM;;;;Coffee;;;;;;
1/5/2023 11:43:52 AM;;;;Ocean;;;;;;
1/5/2023 11:43:52 AM;;;;Coffee;;;;;;
1/5/2023 11:43:54 AM;;;;Ocean;;;;;;
1/5/2023 11:43:54 AM;;;;Coffee;;;;;;
1/5/2023 11:43:56 AM;;;;Ocean;;;;;;
1/5/2023 11:43:56 AM;;;;Coffee;;;;;;
1/5/2023 11:43:57 AM;;;;;GameBegin/Quit;;;;;
