EventTime;CoffeeCount;CakeCount;TableNumber;ScentType;EventType;CorrectCoffeeDelivery;CorrectCakeDelivery;FirstCoffeeOrCake;Location;Rotation
1/5/2023 11:29:21 AM;;;;Ocean;;;;;;
1/5/2023 11:29:21 AM;;;;;;;;Coffee;;
1/5/2023 11:29:25 AM;;;;Ocean;;;;;;
1/5/2023 11:29:29 AM;;;;Ocean;;;;;;
1/5/2023 11:29:29 AM;;;;Coffee;;;;;;
1/5/2023 11:29:31 AM;;;;Ocean;;;;;;
1/5/2023 11:29:31 AM;;;;Coffee;;;;;;
1/5/2023 11:29:33 AM;;;;Ocean;;;;;;
1/5/2023 11:29:33 AM;;;;Coffee;;;;;;
1/5/2023 11:29:33 AM;;;;;GameBegin/Quit;;;;;
