EventTime;CoffeeCount;CakeCount;TableNumber;ScentType;EventType
11/8/2022 7:00:16 PM;;;;;GameBegin/Quit
11/8/2022 7:00:20 PM;;;;Ocean;
11/8/2022 7:00:24 PM;;;;Ocean;
11/8/2022 7:00:28 PM;;;;Ocean;
11/8/2022 7:00:32 PM;;;;Ocean;
11/8/2022 7:00:36 PM;;;;Ocean;
11/8/2022 7:00:46 PM;;;;Ocean;
11/8/2022 7:00:48 PM;;;;;GameBegin/Quit
