full_name,address,phone,login,password
Dokotov Max,Kyivska Str. 56,+380975643212,e1673a079b157296a4fb9f63f661b6a7,225ecf2673b4a2baa1be0689daafe1c9
Vasechkin Petya,Stornova Str.45,+44567567890,7c3218b257180de8323dbc65e6e1d2b3,e14136acef9990bca6224be348121c89
Kotov Sergey,Neznakomaya Str. 12,+380675643122,1731d69d123e22331e429ce7cc181338,10735e9decb7563e81ca14f6953b3d5a
