@relation 'LanguageTraining-weka.filters.unsupervised.attribute.Remove-R3-weka.filters.unsupervised.attribute.NominalToString-C1-weka.filters.unsupervised.attribute.StringToWordVector-R1-W1000-prune-rate-1.0-N0-stemmerweka.core.stemmers.NullStemmer-stopwords-handlerweka.core.stopwords.Null-M1-tokenizerweka.core.tokenizers.CharacterNGramTokenizer -max 2 -min 2-weka.filters.supervised.attribute.AttributeSelection-Eweka.attributeSelection.CorrelationAttributeEval-Sweka.attributeSelection.Ranker -T -1.7976931348623157E308 -N 300-weka.filters.MultiFilter-Fweka.filters.unsupervised.attribute.NominalToString -C 1-Fweka.filters.unsupervised.attribute.StringToWordVector -R 1 -W 1000 -prune-rate -1.0 -N 0 -stemmer weka.core.stemmers.NullStemmer -stopwords-handler weka.core.stopwords.Null -M 1 -tokenizer \"weka.core.tokenizers.CharacterNGramTokenizer -max 2 -min 2\"-Fweka.filters.supervised.attribute.AttributeSelection -E \"weka.attributeSelection.CorrelationAttributeEval \" -S \"weka.attributeSelection.Ranker -T -1.7976931348623157E308 -N 300\"'

@attribute st numeric
@attribute 't ' numeric
@attribute 'a ' numeric
@attribute ' p' numeric
@attribute en numeric
@attribute ' c' numeric
@attribute 'o ' numeric
@attribute he numeric
@attribute io numeric
@attribute ca numeric
@attribute 'e ' numeric
@attribute ng numeric
@attribute 'i ' numeric
@attribute 's ' numeric
@attribute er numeric
@attribute co numeric
@attribute te numeric
@attribute es numeric
@attribute ' e' numeric
@attribute 'l ' numeric
@attribute nd numeric
@attribute ст numeric
@attribute ир numeric
@attribute ke numeric
@attribute ' l' numeric
@attribute em numeric
@attribute 'g ' numeric
@attribute ad numeric
@attribute ge numeric
@attribute in numeric
@attribute de numeric
@attribute 'n ' numeric
@attribute ' t' numeric
@attribute ti numeric
@attribute ' в' numeric
@attribute но numeric
@attribute ен numeric
@attribute ре numeric
@attribute ' п' numeric
@attribute 'е ' numeric
@attribute ' с' numeric
@attribute 'h ' numeric
@attribute ai numeric
@attribute pa numeric
@attribute ce numeric
@attribute is numeric
@attribute ' i' numeric
@attribute ch numeric
@attribute me numeric
@attribute le numeric
@attribute ' a' numeric
@attribute 'd ' numeric
@attribute ns numeric
@attribute el numeric
@attribute nt numeric
@attribute ar numeric
@attribute li numeric
@attribute so numeric
@attribute un numeric
@attribute an numeric
@attribute nc numeric
@attribute 'r ' numeric
@attribute ri numeric
@attribute al numeric
@attribute on numeric
@attribute re numeric
@attribute se numeric
@attribute at numeric
@attribute ' d' numeric
@attribute ne numeric
@attribute ic numeric
@attribute ка numeric
@attribute ан numeric
@attribute по numeric
@attribute ра numeric
@attribute об numeric
@attribute 'и ' numeric
@attribute ' м' numeric
@attribute ми numeric
@attribute ou numeric
@attribute tt numeric
@attribute ru numeric
@attribute ls numeric
@attribute ' b' numeric
@attribute be numeric
@attribute ed numeric
@attribute ' f' numeric
@attribute la numeric
@attribute ' o' numeric
@attribute it numeric
@attribute or numeric
@attribute et numeric
@attribute ' n' numeric
@attribute fr numeric
@attribute ab numeric
@attribute 'l\'' numeric
@attribute ea numeric
@attribute fo numeric
@attribute 'y ' numeric
@attribute ия numeric
@attribute тр numeric
@attribute а  numeric
@attribute на numeric
@attribute eu numeric
@attribute 'u ' numeric
@attribute ' w' numeric
@attribute zz numeric
@attribute ой numeric
@attribute we numeric
@attribute ит numeric
@attribute 'о ' numeric
@attribute ки numeric
@attribute 'я ' numeric
@attribute то numeric
@attribute ко numeric
@attribute ро numeric
@attribute рн numeric
@attribute он numeric
@attribute ед numeric
@attribute ни numeric
@attribute ем numeric
@attribute те numeric
@attribute ' и' numeric
@attribute Ми numeric
@attribute ар numeric
@attribute ' m' numeric
@attribute ' u' numeric
@attribute po numeric
@attribute ss numeric
@attribute eg numeric
@attribute ta numeric
@attribute ' s' numeric
@attribute lt numeric
@attribute og numeric
@attribute qu numeric
@attribute 'm ' numeric
@attribute ua numeric
@attribute om numeric
@attribute di numeric
@attribute ly numeric
@attribute mo numeric
@attribute és numeric
@attribute zi numeric
@attribute no numeric
@attribute ci numeric
@attribute ur numeric
@attribute az numeric
@attribute tr numeric
@attribute ve numeric
@attribute ra numeric
@attribute ma numeric
@attribute ac numeric
@attribute sa numeric
@attribute mi numeric
@attribute to numeric
@attribute ro numeric
@attribute ' E' numeric
@attribute au numeric
@attribute ' S' numeric
@attribute 'ن ' numeric
@attribute 'т ' numeric
@attribute بي numeric
@attribute ' ق' numeric
@attribute ان numeric
@attribute ár numeric
@attribute sz numeric
@attribute ák numeric
@attribute ix numeric
@attribute do numeric
@attribute ue numeric
@attribute ui numeric
@attribute ga numeric
@attribute ет numeric
@attribute sé numeric
@attribute ое numeric
@attribute во numeric
@attribute a. numeric
@attribute тв numeric
@attribute нн numeric
@attribute ле numeric
@attribute ам numeric
@attribute ' \'' numeric
@attribute ' á' numeric
@attribute из numeric
@attribute 'à ' numeric
@attribute од numeric
@attribute ос numeric
@attribute вр numeric
@attribute ka numeric
@attribute '\' ' numeric
@attribute 'а,' numeric
@attribute sk numeric
@attribute ty numeric
@attribute ак numeric
@attribute ko numeric
@attribute ' т' numeric
@attribute ри numeric
@attribute та numeric
@attribute ел numeric
@attribute ат numeric
@attribute ор numeric
@attribute ве numeric
@attribute ин numeric
@attribute им numeric
@attribute де numeric
@attribute ов numeric
@attribute iz numeric
@attribute ' н' numeric
@attribute 'а ' numeric
@attribute се numeric
@attribute са numeric
@attribute il numeric
@attribute ha numeric
@attribute ut numeric
@attribute ag numeric
@attribute ' v' numeric
@attribute vi numeric
@attribute si numeric
@attribute lo numeric
@attribute ia numeric
@attribute ' h' numeric
@attribute pe numeric
@attribute 'e,' numeric
@attribute St numeric
@attribute ez numeric
@attribute ye numeric
@attribute kt numeric
@attribute ek numeric
@attribute ze numeric
@attribute  a numeric
@attribute hi numeric
@attribute e. numeric
@attribute ig numeric
@attribute gu numeric
@attribute bi numeric
@attribute a  numeric
@attribute ec numeric
@attribute sp numeric
@attribute 'k ' numeric
@attribute rd numeric
@attribute ik numeric
@attribute ni numeric
@attribute pr numeric
@attribute fe numeric
@attribute ie numeric
@attribute iv numeric
@attribute os numeric
@attribute us numeric
@attribute ol numeric
@attribute ис numeric
@attribute ла numeric
@attribute ск numeric
@attribute нс numeric
@attribute sh numeric
@attribute ' 2' numeric
@attribute dé numeric
@attribute ти numeric
@attribute ав numeric
@attribute 'z ' numeric
@attribute ил numeric
@attribute ик numeric
@attribute ал numeric
@attribute ас numeric
@attribute ес numeric
@attribute ер numeric
@attribute gt numeric
@attribute ва numeric
@attribute мо numeric
@attribute  и numeric
@attribute ' к' numeric
@attribute ол numeric
@attribute té numeric
@attribute от numeric
@attribute пр numeric
@attribute 'у ' numeric
@attribute ál numeric
@attribute gy numeric
@attribute 'й ' numeric
@attribute én numeric
@attribute za numeric
@attribute я  numeric
@attribute па numeric
@attribute ' о' numeric
@attribute ли numeric
@attribute кт numeric
@attribute ' р' numeric
@attribute ие numeric
@attribute за numeric
@attribute ok numeric
@attribute Be numeric
@attribute ' B' numeric
@attribute hu numeric
@attribute ul numeric
@attribute 'è ' numeric
@attribute ль numeric
@attribute bé numeric
@attribute je numeric
@attribute ék numeric
@attribute ké numeric
@attribute 'A ' numeric
@attribute language {Arabic,Bulgarian,Danish,English,French,German,Hungarian,Italian,Russian,Spanish}

@data
{10 1,44 1,96 1,151 1,159 1,161 1,162 1,163 1,221 1}
{159 1,161 1,162 1,163 1}
{159 1,161 1,162 1,163 1}
{159 1,161 1,162 1,163 1}
{159 1,161 1,162 1,163 1}
{21 1,22 1,34 1,35 1,36 1,37 1,38 1,39 1,40 1,71 1,72 1,73 1,74 1,75 1,76 1,77 1,78 1,99 1,100 1,101 1,102 1,109 1,110 1,111 1,112 1,113 1,114 1,115 1,116 1,117 1,119 1,120 1,121 1,122 1,124 1,135 1,160 1,179 1,180 1,183 1,185 1,186 1,187 1,190 1,196 1,197 1,198 1,199 1,200 1,201 1,202 1,203 1,205 1,207 1,208 1,209 1,210 1,250 1,251 1,252 1,254 1,256 1,257 1,260 1,261 1,262 1,264 1,266 1,267 1,268 1,269 1,270 1,272 1,273 1,274 1,280 1,281 1,282 1,285 1,300 Bulgarian}
{21 1,22 1,34 1,35 1,36 1,37 1,38 1,39 1,40 1,71 1,72 1,73 1,74 1,75 1,76 1,99 1,100 1,101 1,102 1,109 1,110 1,111 1,113 1,114 1,115 1,116 1,117 1,118 1,119 1,120 1,121 1,122 1,123 1,124 1,160 1,172 1,183 1,185 1,193 1,195 1,196 1,197 1,198 1,199 1,200 1,201 1,202 1,203 1,204 1,205 1,207 1,208 1,209 1,210 1,249 1,250 1,251 1,252 1,256 1,257 1,259 1,262 1,263 1,264 1,266 1,267 1,268 1,269 1,270 1,272 1,280 1,281 1,282 1,284 1,285 1,287 1,300 Bulgarian}
{21 1,22 1,34 1,38 1,39 1,40 1,71 1,72 1,73 1,74 1,77 1,78 1,99 1,100 1,101 1,102 1,111 1,112 1,115 1,160 1,180 1,186 1,187 1,190 1,202 1,205 1,207 1,208 1,209 1,210 1,249 1,250 1,251 1,252 1,254 1,259 1,261 1,270 1,300 Bulgarian}
{21 1,22 1,35 1,36 1,37 1,38 1,39 1,40 1,71 1,72 1,73 1,74 1,75 1,76 1,77 1,78 1,99 1,100 1,101 1,102 1,107 1,109 1,110 1,113 1,114 1,116 1,117 1,118 1,119 1,120 1,122 1,123 1,124 1,160 1,174 1,175 1,177 1,178 1,179 1,180 1,186 1,190 1,193 1,195 1,197 1,199 1,201 1,203 1,204 1,207 1,208 1,209 1,210 1,249 1,254 1,256 1,257 1,259 1,260 1,261 1,262 1,263 1,266 1,267 1,268 1,269 1,272 1,273 1,281 1,282 1,283 1,284 1,286 1,300 Bulgarian}
{21 1,22 1,34 1,35 1,36 1,37 1,38 1,39 1,40 1,59 1,71 1,72 1,73 1,74 1,75 1,76 1,77 1,78 1,99 1,100 1,101 1,102 1,107 1,109 1,110 1,111 1,112 1,113 1,114 1,115 1,116 1,117 1,118 1,119 1,120 1,121 1,122 1,123 1,124 1,137 1,150 1,160 1,172 1,174 1,175 1,177 1,178 1,179 1,183 1,185 1,186 1,187 1,190 1,193 1,195 1,196 1,197 1,198 1,199 1,200 1,201 1,202 1,203 1,204 1,205 1,207 1,208 1,209 1,210 1,249 1,250 1,251 1,252 1,256 1,257 1,259 1,261 1,263 1,264 1,266 1,272 1,273 1,274 1,277 1,280 1,282 1,283 1,284 1,285 1,286 1,287 1,300 Bulgarian}
{0 1,1 1,3 1,4 1,6 1,7 1,8 1,10 1,11 1,13 1,14 1,16 1,17 1,18 1,19 1,20 1,23 1,25 1,26 1,27 1,28 1,29 1,30 1,31 1,32 1,33 1,45 1,46 1,48 1,49 1,50 1,51 1,52 1,53 1,55 1,56 1,57 1,58 1,59 1,61 1,62 1,63 1,64 1,65 1,66 1,67 1,68 1,69 1,80 1,81 1,82 1,83 1,84 1,85 1,86 1,88 1,89 1,90 1,91 1,92 1,93 1,97 1,125 1,126 1,127 1,129 1,130 1,131 1,132 1,133 1,135 1,137 1,138 1,140 1,143 1,145 1,147 1,148 1,149 1,153 1,155 1,158 1,171 1,181 1,188 1,189 1,191 1,211 1,212 1,215 1,216 1,217 1,220 1,223 1,226 1,227 1,232 1,238 1,240 1,241 1,243 1,245 1,246 1,247 1,248 1,292 1,300 Danish}
{0 1,1 1,2 1,3 1,4 1,6 1,7 1,8 1,10 1,11 1,12 1,13 1,14 1,16 1,17 1,18 1,19 1,20 1,23 1,24 1,25 1,26 1,28 1,29 1,30 1,31 1,32 1,33 1,43 1,45 1,46 1,48 1,49 1,50 1,51 1,52 1,53 1,54 1,55 1,56 1,57 1,58 1,59 1,61 1,62 1,63 1,64 1,65 1,66 1,67 1,68 1,69 1,80 1,81 1,82 1,83 1,84 1,85 1,86 1,87 1,88 1,89 1,90 1,91 1,92 1,93 1,96 1,97 1,98 1,125 1,127 1,130 1,131 1,133 1,135 1,137 1,140 1,147 1,149 1,150 1,152 1,154 1,155 1,158 1,171 1,181 1,188 1,189 1,191 1,192 1,211 1,214 1,220 1,225 1,229 1,230 1,232 1,235 1,238 1,239 1,240 1,241 1,243 1,244 1,246 1,247 1,248 1,253 1,254 1,265 1,300 Danish}
{0 1,1 1,3 1,4 1,7 1,8 1,10 1,13 1,14 1,16 1,17 1,18 1,19 1,23 1,24 1,25 1,26 1,28 1,30 1,31 1,32 1,33 1,45 1,46 1,48 1,49 1,50 1,51 1,52 1,53 1,55 1,56 1,57 1,59 1,61 1,62 1,63 1,64 1,65 1,66 1,67 1,68 1,69 1,80 1,81 1,82 1,83 1,84 1,85 1,86 1,88 1,89 1,90 1,91 1,93 1,97 1,125 1,128 1,130 1,131 1,132 1,133 1,135 1,137 1,147 1,148 1,150 1,152 1,153 1,154 1,155 1,168 1,169 1,171 1,188 1,191 1,192 1,194 1,211 1,214 1,215 1,216 1,217 1,218 1,225 1,226 1,227 1,229 1,232 1,239 1,240 1,241 1,242 1,243 1,248 1,288 1,292 1,300 Danish}
{0 1,1 1,2 1,3 1,4 1,6 1,7 1,8 1,10 1,11 1,12 1,13 1,14 1,16 1,17 1,18 1,19 1,20 1,23 1,25 1,26 1,28 1,29 1,30 1,31 1,32 1,33 1,45 1,46 1,48 1,49 1,50 1,51 1,52 1,53 1,54 1,55 1,56 1,57 1,58 1,59 1,61 1,62 1,63 1,64 1,65 1,66 1,67 1,69 1,80 1,81 1,82 1,83 1,84 1,85 1,86 1,87 1,88 1,89 1,90 1,91 1,92 1,93 1,94 1,97 1,125 1,126 1,128 1,129 1,131 1,132 1,133 1,135 1,136 1,137 1,139 1,140 1,144 1,147 1,148 1,149 1,150 1,152 1,153 1,158 1,168 1,171 1,181 1,188 1,189 1,191 1,192 1,194 1,211 1,214 1,215 1,216 1,217 1,219 1,220 1,221 1,223 1,226 1,227 1,229 1,232 1,237 1,239 1,245 1,254 1,265 1,300 Danish}
{0 1,1 1,4 1,7 1,8 1,10 1,11 1,12 1,13 1,14 1,15 1,16 1,18 1,19 1,20 1,25 1,26 1,29 1,30 1,33 1,46 1,48 1,50 1,51 1,53 1,56 1,57 1,58 1,61 1,63 1,64 1,65 1,66 1,67 1,70 1,81 1,82 1,85 1,86 1,88 1,89 1,90 1,93 1,97 1,133 1,135 1,137 1,148 1,153 1,171 1,181 1,189 1,194 1,215 1,222 1,226 1,232 1,239 1,240 1,241 1,265 1,300 Danish}
{0 1,1 1,2 1,3 1,4 1,5 1,6 1,7 1,8 1,9 1,10 1,11 1,13 1,14 1,15 1,16 1,17 1,18 1,19 1,20 1,24 1,26 1,27 1,28 1,29 1,30 1,31 1,32 1,33 1,41 1,42 1,44 1,45 1,46 1,49 1,50 1,51 1,54 1,55 1,56 1,57 1,58 1,59 1,60 1,61 1,63 1,64 1,65 1,66 1,67 1,68 1,69 1,70 1,79 1,83 1,84 1,85 1,86 1,87 1,88 1,89 1,90 1,91 1,93 1,94 1,96 1,97 1,98 1,105 1,108 1,125 1,126 1,129 1,130 1,131 1,132 1,133 1,135 1,136 1,137 1,138 1,139 1,140 1,143 1,144 1,147 1,148 1,149 1,151 1,153 1,154 1,155 1,168 1,170 1,192 1,211 1,212 1,213 1,215 1,216 1,219 1,220 1,221 1,222 1,229 1,230 1,234 1,236 1,238 1,241 1,242 1,243 1,244 1,245 1,246 1,247 1,248 1,253 1,289 1,290 1,292 1,300 English}
{0 1,1 1,2 1,3 1,4 1,5 1,6 1,7 1,8 1,9 1,10 1,11 1,13 1,14 1,15 1,16 1,17 1,18 1,19 1,20 1,24 1,25 1,26 1,27 1,29 1,30 1,31 1,32 1,33 1,41 1,42 1,43 1,44 1,45 1,46 1,47 1,48 1,49 1,50 1,51 1,52 1,53 1,54 1,55 1,56 1,57 1,58 1,59 1,60 1,61 1,62 1,63 1,64 1,65 1,66 1,67 1,69 1,70 1,79 1,82 1,83 1,84 1,85 1,86 1,87 1,88 1,89 1,90 1,91 1,92 1,93 1,94 1,96 1,97 1,98 1,105 1,108 1,125 1,126 1,128 1,130 1,131 1,132 1,133 1,134 1,135 1,136 1,137 1,138 1,139 1,140 1,144 1,145 1,147 1,148 1,149 1,150 1,151 1,152 1,154 1,155 1,156 1,157 1,170 1,181 1,189 1,192 1,211 1,212 1,213 1,214 1,215 1,216 1,217 1,218 1,219 1,220 1,221 1,222 1,229 1,230 1,232 1,234 1,236 1,237 1,239 1,241 1,242 1,243 1,244 1,246 1,247 1,248 1,253 1,276 1,292 1,300 English}
{0 1,1 1,3 1,4 1,5 1,6 1,7 1,8 1,9 1,10 1,11 1,13 1,14 1,15 1,16 1,17 1,18 1,20 1,24 1,26 1,29 1,30 1,31 1,32 1,33 1,41 1,42 1,44 1,45 1,46 1,47 1,48 1,49 1,50 1,51 1,52 1,53 1,54 1,55 1,56 1,57 1,58 1,59 1,60 1,61 1,63 1,64 1,65 1,66 1,67 1,68 1,69 1,79 1,80 1,82 1,83 1,84 1,85 1,86 1,87 1,88 1,89 1,90 1,91 1,93 1,94 1,95 1,96 1,97 1,98 1,125 1,126 1,130 1,131 1,134 1,135 1,136 1,137 1,138 1,139 1,145 1,147 1,148 1,149 1,151 1,153 1,154 1,155 1,156 1,170 1,181 1,189 1,192 1,211 1,212 1,214 1,216 1,220 1,221 1,222 1,227 1,230 1,236 1,237 1,242 1,243 1,244 1,245 1,246 1,247 1,253 1,300 English}
{0 1,1 1,2 1,3 1,6 1,7 1,8 1,9 1,10 1,11 1,13 1,17 1,18 1,19 1,24 1,26 1,27 1,28 1,29 1,30 1,31 1,32 1,33 1,41 1,42 1,44 1,45 1,46 1,49 1,50 1,51 1,53 1,55 1,56 1,57 1,59 1,61 1,63 1,64 1,65 1,66 1,68 1,70 1,82 1,85 1,86 1,87 1,88 1,90 1,91 1,94 1,96 1,97 1,98 1,105 1,108 1,125 1,126 1,136 1,139 1,144 1,149 1,150 1,151 1,152 1,156 1,212 1,214 1,217 1,218 1,219 1,221 1,229 1,231 1,233 1,234 1,236 1,237 1,239 1,247 1,253 1,300 English}
{0 1,1 1,2 1,4 1,5 1,6 1,7 1,8 1,9 1,10 1,11 1,13 1,15 1,16 1,17 1,20 1,24 1,26 1,28 1,29 1,31 1,32 1,33 1,45 1,46 1,47 1,48 1,50 1,51 1,52 1,55 1,56 1,57 1,58 1,59 1,62 1,63 1,64 1,65 1,66 1,67 1,70 1,79 1,82 1,86 1,88 1,89 1,93 1,105 1,128 1,129 1,131 1,132 1,137 1,147 1,150 1,153 1,154 1,155 1,157 1,212 1,218 1,228 1,231 1,240 1,246 1,247 1,292 1,300 English}
{0 1,1 1,2 1,3 1,4 1,5 1,8 1,9 1,10 1,12 1,14 1,15 1,17 1,18 1,19 1,20 1,24 1,29 1,30 1,31 1,32 1,33 1,42 1,43 1,44 1,46 1,48 1,49 1,50 1,51 1,52 1,56 1,57 1,58 1,59 1,60 1,63 1,64 1,65 1,66 1,67 1,68 1,69 1,79 1,88 1,89 1,90 1,91 1,94 1,95 1,104 1,126 1,127 1,128 1,130 1,131 1,134 1,141 1,144 1,145 1,147 1,149 1,155 1,156 1,157 1,167 1,169 1,170 1,184 1,211 1,217 1,219 1,221 1,222 1,231 1,232 1,233 1,237 1,247 1,248 1,255 1,271 1,300 French}
{0 1,1 1,2 1,3 1,4 1,5 1,7 1,8 1,9 1,10 1,11 1,12 1,13 1,14 1,15 1,16 1,17 1,18 1,19 1,20 1,24 1,25 1,29 1,30 1,31 1,32 1,33 1,42 1,43 1,44 1,45 1,46 1,47 1,48 1,49 1,50 1,52 1,53 1,54 1,55 1,56 1,57 1,58 1,59 1,60 1,61 1,62 1,64 1,65 1,67 1,68 1,69 1,79 1,80 1,87 1,89 1,90 1,91 1,92 1,94 1,95 1,97 1,104 1,125 1,126 1,127 1,130 1,131 1,134 1,138 1,141 1,143 1,144 1,145 1,147 1,149 1,150 1,151 1,152 1,156 1,158 1,167 1,169 1,170 1,173 1,184 1,214 1,215 1,216 1,221 1,222 1,231 1,236 1,242 1,244 1,246 1,248 1,255 1,300 French}
{0 1,1 1,2 1,3 1,4 1,5 1,10 1,13 1,14 1,17 1,18 1,19 1,20 1,24 1,28 1,29 1,30 1,42 1,43 1,45 1,48 1,49 1,52 1,54 1,59 1,61 1,62 1,65 1,66 1,68 1,86 1,87 1,89 1,92 1,95 1,103 1,128 1,134 1,137 1,138 1,145 1,157 1,167 1,169 1,211 1,213 1,220 1,232 1,233 1,237 1,242 1,243 1,255 1,292 1,300 French}
{0 1,1 1,2 1,3 1,4 1,5 1,8 1,9 1,10 1,12 1,13 1,14 1,15 1,16 1,17 1,18 1,20 1,24 1,25 1,29 1,30 1,31 1,32 1,33 1,42 1,43 1,44 1,45 1,46 1,48 1,49 1,50 1,52 1,53 1,54 1,55 1,57 1,58 1,59 1,60 1,61 1,62 1,63 1,64 1,65 1,66 1,67 1,68 1,69 1,70 1,79 1,80 1,86 1,87 1,88 1,89 1,90 1,91 1,92 1,94 1,103 1,104 1,125 1,126 1,127 1,128 1,130 1,131 1,134 1,137 1,138 1,140 1,143 1,144 1,145 1,147 1,148 1,149 1,150 1,152 1,154 1,155 1,157 1,167 1,168 1,169 1,170 1,171 1,184 1,211 1,213 1,215 1,217 1,218 1,220 1,221 1,231 1,237 1,241 1,243 1,244 1,246 1,247 1,248 1,271 1,291 1,300 French}
{0 1,1 1,2 1,3 1,4 1,5 1,8 1,9 1,10 1,11 1,13 1,14 1,15 1,16 1,17 1,18 1,19 1,24 1,29 1,30 1,31 1,32 1,33 1,42 1,43 1,44 1,45 1,48 1,49 1,50 1,52 1,54 1,55 1,57 1,60 1,61 1,62 1,63 1,64 1,65 1,66 1,68 1,69 1,70 1,79 1,84 1,85 1,86 1,87 1,88 1,90 1,91 1,92 1,95 1,103 1,104 1,127 1,128 1,131 1,137 1,141 1,143 1,145 1,147 1,148 1,149 1,150 1,151 1,152 1,154 1,167 1,171 1,173 1,184 1,213 1,214 1,216 1,218 1,222 1,235 1,238 1,239 1,240 1,246 1,248 1,292 1,300 French}
{0 1,1 1,4 1,7 1,10 1,11 1,13 1,14 1,16 1,17 1,18 1,20 1,23 1,25 1,26 1,28 1,29 1,30 1,31 1,33 1,41 1,45 1,46 1,47 1,48 1,49 1,50 1,51 1,52 1,57 1,58 1,59 1,61 1,62 1,63 1,64 1,65 1,66 1,67 1,68 1,69 1,81 1,82 1,83 1,84 1,85 1,86 1,88 1,89 1,93 1,103 1,104 1,108 1,126 1,129 1,130 1,132 1,137 1,138 1,148 1,152 1,153 1,156 1,158 1,211 1,212 1,213 1,215 1,220 1,222 1,223 1,230 1,232 1,233 1,241 1,243 1,244 1,245 1,247 1,289 1,290 1,291 1,300 German}
{0 1,1 1,4 1,7 1,10 1,11 1,14 1,16 1,17 1,18 1,20 1,23 1,25 1,26 1,28 1,29 1,30 1,31 1,33 1,41 1,45 1,46 1,47 1,48 1,49 1,50 1,51 1,52 1,53 1,56 1,57 1,58 1,59 1,61 1,62 1,63 1,64 1,65 1,66 1,67 1,68 1,69 1,70 1,81 1,83 1,84 1,85 1,86 1,88 1,89 1,90 1,91 1,103 1,105 1,108 1,128 1,129 1,130 1,131 1,132 1,135 1,142 1,145 1,147 1,149 1,151 1,157 1,158 1,213 1,214 1,215 1,219 1,220 1,221 1,223 1,224 1,226 1,228 1,229 1,232 1,236 1,238 1,239 1,240 1,242 1,243 1,244 1,247 1,248 1,265 1,289 1,290 1,291 1,300 German}
{0 1,1 1,4 1,7 1,10 1,11 1,13 1,14 1,16 1,17 1,20 1,23 1,25 1,26 1,28 1,29 1,30 1,31 1,33 1,41 1,45 1,46 1,47 1,48 1,49 1,51 1,52 1,54 1,56 1,57 1,58 1,59 1,61 1,62 1,63 1,64 1,66 1,67 1,68 1,69 1,70 1,81 1,82 1,84 1,85 1,88 1,89 1,90 1,91 1,93 1,103 1,105 1,108 1,125 1,126 1,127 1,128 1,129 1,130 1,131 1,135 1,138 1,145 1,147 1,148 1,149 1,151 1,152 1,153 1,157 1,158 1,212 1,213 1,215 1,223 1,228 1,229 1,230 1,231 1,232 1,237 1,239 1,242 1,244 1,245 1,247 1,248 1,258 1,289 1,291 1,300 German}
{0 1,4 1,5 1,7 1,10 1,11 1,13 1,14 1,16 1,17 1,18 1,20 1,23 1,25 1,28 1,29 1,30 1,31 1,33 1,41 1,45 1,46 1,47 1,48 1,51 1,52 1,54 1,56 1,58 1,59 1,61 1,65 1,66 1,68 1,69 1,70 1,83 1,84 1,87 1,103 1,104 1,126 1,128 1,130 1,131 1,145 1,157 1,213 1,215 1,217 1,220 1,230 1,234 1,238 1,240 1,243 1,244 1,247 1,290 1,300 German}
{0 1,4 1,7 1,10 1,11 1,13 1,14 1,16 1,18 1,20 1,28 1,29 1,30 1,31 1,33 1,41 1,45 1,46 1,47 1,48 1,49 1,50 1,51 1,53 1,55 1,56 1,57 1,58 1,59 1,61 1,62 1,63 1,65 1,67 1,68 1,69 1,70 1,81 1,83 1,84 1,85 1,104 1,105 1,108 1,126 1,129 1,131 1,136 1,138 1,142 1,145 1,147 1,148 1,156 1,157 1,158 1,211 1,215 1,217 1,218 1,222 1,224 1,226 1,230 1,239 1,242 1,243 1,244 1,246 1,247 1,265 1,289 1,290 1,291 1,300 German}
{1 1,2 1,4 1,7 1,10 1,12 1,13 1,14 1,16 1,17 1,18 1,19 1,23 1,24 1,25 1,26 1,27 1,28 1,29 1,31 1,32 1,33 1,45 1,46 1,48 1,49 1,50 1,53 1,54 1,55 1,56 1,57 1,59 1,61 1,62 1,63 1,64 1,65 1,66 1,67 1,69 1,80 1,82 1,83 1,84 1,86 1,87 1,90 1,91 1,98 1,106 1,125 1,126 1,127 1,129 1,130 1,131 1,133 1,139 1,140 1,141 1,145 1,146 1,148 1,149 1,150 1,153 1,154 1,164 1,165 1,166 1,171 1,173 1,182 1,188 1,194 1,211 1,212 1,214 1,215 1,216 1,220 1,224 1,225 1,227 1,228 1,234 1,235 1,238 1,240 1,241 1,243 1,247 1,248 1,255 1,258 1,271 1,275 1,276 1,278 1,279 1,288 1,292 1,295 1,296 1,297 1,298 1,299 1,300 Hungarian}
{0 1,1 1,2 1,3 1,4 1,5 1,6 1,7 1,10 1,12 1,13 1,14 1,16 1,17 1,18 1,19 1,20 1,23 1,24 1,25 1,27 1,28 1,29 1,30 1,31 1,32 1,33 1,42 1,45 1,46 1,48 1,49 1,50 1,52 1,53 1,54 1,55 1,56 1,57 1,58 1,59 1,61 1,62 1,63 1,64 1,65 1,66 1,67 1,69 1,80 1,81 1,83 1,84 1,85 1,86 1,87 1,89 1,90 1,91 1,92 1,97 1,98 1,106 1,125 1,126 1,127 1,128 1,129 1,130 1,131 1,132 1,133 1,134 1,135 1,139 1,141 1,142 1,144 1,146 1,147 1,148 1,149 1,150 1,152 1,153 1,154 1,155 1,158 1,164 1,165 1,166 1,169 1,170 1,173 1,182 1,188 1,191 1,194 1,212 1,213 1,214 1,215 1,216 1,217 1,220 1,222 1,223 1,224 1,225 1,227 1,228 1,232 1,234 1,238 1,240 1,242 1,243 1,246 1,247 1,248 1,255 1,258 1,271 1,275 1,276 1,278 1,279 1,288 1,295 1,296 1,297 1,298 1,299 1,300 Hungarian}
{1 1,2 1,4 1,7 1,10 1,12 1,13 1,14 1,16 1,17 1,18 1,23 1,25 1,31 1,48 1,49 1,50 1,53 1,54 1,56 1,59 1,62 1,66 1,67 1,68 1,69 1,81 1,83 1,84 1,85 1,88 1,91 1,98 1,106 1,132 1,133 1,138 1,139 1,141 1,146 1,148 1,164 1,165 1,166 1,173 1,214 1,215 1,220 1,224 1,225 1,227 1,228 1,238 1,240 1,258 1,271 1,276 1,278 1,288 1,292 1,295 1,296 1,297 1,298 1,300 Hungarian}
{1 1,2 1,4 1,10 1,12 1,13 1,16 1,18 1,19 1,20 1,23 1,25 1,26 1,27 1,28 1,29 1,30 1,31 1,32 1,33 1,42 1,45 1,49 1,50 1,53 1,54 1,63 1,66 1,67 1,68 1,69 1,80 1,83 1,84 1,85 1,86 1,87 1,89 1,90 1,91 1,92 1,98 1,125 1,129 1,130 1,132 1,138 1,141 1,143 1,148 1,153 1,154 1,164 1,165 1,166 1,171 1,182 1,191 1,194 1,206 1,215 1,216 1,225 1,228 1,234 1,238 1,244 1,245 1,248 1,275 1,276 1,295 1,296 1,297 1,298 1,299 1,300 Hungarian}
{0 1,1 1,2 1,4 1,7 1,8 1,12 1,14 1,16 1,17 1,19 1,20 1,25 1,27 1,28 1,29 1,30 1,31 1,32 1,33 1,42 1,46 1,48 1,50 1,54 1,59 1,63 1,64 1,65 1,67 1,68 1,69 1,90 1,91 1,92 1,125 1,129 1,130 1,131 1,135 1,138 1,142 1,143 1,147 1,153 1,155 1,158 1,164 1,165 1,166 1,173 1,182 1,219 1,223 1,224 1,226 1,228 1,235 1,238 1,241 1,243 1,245 1,246 1,258 1,275 1,278 1,288 1,299 1,300 Hungarian}
{0 1,2 1,3 1,4 1,5 1,6 1,7 1,8 1,9 1,10 1,12 1,14 1,15 1,16 1,17 1,18 1,20 1,24 1,25 1,27 1,29 1,32 1,33 1,42 1,43 1,44 1,45 1,46 1,47 1,48 1,49 1,50 1,51 1,52 1,53 1,54 1,55 1,56 1,57 1,58 1,59 1,60 1,61 1,62 1,63 1,64 1,65 1,66 1,67 1,68 1,69 1,70 1,80 1,87 1,88 1,89 1,90 1,96 1,106 1,126 1,127 1,128 1,129 1,130 1,132 1,136 1,138 1,140 1,142 1,144 1,146 1,147 1,148 1,149 1,151 1,152 1,155 1,171 1,206 1,216 1,217 1,219 1,221 1,222 1,235 1,241 1,242 1,245 1,248 1,279 1,293 1,300 Italian}
{0 1,2 1,3 1,4 1,5 1,6 1,7 1,8 1,9 1,10 1,12 1,14 1,15 1,16 1,17 1,18 1,19 1,20 1,24 1,25 1,27 1,29 1,30 1,31 1,32 1,33 1,42 1,43 1,44 1,45 1,46 1,47 1,48 1,49 1,50 1,52 1,53 1,54 1,55 1,56 1,57 1,58 1,59 1,60 1,61 1,62 1,63 1,64 1,65 1,66 1,67 1,68 1,69 1,70 1,80 1,83 1,84 1,85 1,86 1,87 1,88 1,89 1,90 1,91 1,92 1,93 1,94 1,95 1,96 1,106 1,125 1,126 1,127 1,128 1,130 1,131 1,132 1,133 1,134 1,136 1,137 1,138 1,140 1,142 1,143 1,144 1,145 1,146 1,147 1,148 1,149 1,150 1,151 1,152 1,153 1,154 1,155 1,156 1,168 1,169 1,170 1,176 1,184 1,206 1,211 1,213 1,215 1,217 1,218 1,219 1,221 1,222 1,224 1,228 1,230 1,231 1,232 1,233 1,234 1,235 1,236 1,237 1,241 1,242 1,244 1,245 1,246 1,247 1,248 1,279 1,292 1,293 1,300 Italian}
{0 1,2 1,3 1,4 1,5 1,6 1,8 1,9 1,10 1,12 1,14 1,15 1,16 1,17 1,18 1,19 1,20 1,24 1,25 1,27 1,29 1,30 1,31 1,32 1,43 1,44 1,45 1,46 1,47 1,48 1,49 1,50 1,51 1,52 1,53 1,54 1,55 1,56 1,57 1,58 1,59 1,62 1,63 1,64 1,65 1,66 1,67 1,68 1,69 1,70 1,80 1,81 1,85 1,86 1,87 1,89 1,91 1,92 1,94 1,95 1,96 1,97 1,125 1,126 1,127 1,128 1,130 1,131 1,133 1,134 1,136 1,137 1,138 1,140 1,142 1,143 1,147 1,148 1,149 1,150 1,151 1,152 1,154 1,155 1,156 1,168 1,169 1,170 1,176 1,206 1,211 1,213 1,215 1,216 1,217 1,218 1,219 1,221 1,222 1,231 1,233 1,234 1,236 1,237 1,241 1,242 1,244 1,245 1,246 1,248 1,293 1,300 Italian}
{0 1,2 1,3 1,4 1,5 1,6 1,7 1,8 1,9 1,10 1,12 1,14 1,15 1,16 1,17 1,18 1,19 1,20 1,24 1,25 1,29 1,30 1,31 1,32 1,33 1,43 1,44 1,45 1,46 1,47 1,48 1,49 1,50 1,53 1,54 1,55 1,56 1,57 1,58 1,59 1,60 1,62 1,63 1,64 1,67 1,68 1,69 1,70 1,80 1,86 1,87 1,88 1,89 1,90 1,91 1,92 1,94 1,95 1,96 1,106 1,125 1,126 1,127 1,128 1,129 1,131 1,134 1,136 1,138 1,140 1,143 1,144 1,145 1,148 1,149 1,150 1,151 1,152 1,153 1,154 1,156 1,169 1,170 1,171 1,176 1,184 1,206 1,211 1,215 1,216 1,217 1,218 1,219 1,221 1,222 1,231 1,233 1,234 1,235 1,236 1,237 1,239 1,241 1,242 1,243 1,245 1,248 1,293 1,300 Italian}
{0 1,2 1,3 1,4 1,5 1,6 1,8 1,9 1,10 1,12 1,13 1,14 1,15 1,16 1,17 1,18 1,19 1,20 1,24 1,25 1,27 1,29 1,30 1,33 1,43 1,44 1,45 1,46 1,48 1,49 1,50 1,52 1,53 1,54 1,56 1,59 1,62 1,63 1,64 1,65 1,66 1,67 1,68 1,69 1,70 1,80 1,85 1,86 1,87 1,88 1,89 1,90 1,91 1,92 1,95 1,96 1,97 1,106 1,125 1,126 1,127 1,128 1,129 1,130 1,131 1,132 1,134 1,136 1,137 1,138 1,140 1,142 1,143 1,144 1,146 1,148 1,150 1,151 1,152 1,154 1,155 1,168 1,170 1,206 1,211 1,217 1,222 1,233 1,235 1,242 1,248 1,279 1,292 1,300 Italian}
{21 1,22 1,34 1,35 1,36 1,37 1,72 1,76 1,77 1,78 1,107 1,110 1,112 1,113 1,114 1,121 1,122 1,124 1,172 1,174 1,175 1,178 1,195 1,196 1,198 1,200 1,204 1,249 1,250 1,251 1,256 1,260 1,262 1,274 1,277 1,283 1,294 1,300 Russian}
{21 1,22 1,34 1,35 1,36 1,37 1,38 1,39 1,40 1,71 1,72 1,73 1,74 1,75 1,76 1,77 1,78 1,99 1,100 1,101 1,102 1,107 1,109 1,110 1,111 1,112 1,113 1,114 1,115 1,116 1,117 1,118 1,119 1,120 1,121 1,122 1,123 1,124 1,172 1,174 1,175 1,177 1,178 1,179 1,180 1,183 1,185 1,186 1,187 1,193 1,195 1,196 1,197 1,198 1,199 1,200 1,201 1,202 1,204 1,205 1,207 1,208 1,209 1,257 1,259 1,260 1,261 1,262 1,263 1,264 1,266 1,267 1,268 1,269 1,270 1,272 1,273 1,274 1,277 1,281 1,282 1,283 1,284 1,285 1,286 1,287 1,294 1,300 Russian}
{21 1,22 1,34 1,35 1,36 1,37 1,38 1,39 1,40 1,71 1,75 1,76 1,99 1,107 1,109 1,111 1,113 1,115 1,116 1,117 1,118 1,119 1,120 1,122 1,123 1,172 1,177 1,183 1,185 1,187 1,200 1,203 1,263 1,273 1,274 1,277 1,280 1,283 1,287 1,300 Russian}
{21 1,22 1,34 1,35 1,36 1,37 1,38 1,39 1,40 1,72 1,73 1,74 1,75 1,76 1,77 1,78 1,100 1,101 1,102 1,107 1,110 1,111 1,112 1,114 1,115 1,116 1,117 1,118 1,119 1,120 1,121 1,123 1,124 1,172 1,174 1,175 1,177 1,178 1,179 1,180 1,183 1,186 1,187 1,190 1,193 1,195 1,196 1,197 1,199 1,201 1,202 1,203 1,205 1,252 1,260 1,264 1,268 1,270 1,281 1,284 1,285 1,286 1,287 1,294 1,300 Russian}
{21 1,22 1,34 1,35 1,36 1,37 1,38 1,39 1,40 1,71 1,73 1,74 1,75 1,77 1,78 1,107 1,109 1,112 1,118 1,121 1,123 1,174 1,175 1,177 1,178 1,179 1,180 1,185 1,190 1,193 1,198 1,204 1,210 1,267 1,269 1,277 1,280 1,286 1,294 1,300 Russian}
{0 1,2 1,3 1,4 1,5 1,6 1,8 1,10 1,13 1,14 1,16 1,17 1,18 1,19 1,24 1,27 1,29 1,30 1,31 1,32 1,33 1,43 1,48 1,49 1,50 1,51 1,53 1,54 1,55 1,56 1,57 1,58 1,59 1,60 1,62 1,63 1,64 1,65 1,66 1,67 1,68 1,69 1,85 1,87 1,88 1,89 1,91 1,92 1,94 1,98 1,125 1,126 1,127 1,129 1,130 1,131 1,134 1,136 1,144 1,146 1,147 1,148 1,149 1,157 1,168 1,169 1,170 1,171 1,176 1,211 1,216 1,217 1,219 1,221 1,233 1,234 1,235 1,241 1,244 1,245 1,246 1,247 1,248 1,278 1,300 Spanish}
{0 1,2 1,3 1,4 1,5 1,6 1,8 1,9 1,10 1,13 1,14 1,15 1,16 1,17 1,18 1,19 1,24 1,27 1,29 1,30 1,31 1,33 1,43 1,44 1,46 1,49 1,53 1,54 1,55 1,57 1,59 1,60 1,62 1,64 1,66 1,67 1,68 1,69 1,70 1,87 1,90 1,92 1,93 1,94 1,129 1,130 1,131 1,138 1,143 1,146 1,147 1,149 1,153 1,154 1,155 1,168 1,169 1,171 1,217 1,218 1,219 1,229 1,233 1,235 1,236 1,244 1,245 1,246 1,248 1,300 Spanish}
{0 1,2 1,3 1,4 1,5 1,6 1,8 1,10 1,13 1,14 1,15 1,16 1,17 1,18 1,19 1,24 1,25 1,27 1,29 1,30 1,31 1,32 1,33 1,43 1,45 1,46 1,48 1,53 1,54 1,55 1,58 1,59 1,61 1,62 1,64 1,66 1,68 1,88 1,89 1,90 1,91 1,96 1,125 1,126 1,127 1,130 1,137 1,140 1,143 1,148 1,149 1,153 1,154 1,155 1,168 1,176 1,212 1,215 1,216 1,217 1,218 1,220 1,242 1,245 1,246 1,300 Spanish}
{0 1,1 1,2 1,3 1,4 1,5 1,6 1,10 1,13 1,14 1,15 1,16 1,17 1,18 1,19 1,27 1,30 1,31 1,32 1,49 1,50 1,52 1,53 1,54 1,55 1,58 1,62 1,63 1,65 1,68 1,69 1,70 1,84 1,87 1,94 1,98 1,126 1,129 1,130 1,133 1,137 1,140 1,143 1,144 1,147 1,151 1,168 1,182 1,212 1,215 1,217 1,218 1,219 1,225 1,233 1,241 1,246 1,300 Spanish}
{0 1,2 1,3 1,4 1,5 1,6 1,10 1,13 1,14 1,15 1,16 1,17 1,18 1,19 1,24 1,27 1,30 1,31 1,33 1,45 1,48 1,49 1,50 1,51 1,53 1,54 1,55 1,56 1,58 1,59 1,60 1,62 1,63 1,64 1,65 1,67 1,68 1,70 1,83 1,86 1,87 1,90 1,91 1,92 1,93 1,96 1,125 1,126 1,127 1,129 1,130 1,131 1,134 1,140 1,141 1,143 1,144 1,147 1,148 1,149 1,151 1,153 1,154 1,155 1,168 1,169 1,176 1,182 1,216 1,217 1,218 1,219 1,222 1,235 1,236 1,241 1,242 1,243 1,244 1,245 1,246 1,247 1,275 1,300 Spanish}
