Place,Name,Sex,BirthDate,Age,State,Equipment,Division,BodyweightKg,WeightClassKg,Squat1Kg,Squat2Kg,Squat3Kg,Squat4Kg,Best3SquatKg,Bench1Kg,Bench2Kg,Bench3Kg,Bench4Kg,Best3BenchKg,Deadlift1Kg,Deadlift2Kg,Deadlift3Kg,Deadlift4Kg,Best3DeadliftKg,TotalKg,Event
1,April Chong,F,1981-03-02,40,TX,Raw,DT Novice,118.2,110+,125,135,145,,145,-62.5,62.5,-70,,62.5,137.5,160,-175,,160,367.5,SBD
1,Regina Sowell,F,1984-04-26,37,,Raw,DT Open,58.7,60,110,120,122.5,,122.5,65,75,-77.5,,75,127.5,137.5,-142.5,,137.5,335,SBD
2,Karla Fuentes,F,1999-08-20,22,,Raw,DT Open,57.4,60,82.5,90,97.5,,97.5,55,62.5,65,,65,130,140,147.5,152.5,147.5,310,SBD
1,Tara Herod,F,2005-09-07,15,,Raw,DT Open,64.9,67.5,52.5,62.5,-72.5,,62.5,32.5,37.5,-45,,37.5,72.5,82.5,92.5,,92.5,192.5,SBD
1,Sami Lockwood,F,1990-10-10,30,TX,Raw,DT Open,71.6,75,102.5,-105,-105,,102.5,62.5,67.5,-70,,67.5,112.5,117.5,122.5,137.5,122.5,292.5,SBD
1,Regina Sowell,F,1984-04-26,37,,Raw,DT Sub Master,58.7,60,110,120,122.5,,122.5,65,75,-77.5,,75,127.5,137.5,-142.5,,137.5,335,SBD
1,Yessenia Ramirez,F,1985-04-30,36,,Raw,DT Sub Master,71.6,75,87.5,-97.5,-97.5,,87.5,42.5,-47.5,-47.5,,42.5,102.5,115,122.5,127.5,122.5,252.5,SBD
2,Gloria Leija,F,1983-03-21,38,,Raw,DT Sub Master,73.4,75,-77.5,80,85,,85,50,-52.5,-55,,50,92.5,102.5,107.5,110,107.5,242.5,SBD
1,Grace Dailey,F,2006-05-23,15,,Raw,DT Teen,58.8,60,82.5,92.5,97.5,,97.5,40,42.5,45,,45,92.5,102.5,-110,,102.5,245,SBD
1,Tara Herod,F,2005-09-07,15,,Raw,DT Teen,64.9,67.5,52.5,62.5,-72.5,,62.5,32.5,37.5,-45,,37.5,72.5,82.5,92.5,,92.5,192.5,SBD
DQ,Caylee Bull,F,2005-08-11,16,LA,Raw,DT Teen,60.78,67.5,52.5,60,65,,65,25,30,32.5,,32.5,-52.5,,,,,,SBD
1,Jodie Duncan,F,1974-11-19,46,TX,Raw,Master 1,72.6,75,120,-125,125,,125,67.5,-72.5,-72.5,,67.5,147.5,157.5,-162.5,,157.5,350,SBD
1,Jodie Duncan,F,1974-11-19,46,TX,Raw,Open,72.6,75,120,-125,125,,125,67.5,-72.5,-72.5,,67.5,147.5,157.5,-162.5,,157.5,350,SBD
1,Alex Mason,F,1988-01-22,33,,Raw,Open,89.3,90,152.5,170,172.5,,172.5,95,100,-107.5,,100,187.5,197.5,-200,,197.5,470,SBD
1,Stefanie Herod,F,1992-09-09,28,,Raw,Open,99.5,100,142.5,-155,165,,165,92.5,100,-107.5,,100,190,195,210,215,210,475,SBD
1,Barbie Brown,F,1981-03-08,40,TX,Wraps,DT Master 1,61.86,67.5,82.5,-95,-95,,82.5,45,47.5,-52.5,,47.5,117.5,127.5,132.5,,132.5,262.5,SBD
1,Matty Duncan,F,2004-02-01,17,,Wraps,DT Open,108.2,110,40,45,50,52.5,50,25,-30,-30,,25,55,60,-65,,60,135,SBD
1,Brittany Sparks,F,1989-01-18,32,,Wraps,DT Open,104.9,110,112.5,120,127.5,,127.5,55,65,-70,,65,120,127.5,137.5,140,137.5,330,SBD
1,Brinklie Brown,F,2006-10-16,14,,Single-ply,DT Novice,57.96,60,-72.5,75,82.5,85,82.5,37.5,42.5,45,-50,45,92.5,97.5,105,107.5,105,232.5,SBD
1,Jodie Duncan,F,1974-11-19,46,TX,Raw,Master 1,72.6,75,,,,,,67.5,-72.5,-72.5,,67.5,147.5,157.5,-162.5,,157.5,225,BD
1,Jodie Duncan,F,1974-11-19,46,TX,Raw,Open,72.6,75,,,,,,67.5,-72.5,-72.5,,67.5,147.5,157.5,-162.5,,157.5,225,BD
1,Jodie Duncan,F,1974-11-19,46,TX,Raw,Master 1,72.6,75,,,,,,67.5,-72.5,-72.5,,67.5,,,,,,67.5,B
1,Jodie Duncan,F,1974-11-19,46,TX,Raw,Open,72.6,75,,,,,,67.5,-72.5,-72.5,,67.5,,,,,,67.5,B
1,Jodie Duncan,F,1974-11-19,46,TX,Raw,Master 1,72.6,75,,,,,,,,,,,147.5,157.5,-162.5,,157.5,157.5,D
1,Jodie Duncan,F,1974-11-19,46,TX,Raw,Open,72.6,75,,,,,,,,,,,147.5,157.5,-162.5,,157.5,157.5,D
1,Parker Musselwhite,M,1999-05-26,22,,Raw,DT Int,89.2,90,250,265,272.5,,272.5,125,132.5,140,,140,270,290,-305,,290,702.5,SBD
2,Max Yelverton,M,1999-11-01,21,,Raw,DT Int,89.54,90,165,175,185,,185,130,135,-142.5,,135,215,227.5,232.5,,232.5,552.5,SBD
1,Alexander Lilley,M,1999-03-04,22,,Raw,DT Int,108.6,110,185,192.5,202.5,,202.5,132.5,142.5,150,,150,217.5,230,237.5,250,237.5,590,SBD
1,Blaine Sowell,M,2007-07-02,14,,Raw,DT Novice,52.9,56,80,85,-92.5,,85,45,47.5,50,-55,50,-107.5,115,117.5,125,117.5,252.5,SBD
1,Cornelius Smith #1,M,1993-05-03,28,,Raw,DT Open,79.37,82.5,160,170,182.5,,182.5,95,107.5,-115,,107.5,170,182.5,192.5,,192.5,482.5,SBD
1,Parker Musselwhite,M,1999-05-26,22,,Raw,DT Open,89.2,90,250,265,272.5,,272.5,125,132.5,140,,140,270,290,-305,,290,702.5,SBD
1,Matthew Herbert,M,1994-01-20,27,,Raw,DT Open,130.7,140,132.5,142.5,145,,145,80,90,95,,95,160,170,180,190,180,420,SBD
1,JP Hucklebridge,M,1998-12-21,22,,Raw,DT P/F/M,91.8,100,170,-182.5,-182.5,,170,90,-97.5,-97.5,,90,185,195,-210,,195,455,SBD
1,Gabriel Barerra,M,1987-05-29,34,,Raw,DT Sub Master,109.2,110,140,145,152.5,,152.5,112.5,125,137.5,,137.5,182.5,205,227.5,230,227.5,517.5,SBD
1,Noah Martinez #7,M,2005-06-21,16,LA,Raw,DT Teen,71.8,75,117.5,125,-132.5,,125,70,77.5,85,,85,125,137.5,152.5,,152.5,362.5,SBD
1,Parker Musselwhite,M,1999-05-26,22,,Raw,Int,89.2,90,250,265,272.5,,272.5,125,132.5,140,,140,270,290,-305,,290,702.5,SBD
1,John Trent,M,1963-03-31,58,,Raw,Master 2,87.8,90,170,182.5,190,,190,-105,107.5,115,,115,182.5,192.5,210,,210,515,SBD
1,Parker Musselwhite,M,1999-05-26,22,,Raw,Open,89.2,90,250,265,272.5,,272.5,125,132.5,140,,140,270,290,-305,,290,702.5,SBD
1,Donald McGaughy,M,1988-10-14,32,,Raw,Open,86.9,90,182.5,190,200,,200,122.5,137.5,-140,,137.5,200,215,-227.5,,215,552.5,SBD
1,PJ Armstrong,M,1984-10-23,36,,Raw,Sub Master,93.2,100,142.5,150,157.5,,157.5,97.5,105,110,,110,170,182.5,187.5,,187.5,455,SBD
1,Sean Gill,M,1995-10-02,25,TX,Wraps,DT Novice,113.3,125,140,-155,170,,170,102.5,112.5,125,,125,177.5,200,215,227.5,215,510,SBD
1,Christian Kearney,M,1988-09-20,32,,Wraps,DT Open,65.6,67.5,220,235,-242.5,,235,132.5,137.5,140,,140,275,295,-307.5,,295,670,SBD
1,Christian Kearney,M,1988-09-20,32,,Wraps,DT Open,65.6,67.5,220,235,-242.5,,235,132.5,137.5,140,,140,275,295,-307.5,,295,670,SBD
DQ,Lane Davis #1,M,2003-11-12,17,TX,Wraps,DT Teen,64.1,67.5,-115,-125,-125,,,72.5,80,-82.5,,80,120,130,140,145,140,,SBD
1,Michael Rundle,M,1985-06-17,36,TX,Wraps,P/F/M,72.7,75,147.5,157.5,167.5,177.5,167.5,100,105,110,,110,175,182.5,195,205,195,472.5,SBD
1,Daniel Davis,M,1984-04-06,37,TX,Wraps,Sub Master,131,140,210,220,227.5,,227.5,-165,170,175,-182.5,175,250,260,270,280,270,672.5,SBD
1,Kane Jones,M,2005-10-06,15,,Wraps,Teen,64.5,67.5,-175,175,182.5,,182.5,87.5,95,-100,,95,177.5,187.5,195,200,195,472.5,SBD
1,Dayne Redmon,M,,19,,Single-ply,DT Novice,70.2,75,177.5,-192.5,,,177.5,135,-145,145,,145,192.5,205,220,-227.5,220,542.5,SBD
1,Kysen Jackson,M,2005-07-13,16,TX,Single-ply,DT Open,73.3,75,170,182.5,192.5,-197.5,192.5,-115,122.5,137.5,-142.5,137.5,190,205,217.5,,217.5,547.5,SBD
2,Dayne Redmon,M,,19,,Single-ply,DT Open,70.2,75,177.5,-192.5,,,177.5,135,-145,145,,145,192.5,205,220,-227.5,220,542.5,SBD
1,Kysen Jackson,M,2005-07-13,16,TX,Single-ply,DT Teen,73.3,75,170,182.5,192.5,-197.5,192.5,-115,122.5,137.5,-142.5,137.5,190,205,217.5,,217.5,547.5,SBD
1,Dayne Redmon,M,,19,,Single-ply,Novice,70.2,75,177.5,-192.5,,,177.5,135,-145,145,,145,192.5,205,220,-227.5,220,542.5,SBD
1,Dayne Redmon,M,,19,,Single-ply,Open,70.2,75,177.5,-192.5,,,177.5,135,-145,145,,145,192.5,205,220,-227.5,220,542.5,SBD
1,John Daugherty,M,1978-10-05,42,LA,Raw,DT Master 1,103.32,110,,,,,,117.5,127.5,137.5,,137.5,170,182.5,192.5,,192.5,330,BD
1,Carey Jackson,M,1971-05-20,50,,Single-ply,DT Master 2,98.4,100,,,,,,150,167.5,170,,170,227.5,250,260,,260,430,BD
1,Carey Jackson,M,1971-05-20,50,,Single-ply,DT Open,98.4,100,,,,,,150,167.5,170,,170,227.5,250,260,,260,430,BD
1,Logan White,M,1991-02-03,30,,Raw,DT Open,106.2,110,,,,,,95,100,107.5,,107.5,205,-210,210,,210,317.5,BD
1,John Herod,M,1979-04-22,42,,Raw,Master 1,112.1,125,,,,,,165,172.5,-175,,172.5,265,-272.5,272.5,,272.5,445,BD
1,Mike Lohman,M,1959-05-29,62,,Raw,Master 3,94.7,100,,,,,,137.5,145,-150,,145,130,142.5,-152.5,,142.5,287.5,BD
1,John Herod,M,1979-04-22,42,,Raw,Open,112.1,125,,,,,,165,172.5,-175,,172.5,265,-272.5,272.5,,272.5,445,BD
1,Jay Mullens,M,1989-01-26,32,,Raw,Open,135.5,140,,,,,,215,227.5,232.5,,232.5,305,320,330,,330,562.5,BD
1,Christian Kearney,M,1988-09-20,32,,Raw,DT Open,65.6,67.5,,,,,,132.5,137.5,140,,140,275,295,-307.5,,295,435,BD
1,Lane Davis #1,M,2003-11-12,17,TX,Raw,DT Teen,64.1,67.5,,,,,,72.5,80,-82.5,,80,120,130,140,145,140,220,BD
1,Rudy Martinez III,M,1979-11-16,41,,Raw,DT Master 1,97,100,,,,,,185,187.5,190,,190,,,,,,190,B
1,John Herod,M,1979-04-22,42,,Raw,Master 1,112.1,125,,,,,,165,172.5,-175,,172.5,,,,,,172.5,B
1,Mike Lohman,M,1959-05-29,62,,Raw,Master 3,94.7,100,,,,,,137.5,145,-150,,145,,,,,,145,B
1,Brad Duncan,M,1978-09-11,42,TX,Raw,Open,80.9,82.5,,,,,,145,152.5,162.5,,162.5,,,,,,162.5,B
1,John Herod,M,1979-04-22,42,,Raw,Open,112.1,125,,,,,,165,172.5,-175,,172.5,,,,,,172.5,B
1,Alex Hamblin,M,1985-02-18,36,,Raw,Open,135.5,140,,,,,,215,-227.5,-227.5,,215,,,,,,215,B
1,Christian Kearney,M,1988-09-20,32,,Raw,DT Open,65.6,67.5,,,,,,132.5,137.5,140,,140,,,,,,140,B
1,Evan Gollay,M,1989-03-23,32,,Raw,DT Open,129,140,,,,,,,,,,,227.5,,,,227.5,227.5,D
1,John Herod,M,1979-04-22,42,,Raw,Master 1,112.1,125,,,,,,,,,,,265,-272.5,272.5,,272.5,272.5,D
1,John Herod,M,1979-04-22,42,,Raw,Open,112.1,125,,,,,,,,,,,265,-272.5,272.5,,272.5,272.5,D
1,AJ Charlton,M,1991-12-26,29,,Raw,Open,135.8,140,,,,,,,,,,,280,-300,300,,300,300,D
1,Christian Kearney,M,1988-09-20,32,,Raw,DT Open,65.6,67.5,,,,,,,,,,,275,295,-307.5,,295,295,D
