Name,WeightClassKg,Division,Best3SquatKg,Best3BenchKg,Best3DeadliftKg,TotalKg,Sex,Event,Equipment,Place,Team
Steph Seebruck,44,F-T,90.72,38.56,95.25,224.53,F,SBD,Single-ply,1,Necedah
Katie Marinette,44,F-T,77.11,36.29,99.79,213.19,F,SBD,Single-ply,2,Marinette
Megan Williams,44,F-T,79.38,40.82,86.18,206.38,F,SBD,Single-ply,3,Seymour
Gina Trinidad,44,F-T,83.91,34.02,88.45,206.38,F,SBD,Single-ply,4,Necedah
Christina Kleppen,44,F-T,74.84,40.82,90.72,206.38,F,SBD,Single-ply,5,Riverdale
Jackie Miller,44,F-T,83.91,31.75,81.65,197.31,F,SBD,Single-ply,6,Necedah
Sara Johnson,44,F-T,79.38,31.75,79.38,190.51,F,SBD,Single-ply,7,Neenah
Chelsey Brady,44,F-T,70.31,34.02,81.65,185.97,F,SBD,Single-ply,8,G.E.T.
Tahlia Haeuser,48,F-T,95.25,52.16,106.59,254.01,F,SBD,Single-ply,1,Holmen
Miranda Mueller,48,F-T,102.06,36.29,108.86,247.21,F,SBD,Single-ply,2,Neenah
Alada Oens,48,F-T,95.25,36.29,104.33,235.87,F,SBD,Single-ply,3,Necedah
Jamae Pennings,48,F-T,92.99,34.02,92.99,219.99,F,SBD,Single-ply,4,Neenah
Sadie Tennessen,48,F-T,77.11,34.02,106.59,217.72,F,SBD,Single-ply,5,Kaukauna
Kara Mason,48,F-T,72.57,36.29,104.33,213.19,F,SBD,Single-ply,6,S. Milwaulkee
Brittany Gorka,48,F-T,72.57,43.09,97.52,213.19,F,SBD,Single-ply,7,G.E.T.
Jessica Sabin,48,F-T,83.91,36.29,92.99,213.19,F,SBD,Single-ply,8,Necedah
Jayna van de Voort,48,F-T,77.11,38.56,92.99,208.65,F,SBD,Single-ply,9,Seymour
Beka Cox,48,F-T,77.11,31.75,99.79,208.65,F,SBD,Single-ply,10,Necedah
Jena Breit,48,F-T,74.84,31.75,102.06,208.65,F,SBD,Single-ply,11,WI Rapids
Stephanie Gerzmehle,48,F-T,81.65,34.02,92.99,208.65,F,SBD,Single-ply,12,WI Rapids
Danielle Machovec,48,F-T,61.23,29.48,99.79,190.51,F,SBD,Single-ply,13,Hillsboro
Elizabeth Svejda,48,F-T,,,,,F,SBD,Single-ply,DQ,Seymour
Jasmine Brewer,52,F-T,124.74,54.43,133.81,312.98,F,SBD,Single-ply,1,Riverdale
Lauren Houle,52,F-T,129.27,49.9,124.74,303.91,F,SBD,Single-ply,2,Neenah
Breanne Carlson,52,F-T,111.13,56.7,120.2,288.03,F,SBD,Single-ply,3,Peshtigo
Kelly Sullwold,52,F-T,97.52,54.43,124.74,276.69,F,SBD,Single-ply,4,Clear Lake
Stephanie Sitkawiktz,52,F-T,102.06,47.63,117.93,267.62,F,SBD,Single-ply,5,Man. Lincoln
Ashley Johnson,52,F-T,97.52,45.36,120.2,263.08,F,SBD,Single-ply,6,Hillsboro
Amanda Schroeder,52,F-T,97.52,38.56,120.2,256.28,F,SBD,Single-ply,7,Kaukauna
Alyssa Wilson,52,F-T,95.25,34.02,124.74,254.01,F,SBD,Single-ply,8,Racine Case
Renee Dutscheck,52,F-T,104.33,40.82,108.86,254.01,F,SBD,Single-ply,9,Necedah
Nicole Useman,52,F-T,92.99,36.29,122.47,251.74,F,SBD,Single-ply,10,Badger
Elissa Parker,52,F-T,102.06,40.82,108.86,251.74,F,SBD,Single-ply,11,Necedah
Kayla Portwine,52,F-T,92.99,52.16,102.06,247.21,F,SBD,Single-ply,12,Riverdale
Jessica Kromrey,52,F-T,97.52,54.43,95.25,247.21,F,SBD,Single-ply,13,Osceola
Lupe Flores,52,F-T,90.72,38.56,108.86,238.14,F,SBD,Single-ply,14,Neenah
Cala Feranec,52,F-T,79.38,43.09,115.67,238.14,F,SBD,Single-ply,15,Phillips
Paige Patrykus,52,F-T,86.18,40.82,97.52,224.53,F,SBD,Single-ply,16,WI Rapids
Ashley Weimer,52,F-T,86.18,43.09,92.99,222.26,F,SBD,Single-ply,17,WI Rapids
Skye Meyers,52,F-T,79.38,38.56,104.33,222.26,F,SBD,Single-ply,18,Necedah
Melissa Fischi,52,F-T,77.11,43.09,99.79,219.99,F,SBD,Single-ply,19,Seymour
Lauryn Bigley,52,F-T,,,,,F,SBD,Single-ply,DQ,S. Milwaulkee
Katie Van Dusen,56,F-T,145.15,65.77,138.35,349.27,F,SBD,Single-ply,1,Necedah
Courtney Langhoff,56,F-T,120.2,56.7,127.01,303.91,F,SBD,Single-ply,2,Neenah
Renee Ann Kutchera,56,F-T,111.13,54.43,133.81,299.37,F,SBD,Single-ply,3,Man. Lincoln
Heidi Baumann,56,F-T,104.33,47.63,108.86,260.82,F,SBD,Single-ply,4,Riverdale
Holly Brenengen,56,F-T,97.52,43.09,111.13,251.74,F,SBD,Single-ply,5,G.E.T.
Chris Schuh,56,F-T,90.72,52.16,104.33,247.21,F,SBD,Single-ply,6,Kaukauna
Stefany Dearing,56,F-T,97.52,43.09,106.59,247.21,F,SBD,Single-ply,7,Phillips
Nikki Workman,56,F-T,92.99,45.36,106.59,244.94,F,SBD,Single-ply,8,Neenah
Becky Manake,56,F-T,97.52,36.29,108.86,242.67,F,SBD,Single-ply,9,Neenah
Amanda Bigalk,56,F-T,83.91,40.82,111.13,235.87,F,SBD,Single-ply,10,Phillips
Becky Jorgensen,56,F-T,90.72,38.56,104.33,233.6,F,SBD,Single-ply,11,Necedah
Michelle Mullen,56,F-T,79.38,43.09,106.59,229.06,F,SBD,Single-ply,12,Holmen
Ashley Lagerstrom,56,F-T,92.99,40.82,95.25,229.06,F,SBD,Single-ply,13,Hillsboro
Krista Beaver,56,F-T,88.45,40.82,97.52,226.8,F,SBD,Single-ply,14,Hillsboro
Katrina Esser,56,F-T,86.18,34.02,104.33,224.53,F,SBD,Single-ply,15,Racine Case
Katie Hammer,56,F-T,83.91,43.09,92.99,219.99,F,SBD,Single-ply,16,Hillsboro
Mary Ritt,56,F-T,79.38,43.09,95.25,217.72,F,SBD,Single-ply,17,Racine Horlic
Eileen Miller,56,F-T,83.91,31.75,90.72,206.38,F,SBD,Single-ply,18,Necedah
Cassie Bosworth,56,F-T,77.11,40.82,83.91,201.85,F,SBD,Single-ply,19,G.E.T.
Stephanie Baumann,56,F-T,92.99,52.16,,,F,SBD,Single-ply,DQ,Riverdale
Ashley Raab,56,F-T,83.91,,,,F,SBD,Single-ply,DQ,WI Rapids
Kasia Brzezicka,56,F-T,74.84,,,,F,SBD,Single-ply,DQ,S. Milwaulkee
Meghan Jovanovich,60,F-T,145.15,63.5,136.08,344.73,F,SBD,Single-ply,1,Neenah
Stevie Cross,60,F-T,133.81,56.7,129.27,319.78,F,SBD,Single-ply,2,Necedah
Chelsea Trim,60,F-T,108.86,52.16,124.74,285.76,F,SBD,Single-ply,3,G.E.T.
Katie Flaherty,60,F-T,120.2,47.63,115.67,283.5,F,SBD,Single-ply,4,G.E.T.
Lizzy Houle,60,F-T,111.13,43.09,129.27,283.5,F,SBD,Single-ply,5,Neenah
Elena Smith,60,F-T,95.25,47.63,136.08,278.96,F,SBD,Single-ply,6,Hillsboro
Katy Gregory,60,F-T,104.33,43.09,122.47,269.89,F,SBD,Single-ply,7,Racine Case
Destiny Skubis,60,F-T,108.86,45.36,115.67,269.89,F,SBD,Single-ply,8,Necedah
Jocelyn Burhr,60,F-T,90.72,52.16,124.74,267.62,F,SBD,Single-ply,9,Clear Lake
Alisha Koxlien,60,F-T,97.52,52.16,117.93,267.62,F,SBD,Single-ply,10,G.E.T.
Annarose Liska,60,F-T,95.25,52.16,117.93,265.35,F,SBD,Single-ply,11,Hillsboro
Kathryn Zempel,60,F-T,111.13,36.29,113.4,260.82,F,SBD,Single-ply,12,Neenah
Lizzi Slivinski,60,F-T,102.06,43.09,106.59,251.74,F,SBD,Single-ply,13,Neenah
Amanda Daniels,60,F-T,83.91,47.63,117.93,249.48,F,SBD,Single-ply,14,Clear Lake
Michelle Skotzke,60,F-T,83.91,38.56,117.93,240.4,F,SBD,Single-ply,15,Phillips
Denise Porter,60,F-T,95.25,38.56,104.33,238.14,F,SBD,Single-ply,16,Neenah
Bekah Warren,60,F-T,81.65,38.56,111.13,231.33,F,SBD,Single-ply,17,Mellen
Hillary Mcanallan,60,F-T,68.04,45.36,113.4,226.8,F,SBD,Single-ply,18,Whitehall
Desirae Budi,67.5,F-T,142.88,61.23,131.54,335.66,F,SBD,Single-ply,1,Kimberly
Amanda Brenneman,67.5,F-T,127.01,63.5,136.08,326.59,F,SBD,Single-ply,2,Xavier
Kaitlyn Jindrick,67.5,F-T,113.4,54.43,131.54,299.37,F,SBD,Single-ply,3,Hillsboro
Sarah Faga,67.5,F-T,115.67,58.97,122.47,297.1,F,SBD,Single-ply,4,Riverdale
Kristin Van Meter,67.5,F-T,115.67,45.36,124.74,285.76,F,SBD,Single-ply,5,Necedah
Emily Dunning,67.5,F-T,102.06,49.9,129.27,281.23,F,SBD,Single-ply,6,Superior
Viktoria Hasselhof,67.5,F-T,102.06,47.63,124.74,274.42,F,SBD,Single-ply,7,Riverdale
Lakeishya Hauley,67.5,F-T,113.4,52.16,106.59,272.16,F,SBD,Single-ply,8,Seymour
Becky Black,67.5,F-T,111.13,47.63,111.13,269.89,F,SBD,Single-ply,9,G.E.T.
Heather Ruhland,67.5,F-T,104.33,49.9,115.67,269.89,F,SBD,Single-ply,10,Riverdale
Jennica Kundert,67.5,F-T,108.86,47.63,111.13,267.62,F,SBD,Single-ply,11,WI Rapids
Tiff Daley,67.5,F-T,95.25,43.09,120.2,258.55,F,SBD,Single-ply,12,Necedah
Renae Tridle,67.5,F-T,111.13,49.9,90.72,251.74,F,SBD,Single-ply,13,G.E.T.
Marissa Johnson,67.5,F-T,104.33,45.36,99.79,249.48,F,SBD,Single-ply,14,Superior
Emily Anschutz,67.5,F-T,72.57,45.36,129.27,247.21,F,SBD,Single-ply,15,Seymour
Siera Brown,67.5,F-T,81.65,45.36,117.93,244.94,F,SBD,Single-ply,16,Whitehall
Breanne Large,67.5,F-T,81.65,47.63,115.67,244.94,F,SBD,Single-ply,17,Mellen
Tricia Jenkins,67.5,F-T,90.72,38.56,95.25,224.53,F,SBD,Single-ply,18,G.E.T.
Hillary McLaren,67.5,F-T,106.59,49.9,,,F,SBD,Single-ply,DQ,Neenah
Claire Hansen,67.5,F-T,81.65,,,,F,SBD,Single-ply,DQ,Racine Case
Joanne Neff,75,F-T,133.81,47.63,133.81,315.25,F,SBD,Single-ply,4,Riverdale
Melissa Haskin,75,F-T,129.27,54.43,127.01,310.71,F,SBD,Single-ply,5,Holmen
Jessica Bruns,75,F-T,117.93,58.97,129.27,306.17,F,SBD,Single-ply,7,WI Rapids
Jenny Molitor,75,F-T,120.2,45.36,136.08,301.64,F,SBD,Single-ply,10,Neenah
Sammy Hood,75,F-T,129.27,45.36,124.74,299.37,F,SBD,Single-ply,11,Necedah
Kristin Fowler,75,F-T,115.67,54.43,127.01,297.1,F,SBD,Single-ply,12,Necedah
Jade Hrabak,75,F-T,117.93,58.97,115.67,292.57,F,SBD,Single-ply,13,Phillips
Lauren Torgerson,75,F-T,102.06,58.97,124.74,285.76,F,SBD,Single-ply,16,Superior
Leah Harvey,75,F-T,111.13,45.36,127.01,283.5,F,SBD,Single-ply,17,Kaukauna
Emily Lowney,75,F-T,108.86,43.09,122.47,274.42,F,SBD,Single-ply,20,Osceola
Vivien Röder,75,F-T,79.38,65.77,115.67,260.82,F,SBD,Single-ply,22,Holmen
Jennifer Fusak,75,F-T,92.99,52.16,113.4,258.55,F,SBD,Single-ply,23,Phillips
Andrea Hay,75,F-T,113.4,38.56,106.59,258.55,F,SBD,Single-ply,24,Peshtigo
Courtney Oppelt,75,F-T,92.99,47.63,115.67,256.28,F,SBD,Single-ply,26,Mellen
Danielle Heck,75,F-T,104.33,47.63,104.33,256.28,F,SBD,Single-ply,27,WI Rapids
Cassie Happel,75,F-T,95.25,45.36,108.86,249.48,F,SBD,Single-ply,28,Hillsboro
Lucy Bouressa,75,F-T,99.79,45.36,104.33,249.48,F,SBD,Single-ply,29,Kaukauna
Laura Lipke,75,F-T,95.25,45.36,104.33,244.94,F,SBD,Single-ply,30,Holmen
Tiff Schmidt,75,F-T,97.52,36.29,108.86,242.67,F,SBD,Single-ply,31,Necedah
Paige Halverson,75,F-T,86.18,40.82,99.79,226.8,F,SBD,Single-ply,33,Superior
Brittany Fritsch,75,F-T,129.27,56.7,,,F,SBD,Single-ply,DQ,G.E.T.
Krista Durnin,75,F-T,,,,,F,SBD,Single-ply,DQ,LaCrosseLoga
Julie Kildahl,75,F-T,,,,,F,SBD,Single-ply,DQ,Antigo
Devan Doan,75,F-T,163.29,90.72,158.76,412.77,F,SBD,Single-ply,1,Berlin
Stephanie Crews,75,F-T,145.15,58.97,136.08,340.19,F,SBD,Single-ply,2,Necedah
Kayla Ward,75,F-T,133.81,56.7,127.01,317.51,F,SBD,Single-ply,3,Holmen
Maria Revels,75,F-T,136.08,52.16,122.47,310.71,F,SBD,Single-ply,6,Hillsboro
Jennifer Backes,75,F-T,131.54,54.43,120.2,306.17,F,SBD,Single-ply,8,Osceola
Jenna Barrett,75,F-T,127.01,52.16,124.74,303.91,F,SBD,Single-ply,9,Neenah
Sam Holtz,75,F-T,120.2,52.16,117.93,290.3,F,SBD,Single-ply,14,WI Rapids
Stacy Bolwerk,75,F-T,113.4,58.97,115.67,288.03,F,SBD,Single-ply,15,Kimberly
Sarah Lang,75,F-T,106.59,49.9,127.01,283.5,F,SBD,Single-ply,18,Holmen
Alaina Prill,75,F-T,111.13,47.63,122.47,281.23,F,SBD,Single-ply,19,Phillips
Marie Peterson,75,F-T,97.52,49.9,122.47,269.89,F,SBD,Single-ply,21,Osceola
Hannah Diehl,75,F-T,111.13,43.09,104.33,258.55,F,SBD,Single-ply,25,Neenah
Katlin Lacasse,75,F-T,83.91,56.7,102.06,242.67,F,SBD,Single-ply,32,WI Rapids
Jessica Retzlaff,82.5,F-T,138.35,58.97,163.29,360.61,F,SBD,Single-ply,1,Neenah
Jen Harvey,82.5,F-T,136.08,52.16,142.88,331.12,F,SBD,Single-ply,2,Kaukauna
Lacy Stirk,82.5,F-T,136.08,72.57,117.93,326.59,F,SBD,Single-ply,3,WI Rapids
Jordan Stupecky,82.5,F-T,133.81,61.23,129.27,324.32,F,SBD,Single-ply,4,Neenah
Marissa Mcdougall,82.5,F-T,127.01,54.43,140.61,322.05,F,SBD,Single-ply,5,WI Rapids
Ashley Headrick,82.5,F-T,129.27,58.97,133.81,322.05,F,SBD,Single-ply,6,Holmen
Brenna Galvin,82.5,F-T,92.99,45.36,136.08,274.42,F,SBD,Single-ply,7,Horicon
Heidi Brenengen,82.5,F-T,122.47,43.09,106.59,272.16,F,SBD,Single-ply,8,G.E.T.
Jena Dowd,82.5,F-T,120.2,47.63,99.79,267.62,F,SBD,Single-ply,9,Racine Case
Jennifer Swanson,90,F-T,156.49,54.43,142.88,353.8,F,SBD,Single-ply,1,Neenah
Dawn Sol,90,F-T,133.81,65.77,136.08,335.66,F,SBD,Single-ply,2,Osceola
Kaitlyn Marsh,90,F-T,133.81,58.97,133.81,326.59,F,SBD,Single-ply,3,Neenah
Leah Smerud,90,F-T,122.47,61.23,131.54,315.25,F,SBD,Single-ply,4,Holmen
Dawn Sidenbender,90,F-T,124.74,52.16,122.47,299.37,F,SBD,Single-ply,5,Phillips
Jessica Rychecky,90,F-T,111.13,52.16,129.27,292.57,F,SBD,Single-ply,6,Necedah
Jamie Pasch,90+,F-T,183.7,61.23,158.76,403.7,F,SBD,Single-ply,2,Seymour
Victoria Boucher,90+,F-T,127.01,70.31,165.56,362.87,F,SBD,Single-ply,3,Osceola
Brittany Nielson,90+,F-T,156.49,65.77,138.35,360.61,F,SBD,Single-ply,4,Peshtigo
Angela Hilton,90+,F-T,122.47,61.23,142.88,326.59,F,SBD,Single-ply,6,WI Rapids
Ramona Kelty,90+,F-T,136.08,58.97,115.67,310.71,F,SBD,Single-ply,7,WI Rapids
Amber Zwoniarkiewicz,90+,F-T,113.4,52.16,140.61,306.17,F,SBD,Single-ply,9,Horicon
Britt Lewis #2,90+,F-T,,,,,F,SBD,Single-ply,DQ,Seymour
Stacy Brock,90+,F-T,215.46,83.91,183.7,483.08,F,SBD,Single-ply,1,WI Rapids
Barbie Dobratz,90+,F-T,120.2,81.65,136.08,337.93,F,SBD,Single-ply,5,WI Rapids
Molly Mohnemacher,90+,F-T,117.93,63.5,127.01,308.44,F,SBD,Single-ply,8,Man. Lincoln
Sara Jane Kornely,90+,F-T,,,,,F,SBD,Single-ply,DQ,Man. Lincoln
Ryan Bachorz,52,M-T,147.42,68.04,151.95,367.41,M,SBD,Single-ply,1,Neenah
Seth Winchel,52,M-T,136.08,74.84,145.15,356.07,M,SBD,Single-ply,2,Hillsboro
Craig Palubicki,52,M-T,129.27,70.31,151.95,351.53,M,SBD,Single-ply,3,Seymour
Josh Dahl,52,M-T,124.74,56.7,129.27,310.71,M,SBD,Single-ply,4,G.E.T.
Chris Wilson #10,52,M-T,120.2,52.16,129.27,301.64,M,SBD,Single-ply,5,G.E.T.
Brandon Webb,52,M-T,124.74,52.16,117.93,294.84,M,SBD,Single-ply,6,Neenah
James Karbowski,52,M-T,106.59,56.7,124.74,288.03,M,SBD,Single-ply,7,Necedah
Kenny Atkinson,52,M-T,106.59,54.43,106.59,267.62,M,SBD,Single-ply,8,LaCrosseLoga
Bobby Saim,52,M-T,104.33,45.36,113.4,263.08,M,SBD,Single-ply,9,Neenah
Timothy Deda,52,M-T,95.25,47.63,120.2,263.08,M,SBD,Single-ply,10,Phillips
Chris Hoffman,52,M-T,111.13,49.9,99.79,260.82,M,SBD,Single-ply,11,Neenah
Matt Barney,52,M-T,97.52,52.16,102.06,251.74,M,SBD,Single-ply,12,Clear Lake
Derek Pospichal,52,M-T,92.99,52.16,99.79,244.94,M,SBD,Single-ply,13,Riverdale
Holden Wilkinson,52,M-T,77.11,45.36,97.52,219.99,M,SBD,Single-ply,14,Riverdale
Ian Larson,52,M-T,83.91,45.36,88.45,217.72,M,SBD,Single-ply,15,Phillips
John Badagliacco,56,M-T,133.81,88.45,181.44,403.7,M,SBD,Single-ply,1,Hayward
Kyle Dahl,56,M-T,151.95,79.38,172.37,403.7,M,SBD,Single-ply,2,G.E.T.
Bobby Castillo,56,M-T,133.81,65.77,158.76,358.34,M,SBD,Single-ply,3,Neenah
Jsse Demar,56,M-T,133.81,77.11,136.08,347,M,SBD,Single-ply,4,Osceola
Matt Dunn,56,M-T,124.74,72.57,136.08,333.39,M,SBD,Single-ply,5,G.E.T.
Justin Binstorh,56,M-T,92.99,74.84,149.69,317.51,M,SBD,Single-ply,6,Clear Lake
Kenny Gregory,56,M-T,104.33,56.7,147.42,308.44,M,SBD,Single-ply,7,Racine Case
Thomas Kundinger,56,M-T,92.99,65.77,142.88,301.64,M,SBD,Single-ply,8,Phillips
Sean Warrichalet,56,M-T,97.52,56.7,129.27,283.5,M,SBD,Single-ply,9,Kaukauna
William Kellar,56,M-T,106.59,58.97,113.4,278.96,M,SBD,Single-ply,10,Holmen
Travis Connor,56,M-T,127.01,,,,M,SBD,Single-ply,DQ,Racine Horlic
Zach Karbula,60,M-T,176.9,86.18,190.51,453.59,M,SBD,Single-ply,1,G.E.T.
Muamer Islami,60,M-T,142.88,92.99,204.12,439.98,M,SBD,Single-ply,2,S. Milwaulkee
James Eigermann,60,M-T,158.76,86.18,190.51,435.45,M,SBD,Single-ply,3,Hillsboro
Channing Williams,60,M-T,154.22,88.45,181.44,424.11,M,SBD,Single-ply,4,Marquette U.
Ben Kammueller,60,M-T,136.08,95.25,176.9,408.23,M,SBD,Single-ply,5,G.E.T.
Nick Johnson,60,M-T,142.88,74.84,176.9,394.63,M,SBD,Single-ply,6,Neenah
Ross Hardie,60,M-T,151.95,77.11,149.69,378.75,M,SBD,Single-ply,7,West Salem
Nick Rytilahti,60,M-T,149.69,74.84,149.69,374.21,M,SBD,Single-ply,8,Holmen
Sam Parrott,60,M-T,122.47,79.38,156.49,358.34,M,SBD,Single-ply,9,Adams-Friend
Eric Kordus,60,M-T,127.01,72.57,158.76,358.34,M,SBD,Single-ply,10,Holmen
Joseph Zimmerman,60,M-T,115.67,79.38,163.29,358.34,M,SBD,Single-ply,11,Mellen
Kyung Kim,60,M-T,129.27,63.5,154.22,347,M,SBD,Single-ply,12,Racine Case
Josh Olson,60,M-T,122.47,74.84,149.69,347,M,SBD,Single-ply,13,Holmen
Josh Leathers,60,M-T,129.27,68.04,147.42,344.73,M,SBD,Single-ply,14,Neenah
Matt Marculls,60,M-T,127.01,70.31,147.42,344.73,M,SBD,Single-ply,15,Necedah
Matt Docken,60,M-T,117.93,72.57,151.95,342.46,M,SBD,Single-ply,16,G.E.T.
Sean Hein,60,M-T,122.47,70.31,147.42,340.19,M,SBD,Single-ply,17,Reedsburg
Karl Geske,60,M-T,113.4,77.11,149.69,340.19,M,SBD,Single-ply,18,G.E.T.
Nick White,60,M-T,136.08,68.04,136.08,340.19,M,SBD,Single-ply,19,Brookfield Ct
David Smith,60,M-T,,,,,M,SBD,Single-ply,DQ,Superior
Kyle Gauthier,60,M-T,,,,,M,SBD,Single-ply,DQ,Kaukauna
Jaareal Bell,67.5,M-T,142.88,95.25,206.38,444.52,M,SBD,Single-ply,1,Racine Horlic
Brian Van Dyke,67.5,M-T,165.56,92.99,183.7,442.25,M,SBD,Single-ply,2,Necedah
Jacob Dunn,67.5,M-T,165.56,79.38,183.7,428.64,M,SBD,Single-ply,3,G.E.T.
Quentin Moller,67.5,M-T,136.08,88.45,204.12,428.64,M,SBD,Single-ply,4,G.E.T.
Lukas Comstock,67.5,M-T,140.61,92.99,179.17,412.77,M,SBD,Single-ply,5,Hayward
Tony Rallo,67.5,M-T,142.88,77.11,183.7,403.7,M,SBD,Single-ply,6,Racine Case
Wes Peters,67.5,M-T,138.35,83.91,170.1,392.36,M,SBD,Single-ply,7,Hayward
Justin Durik,67.5,M-T,147.42,90.72,151.95,390.09,M,SBD,Single-ply,8,Seymour
Ben Stacker,67.5,M-T,145.15,70.31,172.37,387.82,M,SBD,Single-ply,9,Neenah
Nick Lockhart,67.5,M-T,140.61,77.11,167.83,385.55,M,SBD,Single-ply,10,Xavier
Dj Kunz,67.5,M-T,151.95,83.91,149.69,385.55,M,SBD,Single-ply,11,Kaukauna
Dan Salewski,67.5,M-T,142.88,77.11,158.76,378.75,M,SBD,Single-ply,12,Assumption
Kyle Warner,67.5,M-T,149.69,74.84,149.69,374.21,M,SBD,Single-ply,13,Holmen
Dan Bergh,67.5,M-T,138.35,70.31,165.56,374.21,M,SBD,Single-ply,14,Necedah
Kyle Pelishek,67.5,M-T,124.74,86.18,156.49,367.41,M,SBD,Single-ply,15,Seymour
Tony Rodgers,67.5,M-T,131.54,95.25,136.08,362.87,M,SBD,Single-ply,16,Riverdale
Howie Heinrich,67.5,M-T,127.01,83.91,149.69,360.61,M,SBD,Single-ply,17,WI Rapids
Matt Gamoke,67.5,M-T,122.47,65.77,172.37,360.61,M,SBD,Single-ply,18,G.E.T.
Jake Andreaska,67.5,M-T,149.69,77.11,,,M,SBD,Single-ply,DQ,S. Milwaulkee
Houa Yang,67.5,M-T,,,,,M,SBD,Single-ply,DQ,Racine Horlic
Russell Johnston,75,M-T,199.58,113.4,199.58,512.56,M,SBD,Single-ply,4,Racine Horlic
Bobby Barney,75,M-T,176.9,106.59,197.31,480.81,M,SBD,Single-ply,6,LaCrosseLoga
Kyle Brady,75,M-T,156.49,104.33,190.51,451.32,M,SBD,Single-ply,13,G.E.T.
Chris Henricksen,75,M-T,183.7,83.91,183.7,451.32,M,SBD,Single-ply,14,Necedah
Chris Lascelle,75,M-T,165.56,97.52,181.44,444.52,M,SBD,Single-ply,15,S. Milwaulkee
Robert Miroslaw,75,M-T,161.03,74.84,206.38,442.25,M,SBD,Single-ply,17,Hillsboro
Brian Mikulecky,75,M-T,170.1,74.84,190.51,435.45,M,SBD,Single-ply,22,Racine Case
Aaron Towner,75,M-T,149.69,95.25,185.97,430.91,M,SBD,Single-ply,23,G.E.T.
Kyle Mikulecky,75,M-T,165.56,72.57,190.51,428.64,M,SBD,Single-ply,24,Racine Case
Grant Kuehnl,75,M-T,154.22,106.59,161.03,421.84,M,SBD,Single-ply,25,Seymour
Aaron Thesing,75,M-T,151.95,70.31,174.63,396.89,M,SBD,Single-ply,27,Holmen
Alex Wolf,75,M-T,149.69,77.11,165.56,392.36,M,SBD,Single-ply,28,Riverdale
Sam Winchel,75,M-T,222.26,122.47,226.8,571.53,M,SBD,Single-ply,1,Hillsboro
Nick Brillia,75,M-T,192.78,120.2,249.48,562.45,M,SBD,Single-ply,2,Ashland
Nick Cox,75,M-T,217.72,102.06,215.46,535.24,M,SBD,Single-ply,3,Osceola
Alex Goehring,75,M-T,183.7,106.59,197.31,487.61,M,SBD,Single-ply,5,Osceola
Dan Swanson,75,M-T,167.83,111.13,199.58,478.54,M,SBD,Single-ply,7,Clear Lake
Joe Chouinard,75,M-T,170.1,74.84,217.72,462.66,M,SBD,Single-ply,8,Neenah
Ben Woodward,75,M-T,188.24,92.99,174.63,455.86,M,SBD,Single-ply,9,Kaukauna
Jimmy Viasak,75,M-T,163.29,86.18,204.12,453.59,M,SBD,Single-ply,10,Racine Case
Matt Brady,75,M-T,167.83,104.33,181.44,453.59,M,SBD,Single-ply,11,G.E.T.
Noah Karow,75,M-T,158.76,95.25,199.58,453.59,M,SBD,Single-ply,12,G.E.T.
Gerald Danforth,75,M-T,154.22,104.33,185.97,444.52,M,SBD,Single-ply,16,Seymour
Thomas Venturino,75,M-T,151.95,92.99,197.31,442.25,M,SBD,Single-ply,18,Xavier
Sid Rigdon,75,M-T,170.1,88.45,181.44,439.98,M,SBD,Single-ply,19,Racine Horlic
John O'loughlin,75,M-T,149.69,95.25,192.78,437.72,M,SBD,Single-ply,20,Necedah
Tyler Slovensky,75,M-T,158.76,95.25,183.7,437.72,M,SBD,Single-ply,21,WI Rapids
Billy Nytes,75,M-T,147.42,92.99,158.76,399.16,M,SBD,Single-ply,26,Kaukauna
Chris Hanson,75,M-T,,,,,M,SBD,Single-ply,DQ,Man. Lincoln
Joe Raehl,75,M-T,,,,,M,SBD,Single-ply,DQ,Neenah
Tyler Kirsenlohr,75,M-T,,,,,M,SBD,Single-ply,DQ,Adams-Friend
Seán Hickey,82.5,M-T,204.12,133.81,224.53,562.45,M,SBD,Single-ply,1,Assumption
Robert Trenttin,82.5,M-T,213.19,117.93,213.19,544.31,M,SBD,Single-ply,2,Superior
Greg Robinson,82.5,M-T,204.12,117.93,210.92,532.97,M,SBD,Single-ply,3,WI Rapids
Mike Schmelzle,82.5,M-T,201.85,102.06,226.8,530.7,M,SBD,Single-ply,4,Necedah
Ross Thomas,82.5,M-T,183.7,106.59,224.53,514.83,M,SBD,Single-ply,5,Xavier
Kyle Coddington,82.5,M-T,195.04,102.06,204.12,501.22,M,SBD,Single-ply,6,Hayward
Brandon Raeder,82.5,M-T,181.44,97.52,215.46,494.42,M,SBD,Single-ply,7,Racine Horlic
John Weingarten,82.5,M-T,170.1,97.52,208.65,476.27,M,SBD,Single-ply,8,Hayward
Eric Kradecki,82.5,M-T,181.44,97.52,190.51,469.47,M,SBD,Single-ply,9,S. Milwaulkee
Codi Jacobs,82.5,M-T,174.63,90.72,204.12,469.47,M,SBD,Single-ply,10,G.E.T.
Keimon Joiner,82.5,M-T,151.95,99.79,213.19,464.93,M,SBD,Single-ply,11,Neenah
Corey O'day,90,M-T,235.87,120.2,258.55,614.62,M,SBD,Single-ply,1,WI Rapids
Brent Miller,90,M-T,238.14,113.4,254.01,605.55,M,SBD,Single-ply,2,Menasha
John Hackman,90,M-T,235.87,113.4,247.21,596.47,M,SBD,Single-ply,3,Man. Lincoln
Travis Schultz,90,M-T,226.8,113.4,226.8,566.99,M,SBD,Single-ply,4,Mauston
Eric Dutecheck,90,M-T,231.33,108.86,215.46,555.65,M,SBD,Single-ply,5,Necedah
Kenneth Brashears,90,M-T,206.38,111.13,219.99,537.51,M,SBD,Single-ply,6,Berlin
Luke Sieber,90,M-T,192.78,124.74,201.85,519.36,M,SBD,Single-ply,7,Green Bay Eas
Ethan Wanless,90,M-T,217.72,92.99,201.85,512.56,M,SBD,Single-ply,8,Hillsboro
Justin Michaels,90,M-T,176.9,131.54,204.12,512.56,M,SBD,Single-ply,9,LaCrosseLoga
Cody Kaplanek,90,M-T,183.7,111.13,215.46,510.29,M,SBD,Single-ply,10,Antigo
Stuart Hanzlik,90,M-T,190.51,99.79,208.65,498.95,M,SBD,Single-ply,11,Hayward
Brian Housworth,90,M-T,195.04,95.25,201.85,492.15,M,SBD,Single-ply,12,Necedah
Matthew Thronson,90,M-T,170.1,115.67,201.85,487.61,M,SBD,Single-ply,13,Independence
Timothy Mccarthy,90,M-T,183.7,99.79,195.04,478.54,M,SBD,Single-ply,14,Superior
Justin Zeliner,90,M-T,183.7,97.52,195.04,476.27,M,SBD,Single-ply,15,WI Rapids
Tony Monahos,90,M-T,190.51,92.99,190.51,474,M,SBD,Single-ply,16,WI Rapids
Justin Hare,90,M-T,170.1,106.59,192.78,469.47,M,SBD,Single-ply,17,G.E.T.
Tyler Krombholz,90,M-T,183.7,102.06,181.44,467.2,M,SBD,Single-ply,18,Merrill
Kyle Fuhrman,90,M-T,199.58,131.54,,,M,SBD,Single-ply,DQ,Reedsburg
Frank Minervini,90,M-T,183.7,106.59,,,M,SBD,Single-ply,DQ,WI Rapids
Ryan Van Zeeland,90,M-T,,,,,M,SBD,Single-ply,DQ,Xavier
Allen Baumgartner,90,M-T,,,,,M,SBD,Single-ply,DQ,Adams-Friend
Jeremy Huss,100,M-T,206.38,111.13,240.4,557.92,M,SBD,Single-ply,1,Kaukauna
Justin Tiachac,100,M-T,192.78,145.15,217.72,555.65,M,SBD,Single-ply,2,Luxemburg-Cas
Raymond Siekert,100,M-T,215.46,106.59,219.99,542.04,M,SBD,Single-ply,3,Mauston
Jeremy Van Beek,100,M-T,183.7,106.59,238.14,528.44,M,SBD,Single-ply,4,Kaukauna
Jeff Rominske,100,M-T,190.51,106.59,231.33,528.44,M,SBD,Single-ply,5,Phillips
Ben Detrie,100,M-T,224.53,86.18,213.19,523.9,M,SBD,Single-ply,6,Neenah
Tyler Rouse,100,M-T,183.7,104.33,226.8,514.83,M,SBD,Single-ply,7,Badger
Alex Peeters,100,M-T,197.31,106.59,206.38,510.29,M,SBD,Single-ply,8,WI Rapids
Gary Haack,100,M-T,176.9,108.86,204.12,489.88,M,SBD,Single-ply,9,Hayward
Brandon Savage,100,M-T,190.51,92.99,185.97,469.47,M,SBD,Single-ply,10,WI Rapids
Nicholas Erdman,100,M-T,183.7,99.79,183.7,467.2,M,SBD,Single-ply,11,Necedah
Thomas Santori,100,M-T,165.56,99.79,183.7,449.06,M,SBD,Single-ply,12,Superior
Billy Sullivan,100,M-T,154.22,104.33,,,M,SBD,Single-ply,DQ,Superior
Josh Mages,100,M-T,192.78,,,,M,SBD,Single-ply,DQ,Homestead
Alex Kautza,100,M-T,,,,,M,SBD,Single-ply,DQ,Antigo
Tony Miklaszewski,100,M-T,,,,,M,SBD,Single-ply,DQ,S. Milwaulkee
Sam Schaus,100,M-T,,,,,M,SBD,Single-ply,DQ,S. Milwaulkee
Tim Uecker,110,M-T,251.74,131.54,244.94,628.23,M,SBD,Single-ply,1,Markesan
Jeremy Taylor,110,M-T,206.38,142.88,260.82,610.08,M,SBD,Single-ply,2,Rhinelander
Ty Steinbrecher,110,M-T,249.48,95.25,217.72,562.45,M,SBD,Single-ply,3,Man. Lincoln
Wade Bemis,110,M-T,208.65,124.74,226.8,560.19,M,SBD,Single-ply,4,Random Lake
Scott Pavlik,110,M-T,231.33,113.4,210.92,555.65,M,SBD,Single-ply,5,S. Milwaulkee
Dusty Barilani,110,M-T,204.12,131.54,215.46,551.11,M,SBD,Single-ply,6,G.E.T.
Devin Garrett,110,M-T,204.12,117.93,226.8,548.85,M,SBD,Single-ply,7,Hayward
Andrew Baumgartner,110,M-T,181.44,147.42,199.58,528.44,M,SBD,Single-ply,8,Adams-Friend
Andy Prevost,110,M-T,204.12,108.86,215.46,528.44,M,SBD,Single-ply,9,G.E.T.
Mike Wochinski,110,M-T,172.37,140.61,197.31,510.29,M,SBD,Single-ply,10,Kaukauna
Chris Duescher,110,M-T,183.7,131.54,183.7,498.95,M,SBD,Single-ply,11,Luxemburg-Cas
Joe Stommel,110,M-T,206.38,102.06,183.7,492.15,M,SBD,Single-ply,12,Horicon
Jameson Oshasky,110,M-T,167.83,122.47,167.83,458.13,M,SBD,Single-ply,13,Assumption
Andrew Gamez,125,M-T,249.48,151.95,249.48,650.91,M,SBD,Single-ply,3,Rhinelander
Andy Schmelzle,125,M-T,276.69,117.93,222.26,616.89,M,SBD,Single-ply,4,Necedah
Jake Greenberg,125,M-T,204.12,122.47,201.85,528.44,M,SBD,Single-ply,5,Superior
Russ Stainbrook,125,M-T,226.8,102.06,183.7,512.56,M,SBD,Single-ply,6,Necedah
Cooper Wage,125,M-T,319.78,174.63,,,M,SBD,Single-ply,DQ,Holmen
Marty Christensen,125,M-T,206.38,115.67,,,M,SBD,Single-ply,DQ,Kimberly
Thomas Walz,125,M-T,249.48,,,,M,SBD,Single-ply,DQ,Homestead
Jake Switalski,125,M-T,267.62,183.7,276.69,728.02,M,SBD,Single-ply,1,Racine Horlic
Nick Ludwig,125,M-T,306.17,170.1,249.48,725.75,M,SBD,Single-ply,2,Man. Lincoln
Chris Anderson #4,125+,M-T,260.82,117.93,226.8,605.55,M,SBD,Single-ply,1,G.E.T.
Cody Van De Wetterin,125+,M-T,258.55,113.4,224.53,596.47,M,SBD,Single-ply,2,AppletonWest
Kyle Bukovich,125+,M-T,224.53,142.88,208.65,576.06,M,SBD,Single-ply,3,Superior
Aj Bach,125+,M-T,199.58,111.13,208.65,519.36,M,SBD,Single-ply,4,Osceola
Josh Hietpas,125+,M-T,217.72,102.06,199.58,519.36,M,SBD,Single-ply,5,Kaukauna
Zach Webber,125+,M-T,,,,,M,SBD,Single-ply,DQ,Necedah
