Division,WeightClassKg,Place,Name,Team,BodyweightKg,Best3SquatKg,Best3BenchKg,Best3DeadliftKg,TotalKg,Equipment,Event,Sex
Boys,51.71,1,Ryan Dean,Waco Midway,51.39,111.13,61.23,122.47,294.84,Single-ply,SBD,M
Boys,51.71,2,Abraham Villarreal,Belton,47.4,102.06,52.16,124.74,278.96,Single-ply,SBD,M
Boys,51.71,3,Mason Dyess,Copperas Cove,44.5,83.91,52.16,102.06,238.14,Single-ply,SBD,M
Boys,51.71,4,Curvon Cunningham,Temple,45.27,79.38,52.16,92.99,224.53,Single-ply,SBD,M
Boys,51.71,DQ,Carmondre Davis,Temple,50.53,,,,,Single-ply,SBD,M
Boys,55.79,1,Isaiah Robinson,Waco Midway,55.29,147.42,90.72,172.37,410.5,Single-ply,SBD,M
Boys,59.87,2,Chris Ramirez,Lampasas,55.84,131.54,72.57,151.95,356.07,Single-ply,SBD,M
Boys,55.79,DQ,Ty Ochoa,Temple,55.79,,,,,Single-ply,SBD,M
Boys,55.79,4,Jason Ayers,Lampasas,53.34,127.01,68.04,147.42,342.46,Single-ply,SBD,M
Boys,55.79,5,Kris Glynn,Waco University,55.34,124.74,65.77,151.95,342.46,Single-ply,SBD,M
Boys,55.79,6,Dominique Dickerson,Copperas Cove,54.52,117.93,77.11,136.08,331.12,Single-ply,SBD,M
Boys,55.79,7,Matt Shillinglaw,Waco Midway,55.25,95.25,58.97,106.59,260.82,Single-ply,SBD,M
Boys,55.79,8,Jahvier Nivar,Killeen Ellison,54.07,90.72,61.23,102.06,254.01,Single-ply,SBD,M
Boys,59.87,9,Joshua Boresma,Belton,55.84,95.25,47.63,104.33,247.21,Single-ply,SBD,M
Boys,55.79,10,Chase Fortenberry,Waco Midway,52.39,86.18,56.7,99.79,242.67,Single-ply,SBD,M
Boys,59.87,1,Clint Lott,Waco Midway,58.15,163.29,77.11,176.9,417.3,Single-ply,SBD,M
Boys,59.87,2,Troy Robinson #1,Waco,57.97,140.61,99.79,138.35,378.75,Single-ply,SBD,M
Boys,59.87,3,Aaron Rodriguez,Waco University,59.51,111.13,74.84,136.08,322.05,Single-ply,SBD,M
Boys,59.87,4,Ryshad Johnson,Temple,56.61,111.13,65.77,142.88,319.78,Single-ply,SBD,M
Boys,59.87,5,Angelo Romo,Waco University,58.88,115.67,72.57,127.01,315.25,Single-ply,SBD,M
Boys,59.87,6,Geryl McAllister,Killeen Ellison,59.42,102.06,88.45,124.74,315.25,Single-ply,SBD,M
Boys,67.13,7,Seth Bradfute,Lampasas,59.92,108.86,65.77,120.2,294.84,Single-ply,SBD,M
Boys,59.87,8,Eric Moore,Copperas Cove,56.88,113.4,65.77,113.4,292.57,Single-ply,SBD,M
Boys,59.87,9,Joseph George,Copperas Cove,56.11,83.91,52.16,90.72,226.8,Single-ply,SBD,M
Boys,67.13,1,Xavier Moffitt,Belton,66.5,170.1,99.79,219.99,489.88,Single-ply,SBD,M
Boys,74.84,2,Treston Womack,Waco Midway,67.27,161.03,104.33,190.51,455.86,Single-ply,SBD,M
Boys,67.13,3,Dedriell Bell,Temple,61.46,147.42,83.91,188.24,419.57,Single-ply,SBD,M
Boys,67.13,4,Cairo Attaway,Waco Midway,63.5,120.2,90.72,167.83,378.75,Single-ply,SBD,M
Boys,67.13,5,Tim Bechtold,Copperas Cove,62.37,136.08,83.91,147.42,367.41,Single-ply,SBD,M
Boys,67.13,6,Gerald Wilburn,Waco,66.09,122.47,81.65,142.88,347,Single-ply,SBD,M
Boys,67.13,7,Craig Morris,Belton,60.24,122.47,72.57,140.61,335.66,Single-ply,SBD,M
Boys,67.13,8,Miquel Anderson,Waco Midway,66.36,99.79,95.25,140.61,335.66,Single-ply,SBD,M
Boys,67.13,9,Danny Tucker,Waco,66.22,113.4,79.38,133.81,326.59,Single-ply,SBD,M
Boys,67.13,10,Bradley Schwartzengraber,Copperas Cove,62.23,124.74,74.84,113.4,312.98,Single-ply,SBD,M
Boys,67.13,11,Aaron Taylor,Copperas Cove,61.42,111.13,81.65,113.4,306.17,Single-ply,SBD,M
Boys,67.13,12,Elias Smith,Belton,63.14,106.59,65.77,131.54,303.91,Single-ply,SBD,M
Boys,67.13,13,Joseph Icmat-Godwin,Killeen Ellison,60.83,102.06,83.91,,185.97,Single-ply,SB,M
Boys,67.13,DQ,Will Smith #4,Lampasas,65.45,147.42,,,,Single-ply,SB,M
Boys,74.84,1,Case D'Herde,Waco Midway,74.75,181.44,117.93,233.6,532.97,Single-ply,SBD,M
Boys,74.84,DQ,Brandon Julian,Belton,74.25,,,,,Single-ply,SBD,M
Boys,74.84,3,Harrell Henderson,Waco Midway,72.48,188.24,97.52,181.44,467.2,Single-ply,SBD,M
Boys,82.1,4,Stephen Snyder,Belton,74.89,149.69,95.25,195.04,439.98,Single-ply,SBD,M
Boys,74.84,5,Knijan Bell-Williams,Lampasas,69.54,158.76,102.06,172.37,433.18,Single-ply,SBD,M
Boys,74.84,6,Dominique Johnson-Nealy,Temple,73.3,170.1,102.06,156.49,428.64,Single-ply,SBD,M
Boys,74.84,7,Issac Collins,Temple,68.54,161.03,97.52,167.83,426.38,Single-ply,SBD,M
Boys,74.84,8,Kavan Johnson,Belton,74.71,149.69,90.72,181.44,421.84,Single-ply,SBD,M
Boys,74.84,9,Elijah Jordan,Copperas Cove,71.53,147.42,83.91,165.56,396.89,Single-ply,SBD,M
Boys,74.84,10,Austin Youngblood,Belton,73.03,145.15,88.45,163.29,396.89,Single-ply,SBD,M
Boys,74.84,11,Ezekiel Jordan,Copperas Cove,70.44,147.42,77.11,165.56,390.09,Single-ply,SBD,M
Boys,74.84,12,Elijah Shipley,Copperas Cove,73.94,165.56,63.5,154.22,383.29,Single-ply,SBD,M
Boys,74.84,13,Hunter Berget,Lampasas,74.66,136.08,79.38,165.56,381.02,Single-ply,SBD,M
Boys,74.84,14,Ricky Martin,Belton,68.72,138.35,77.11,158.76,374.21,Single-ply,SBD,M
Boys,74.84,15,Todd Phillips,Lampasas,71.99,136.08,72.57,151.95,360.61,Single-ply,SBD,M
Boys,74.84,16,Yasir Toupo-Smith,Copperas Cove,68.67,127.01,81.65,131.54,340.19,Single-ply,SBD,M
Boys,74.84,17,Anthony Pierno,Lampasas,69.4,113.4,70.31,151.95,335.66,Single-ply,SBD,M
Boys,74.84,18,Edward Jacquez,Waco University,71.26,108.86,86.18,136.08,331.12,Single-ply,SBD,M
Boys,82.1,1,Korey Chatman,Waco Midway,80.15,199.58,122.47,226.8,548.85,Single-ply,SBD,M
Boys,82.1,2,Cody Jandreau,Lampasas,82.1,192.78,149.69,199.58,542.04,Single-ply,SBD,M
Boys,82.1,3,Ryan Johnson #16,Belton,81.74,170.1,108.86,192.78,471.74,Single-ply,SBD,M
Boys,82.1,4,Keith Buhl,Temple,79.88,183.7,92.99,192.78,469.47,Single-ply,SBD,M
Boys,82.1,5,Anthony Clark #2,Copperas Cove,81.06,183.7,102.06,181.44,467.2,Single-ply,SBD,M
Boys,82.1,6,Steven Jazdyk,Lampasas,80.51,167.83,95.25,199.58,462.66,Single-ply,SBD,M
Boys,82.1,7,Luis Sanchez,Killeen Ellison,80.29,163.29,111.13,174.63,449.06,Single-ply,SBD,M
Boys,82.1,8,Hunter Wilkinson,Lampasas,76.48,165.56,97.52,181.44,444.52,Single-ply,SBD,M
Boys,82.1,9,Chris Terry,Temple,78.65,165.56,83.91,192.78,442.25,Single-ply,SBD,M
Boys,82.1,10,Jesse Uvalle,Lampasas,80.2,149.69,104.33,176.9,430.91,Single-ply,SBD,M
Boys,82.1,11,Trent Canion,Copperas Cove,77.16,158.76,83.91,181.44,424.11,Single-ply,SBD,M
Boys,82.1,12,Jeffrey Morva,Waco University,77.88,142.88,92.99,165.56,401.43,Single-ply,SBD,M
Boys,82.1,13,Philip Baptiste,Copperas Cove,78.34,163.29,83.91,147.42,394.63,Single-ply,SBD,M
Boys,82.1,14,D'Mani Peapea,Copperas Cove,76.75,142.88,90.72,158.76,392.36,Single-ply,SBD,M
Boys,82.1,15,Austin Wagner,Belton,76.7,129.27,90.72,158.76,378.75,Single-ply,SBD,M
Boys,82.1,16,Dmitri Marcus,Copperas Cove,76.79,124.74,79.38,154.22,358.34,Single-ply,SBD,M
Boys,82.1,DQ,Evan Mock,Waco Midway,80.92,149.69,90.72,,,Single-ply,SBD,M
Boys,89.81,1,Michael Hicks,Temple,85.77,215.46,131.54,235.87,582.87,Single-ply,SBD,M
Boys,99.79,2,Roderick Harris,Waco,89.99,213.19,108.86,192.78,514.83,Single-ply,SBD,M
Boys,89.81,3,Floyd Shook,Waco Midway,84.78,181.44,131.54,192.78,505.76,Single-ply,SBD,M
Boys,89.81,4,D'Artagnan Seay,Temple,88.68,174.63,127.01,204.12,505.76,Single-ply,SBD,M
Boys,89.81,5,Fabian Trujillo,Killeen Ellison,84.19,147.42,115.67,179.17,442.25,Single-ply,SBD,M
Boys,89.81,6,Topher McGehee,Lampasas,89.22,158.76,102.06,176.9,437.72,Single-ply,SBD,M
Boys,89.81,7,John Edwards,Belton,88.04,151.95,120.2,154.22,426.38,Single-ply,SBD,M
Boys,89.81,8,Reagan Francis,Belton,89.27,161.03,92.99,170.1,424.11,Single-ply,SBD,M
Boys,89.81,9,Tyler Hawkins,Copperas Cove,84.96,154.22,92.99,172.37,419.57,Single-ply,SBD,M
Boys,89.81,10,Lavar Fogle,Belton,87.36,172.37,72.57,165.56,410.5,Single-ply,SBD,M
Boys,89.81,11,Daniel Ables,Copperas Cove,89.31,147.42,77.11,147.42,371.95,Single-ply,SBD,M
Boys,89.81,12,Oscar Paloblanco,Waco University,89.77,147.42,68.04,136.08,351.53,Single-ply,SBD,M
Boys,99.79,DQ,Josh Turner #6,Waco Midway,90.04,147.42,,,,Single-ply,SBD,M
Boys,89.81,DQ,Brent Drumand,Belton,85.64,,104.33,161.03,,Single-ply,SBD,M
Boys,99.79,1,Xavier Bryant,Temple,99.52,249.48,147.42,219.99,616.89,Single-ply,SBD,M
Boys,99.79,2,Brent Marona,Copperas Cove,97.07,244.94,117.93,219.99,582.87,Single-ply,SBD,M
Boys,99.79,3,David Lopez,Temple,98.11,215.46,136.08,222.26,573.79,Single-ply,SBD,M
Boys,99.79,4,Gab Perez,Copperas Cove,95.57,219.99,111.13,210.92,542.04,Single-ply,SBD,M
Boys,99.79,5,Dominick Thompson,Temple,93.76,204.12,122.47,199.58,526.17,Single-ply,SBD,M
Boys,99.79,6,Jaylen Waters,Copperas Cove,99.06,183.7,120.2,217.72,521.63,Single-ply,SBD,M
Boys,99.79,7,Derrick Moore,Waco,99.16,195.04,115.67,199.58,510.29,Single-ply,SBD,M
Boys,99.79,8,Brandon Smith,Killeen Ellison,94.57,163.29,142.88,199.58,505.76,Single-ply,SBD,M
Boys,99.79,9,Jon Ladner,Waco Midway,96.62,197.31,129.27,170.1,496.68,Single-ply,SBD,M
Boys,99.79,10,Chase Mims,Waco Midway,96.12,181.44,122.47,190.51,494.42,Single-ply,SBD,M
Boys,99.79,11,Deshaun Sellers,Temple,92.35,183.7,111.13,174.63,469.47,Single-ply,SBD,M
Boys,99.79,12,Brandon Jackson #11,Waco,93.71,163.29,108.86,197.31,469.47,Single-ply,SBD,M
Boys,109.77,13,Sebastian Rodriguez,Killeen Ellison,99.88,158.76,124.74,167.83,451.32,Single-ply,SBD,M
Boys,99.79,14,Robert Price #1,Belton,92.12,149.69,106.59,172.37,428.64,Single-ply,SBD,M
Boys,99.79,15,Shakanah Herrera,Copperas Cove,95.16,133.81,113.4,181.44,428.64,Single-ply,SBD,M
Boys,99.79,16,Kehoness James,Copperas Cove,96.71,142.88,95.25,151.95,390.09,Single-ply,SBD,M
Boys,99.79,17,John Fuselier,Copperas Cove,94.76,122.47,68.04,142.88,333.39,Single-ply,SBD,M
Boys,99.79,18,Grant Dorsey,Lampasas,97.34,108.86,61.23,124.74,294.84,Single-ply,SBD,M
Boys,99.79,DQ,Malcolm Zeigler,Copperas Cove,92.62,151.95,,,,Single-ply,SBD,M
Boys,109.77,DQ,Demarkes Mathis,Temple,104.37,,,,,Single-ply,SBD,M
Boys,109.77,2,James Judie,Temple,104.51,226.8,115.67,226.8,569.26,Single-ply,SBD,M
Boys,109.77,3,David Cockrell,Lampasas,108.68,219.99,154.22,195.04,569.26,Single-ply,SBD,M
Boys,109.77,4,OC Beasley,Waco,103.06,163.29,115.67,197.31,476.27,Single-ply,SBD,M
Boys,109.77,5,David Castillo,Copperas Cove,102.51,161.03,111.13,181.44,453.59,Single-ply,SBD,M
Boys,124.74,6,Josh Deland,Copperas Cove,110,154.22,113.4,151.95,419.57,Single-ply,SBD,M
Boys,109.77,7,Tavon Uresti,Killeen Ellison,106.87,136.08,108.86,172.37,417.3,Single-ply,SBD,M
Boys,109.77,8,Robert Gonzales,Waco University,100.97,142.88,95.25,167.83,405.97,Single-ply,SBD,M
Boys,109.77,9,Jonathon Gardner,Waco University,102.92,149.69,86.18,163.29,399.16,Single-ply,SBD,M
Boys,109.77,10,Isaiah Jackson,Copperas Cove,103.33,122.47,95.25,176.9,394.63,Single-ply,SBD,M
Boys,109.77,DQ,Colton Parker,Belton,101.56,136.08,,156.49,,Single-ply,SBD,M
Boys,124.74,1,Tanner Morgan,Temple,119.84,249.48,138.35,226.8,614.62,Single-ply,SBD,M
Boys,124.74,2,Donshay Johson,Temple,118.89,254.01,136.08,201.85,591.94,Single-ply,SBD,M
Boys,124.74,3,Brandon Sullivan,Belton,118.43,226.8,136.08,226.8,589.67,Single-ply,SBD,M
Boys,124.74,4,Andy Mills,Waco Midway,112.81,235.87,127.01,206.38,569.26,Single-ply,SBD,M
Boys,124.74,5,Darius Joiner,Temple,114.31,219.99,142.88,206.38,569.26,Single-ply,SBD,M
Boys,124.74,6,Camryn Dotson,Waco Midway,116.89,204.12,122.47,222.26,548.85,Single-ply,SBD,M
Boys,124.74,7,Thomas Turner,Waco University,123.69,226.8,127.01,188.24,542.04,Single-ply,SBD,M
Boys,124.74,7,Jp Urquidez,Copperas Cove,122.47,138.35,104.33,156.49,399.16,Single-ply,SBD,M
Boys,124.74,8,Jimmy Ayala,Waco Midway,110.5,192.78,124.74,190.51,508.02,Single-ply,SBD,M
Boys,124.74,9,Mj Morris,Waco Midway,115.26,204.12,113.4,188.24,505.76,Single-ply,SBD,M
Boys,124.74,10,Justin Murphy,Belton,114.44,174.63,122.47,195.04,492.15,Single-ply,SBD,M
Boys,124.74,11,Jaquill Harden,Waco,120.79,163.29,102.06,176.9,442.25,Single-ply,SBD,M
Boys,124.74,12,Joseph Gonzales,Waco,120.93,156.49,95.25,172.37,424.11,Single-ply,SBD,M
Boys,124.74,13,Kornelis Chris,Copperas Cove,113.35,127.01,92.99,158.76,378.75,Single-ply,SBD,M
Boys,124.74,DQ,Colby Priest,Belton,120.38,151.95,,204.12,,Single-ply,SBD,M
Boys,124.74+,1,Ben Hughes,Waco University,147.42,285.76,185.97,308.44,780.18,Single-ply,SBD,M
Boys,124.74+,2,Davonte Moore,Temple,142.34,317.51,172.37,260.82,750.7,Single-ply,SBD,M
Boys,124.74+,3,Freddie Johnson,Temple,149.14,260.82,145.15,249.48,655.44,Single-ply,SBD,M
Boys,124.74+,4,Rodarius Burks,Belton,126.42,272.16,124.74,217.72,614.62,Single-ply,SBD,M
Boys,124.74+,5,Jake Dibble,Lampasas,145.38,217.72,136.08,213.19,566.99,Single-ply,SBD,M
Boys,124.74+,6,Jabriel Harden,Waco,129.95,147.42,102.06,167.83,417.3,Single-ply,SBD,M
Boys,124.74+,DQ,Dalton Hays,Waco Midway,134.99,215.46,115.67,,,Single-ply,SBD,M
Boys,124.74+,DQ,Kaleb Courtney,Copperas Cove,133.49,,,,,Single-ply,SBD,M
Boys,,NS,Nigel Deas,Killeen Ellison,,,,,,Single-ply,SBD,M
Boys,,NS,Weston McIntire,Lampasas,,,,,,Single-ply,SBD,M
Boys,,NS,Andrew Gonzales #4,Waco University,,,,,,Single-ply,SBD,M
Boys,,NS,Travion Freeman,Waco,,,,,,Single-ply,SBD,M
