Division,WeightClassKg,Place,Name,Team,BodyweightKg,Best3SquatKg,Best3BenchKg,Best3DeadliftKg,TotalKg,Equipment,Event,Sex,BirthDate
Boys,55.79,1,Amari Crowder,Mansfield Timberview,54.88,183.7,79.38,174.63,437.72,Single-ply,SBD,M,
Boys,55.79,DQ,John Doan,Mansfield Timberview,53.98,142.88,,,,Single-ply,SBD,M,
Boys,59.87,1,Kamryn Childress,Mansfield Legacy,58.29,113.4,68.04,113.4,294.84,Single-ply,SBD,M,
Boys,67.13,1,Dan Dang,Mansfield Timberview,63.96,183.7,108.86,206.38,498.95,Single-ply,SBD,M,
Boys,67.13,2,Ryan Le,Mansfield Timberview,65.32,154.22,97.52,165.56,417.3,Single-ply,SBD,M,
Boys,67.13,3,Johntae Teat,Mansfield Summit,61.01,136.08,77.11,142.88,356.07,Single-ply,SBD,M,
Boys,67.13,4,Kedric McKnight,Cedar Hill,61.92,122.47,65.77,142.88,331.12,Single-ply,SBD,M,
Boys,74.84,1,Vinh Ho,Mansfield Timberview,72.12,183.7,97.52,201.85,483.08,Single-ply,SBD,M,
Boys,74.84,2,Carson Starnes,Mansfield,73.94,156.49,92.99,188.24,437.72,Single-ply,SBD,M,
Boys,74.84,3,Cathal Erangey,Mansfield,70.76,142.88,106.59,185.97,435.45,Single-ply,SBD,M,
Boys,74.84,4,Zechariah Ebron,Cedar Hill,72.8,149.69,88.45,174.63,412.77,Single-ply,SBD,M,
Boys,74.84,5,Andre Castro,Mansfield Lake Ridge,72.57,149.69,90.72,163.29,403.7,Single-ply,SBD,M,
Boys,74.84,6,Mark Hamilton,Mansfield Summit,74.62,161.03,83.91,142.88,387.82,Single-ply,SBD,M,
Boys,74.84,7,Maxmillian Castillo,Mansfield,71.89,127.01,70.31,136.08,333.39,Single-ply,SBD,M,
Boys,74.84,DQ,Kemondre Haynes,Cedar Hill,71.44,151.95,,,,Single-ply,SBD,M,
Boys,82.1,1,Torin Sheehy,Mansfield Lake Ridge,81.65,195.04,136.08,204.12,535.24,Single-ply,SBD,M,
Boys,82.1,2,Isaiah Hall,Mansfield Summit,76.66,185.97,131.54,185.97,503.49,Single-ply,SBD,M,
Boys,82.1,3,Justin Tran,Mansfield Timberview,75.07,181.44,92.99,174.63,449.06,Single-ply,SBD,M,
Boys,82.1,4,Faisal Khan,Mansfield Summit,80.51,165.56,83.91,183.7,433.18,Single-ply,SBD,M,
Boys,82.1,5,Shaun Ukeje,Mansfield Legacy,82.1,174.63,86.18,151.95,412.77,Single-ply,SBD,M,
Boys,82.1,6,Jaden Brown #5,Cedar Hill,78.24,174.63,88.45,142.88,405.97,Single-ply,SBD,M,
Boys,82.1,7,Ryan Allen #6,Mansfield Lake Ridge,76.66,154.22,83.91,158.76,396.89,Single-ply,SBD,M,
Boys,82.1,8,Brandon Barnes,Cedar Hill,79.61,147.42,79.38,158.76,385.55,Single-ply,SBD,M,
Boys,82.1,9,Rocco Agostino,Mansfield,81.87,129.27,79.38,176.9,385.55,Single-ply,SBD,M,
Boys,82.1,10,Isaac Vela,Mansfield Summit,80.97,142.88,81.65,145.15,369.68,Single-ply,SBD,M,
Boys,82.1,11,Everett Pinon,Mansfield,77.79,174.63,97.52,,272.16,Single-ply,SB,M,
Boys,82.1,12,Preston Reed,Mansfield Timberview,75.3,163.29,83.91,,247.21,Single-ply,SB,M,
Boys,82.1,DQ,Vincent Young,Mansfield Timberview,81.65,226.8,149.69,,,Single-ply,SBD,M,
Boys,89.81,1,Corey Thompson,Mansfield Lake Ridge,85.05,210.92,136.08,240.4,587.4,Single-ply,SBD,M,
Boys,89.81,2,Austin Carlson,Mansfield Legacy,88,217.72,129.27,240.4,587.4,Single-ply,SBD,M,
Boys,89.81,3,Max Colon,Mansfield Legacy,89.36,197.31,113.4,226.8,537.51,Single-ply,SBD,M,
Boys,89.81,4,Myles Malonado,Mansfield Legacy,87.54,183.7,115.67,233.6,532.97,Single-ply,SBD,M,
Boys,89.81,5,Brad Couldron,Mansfield,88.45,188.24,106.59,217.72,512.56,Single-ply,SBD,M,
Boys,89.81,6,Gabe Zumwalt,Mansfield,89.81,204.12,97.52,206.38,508.02,Single-ply,SBD,M,
Boys,89.81,7,Christian Haley,Mansfield Lake Ridge,88.68,183.7,113.4,192.78,489.88,Single-ply,SBD,M,
Boys,89.81,8,Noah Barton,Mansfield,88.45,163.29,88.45,206.38,458.13,Single-ply,SBD,M,
Boys,99.79,1,Brandon Ford,Mansfield Legacy,92.53,247.21,120.2,208.65,576.06,Single-ply,SBD,M,
Boys,99.79,2,Zion Lewis #3,Cedar Hill,92.53,181.44,102.06,181.44,464.93,Single-ply,SBD,M,
Boys,99.79,3,Gabriel Batac,Mansfield,98.43,172.37,108.86,183.7,464.93,Single-ply,SBD,M,
Boys,99.79,4,Christian Jones,Mansfield Summit,92.53,156.49,97.52,158.76,412.77,Single-ply,SBD,M,
Boys,109.77,1,Casey Griffin,Mansfield Legacy,102.97,229.06,113.4,229.06,571.53,Single-ply,SBD,M,
Boys,109.77,2,Cayman Woolridge,Mansfield Lake Ridge,103.87,233.6,108.86,158.76,501.22,Single-ply,SBD,M,
Boys,109.77,3,Anthony Romero,Cedar Hill,109.09,226.8,90.72,163.29,480.81,Single-ply,SBD,M,
Boys,109.77,4,Travis Buhake,Mansfield Summit,100.24,192.78,102.06,183.7,478.54,Single-ply,SBD,M,
Boys,109.77,5,Grant Petry,Cedar Hill,102.29,170.1,92.99,174.63,437.72,Single-ply,SBD,M,
Boys,109.77,DQ,William Billings,Mansfield Summit,104.78,,,,,Single-ply,SBD,M,
Boys,124.74,1,Hoyt Huddleston,Mansfield Legacy,117.71,215.46,142.88,240.4,598.74,Single-ply,SBD,M,
Boys,124.74,2,Legend Journey,Mansfield Summit,114.76,215.46,133.81,233.6,582.87,Single-ply,SBD,M,
Boys,124.74,3,Johnson Mason,Cedar Hill,121.34,226.8,115.67,181.44,523.9,Single-ply,SBD,M,
Boys,124.74,4,Jonah Pedroza,Mansfield Legacy,110,195.04,115.67,210.92,521.63,Single-ply,SBD,M,
Boys,124.74,5,Greg Bridges,Mansfield Lake Ridge,118.16,172.37,111.13,215.46,498.95,Single-ply,SBD,M,
Boys,124.74,6,Daren Walker,Mansfield Timberview,119.52,183.7,111.13,183.7,478.54,Single-ply,SBD,M,
Boys,124.74,DQ,Isaiah Coleman,Cedar Hill,118.39,156.49,,,,Single-ply,SBD,M,
Boys,139.71,1,Tatum Feigle,Mansfield Lake Ridge,132.9,251.74,127.01,226.8,605.55,Single-ply,SBD,M,
Boys,139.71,2,Zach McKinley,Mansfield Legacy,129.05,229.06,145.15,235.87,610.08,Single-ply,SBD,M,
Boys,139.71,3,Joey Glendenning,Mansfield Lake Ridge,129.05,197.31,129.27,183.7,510.29,Single-ply,SBD,M,
Boys,139.71,4,Oluwafela Oladeinde,Mansfield Legacy,131.09,185.97,120.2,201.85,508.02,Single-ply,SBD,M,
Boys,139.71,5,Paul Nguyen #6,Mansfield Timberview,130.63,192.78,113.4,183.7,489.88,Single-ply,SBD,M,
Boys,139.71,6,Isaiah Villareal,Mansfield Lake Ridge,127.46,183.7,92.99,181.44,458.13,Single-ply,SBD,M,
Boys,139.71+,1,Biola Oyelade,Mansfield Summit,141.07,263.08,142.88,263.08,669.05,Single-ply,SBD,M,
Boys,139.71+,2,Bami Badusi,Mansfield Timberview,140.61,226.8,145.15,190.51,562.45,Single-ply,SBD,M,
Boys,139.71+,DQ,Devon Jolly,Mansfield Timberview,147.19,204.12,129.27,,,Single-ply,SBD,M,
Boys,,NS,Lance Boseman,Mansfield Lake Ridge,,,,,,Single-ply,SBD,M,
Boys,,NS,Jau'vaughn Warren,Mansfield Lake Ridge,,,,,,Single-ply,SBD,M,
Boys,,NS,Trysten Lester,Cedar Hill,,,,,,Single-ply,SBD,M,
