Division,WeightClassKg,Place,Name,Team,BodyweightKg,Best3SquatKg,Best3BenchKg,Best3DeadliftKg,TotalKg,Equipment,Event,Sex
Boys,51.71,1,Corden Moore,Ponder,43.45,65.77,40.82,95.25,201.85,Single-ply,SBD,M
Boys,51.71,2,Michael Ellis,Nocona,47.08,68.04,43.09,90.72,201.85,Single-ply,SBD,M
Boys,55.79,1,Justin Christensen,Alvord,54.61,136.08,79.38,138.35,353.8,Single-ply,SBD,M
Boys,55.79,2,Daniel Perez,Olney,55.07,120.2,61.23,133.81,315.25,Single-ply,SBD,M
Boys,55.79,3,Rogelio Arce,Olney,55.52,113.4,72.57,129.27,315.25,Single-ply,SBD,M
Boys,55.79,4,Jake Morris,Bowie,54.16,111.13,68.04,133.81,312.98,Single-ply,SBD,M
Boys,55.79,5,Sayler Fenoglio,Nocona,55.25,81.65,63.5,99.79,244.94,Single-ply,SBD,M
Boys,55.79,DQ,Rylee Miller,Paradise,55.79,,,,,Single-ply,SBD,M
Boys,59.87,1,Justin Wilson #3,Bowie,56.06,147.42,86.18,172.37,405.97,Single-ply,SBD,M
Boys,59.87,2,Juan Mares,Bowie,57.52,161.03,92.99,149.69,403.7,Single-ply,SBD,M
Boys,59.87,3,Dalton Davis #1,Bowie,59.42,102.06,61.23,122.47,285.76,Single-ply,SBD,M
Boys,67.13,1,Wyat Burrows,Olney,66.04,190.51,95.25,226.8,512.56,Single-ply,SBD,M
Boys,67.13,2,Billy Brown,Bowie,66.86,181.44,106.59,174.63,462.66,Single-ply,SBD,M
Boys,67.13,3,Jay Rogers,Bowie,62.51,165.56,95.25,170.1,430.91,Single-ply,SBD,M
Boys,67.13,4,Allen Gaught,Boyd,64.95,149.69,79.38,154.22,383.29,Single-ply,SBD,M
Boys,67.13,5,Joey Crawford,Bowie,67.04,140.61,63.5,172.37,376.48,Single-ply,SBD,M
Boys,67.13,6,Wyatt Reeves,Paradise,61.33,136.08,90.72,145.15,371.95,Single-ply,SBD,M
Boys,67.13,7,Corbin Cohoon,Alvord,61.42,138.35,102.06,131.54,371.95,Single-ply,SBD,M
Boys,67.13,8,Cody Putnam,Alvord,66.59,136.08,81.65,145.15,362.87,Single-ply,SBD,M
Boys,67.13,9,Tyler Richards,Nocona,63.23,129.27,77.11,140.61,347,Single-ply,SBD,M
Boys,67.13,10,Taylor Donnelly,Jacksboro,63.41,108.86,61.23,131.54,301.64,Single-ply,SBD,M
Boys,74.84,1,Chance Tomlinson,Bowie,72.76,199.58,122.47,210.92,532.97,Single-ply,SBD,M
Boys,74.84,2,Albert Navarrete,Ponder,72.3,181.44,86.18,192.78,460.4,Single-ply,SBD,M
Boys,74.84,3,Matt Oldham,Boyd,74.21,158.76,92.99,165.56,417.3,Single-ply,SBD,M
Boys,74.84,4,Devan Flores,Olney,72.48,138.35,102.06,154.22,394.63,Single-ply,SBD,M
Boys,74.84,5,Ethan Fudge #2,Jacksboro,70.03,147.42,90.72,149.69,387.82,Single-ply,SBD,M
Boys,74.84,6,Luis Rico,Nocona,71.85,131.54,79.38,170.1,381.02,Single-ply,SBD,M
Boys,74.84,7,Jacob Robinson,Paradise,74.75,140.61,88.45,142.88,371.95,Single-ply,SBD,M
Boys,74.84,8,Aj Craddock,Bowie,68.22,133.81,77.11,154.22,365.14,Single-ply,SBD,M
Boys,74.84,9,Wyatt Walker,Boyd,67.95,133.81,79.38,127.01,340.19,Single-ply,SBD,M
Boys,74.84,10,Justin Jackson #2,Bowie,69.13,129.27,63.5,140.61,333.39,Single-ply,SBD,M
Boys,74.84,11,Nate Antczak,Ponder,69.94,108.86,63.5,111.13,283.5,Single-ply,SBD,M
Boys,74.84,DQ,Garrett Fontenot,Paradise,69.04,138.35,81.65,138.35,,Single-ply,SBD,M
Boys,74.84,DQ,Grant Caddell,Paradise,68.49,113.4,,,,Single-ply,SBD,M
Boys,82.1,1,Zackary Otto,Bowie,82.1,210.92,117.93,195.04,523.9,Single-ply,SBD,M
Boys,82.1,2,Josh Wells #2,Jacksboro,75.89,190.51,122.47,208.65,521.63,Single-ply,SBD,M
Boys,82.1,3,Lane Upton,Paradise,80.29,170.1,115.67,188.24,474,Single-ply,SBD,M
Boys,82.1,4,Cody Howard,Jacksboro,82.01,151.95,90.72,165.56,408.23,Single-ply,SBD,M
Boys,82.1,5,Brodie Fitzgerald,Chico,75.02,149.69,79.38,163.29,392.36,Single-ply,SBD,M
Boys,82.1,6,Colby Cox,Paradise,79.47,147.42,79.38,154.22,381.02,Single-ply,SBD,M
Boys,82.1,7,Daniel Lacey,Boyd,75.66,140.61,68.04,158.76,367.41,Single-ply,SBD,M
Boys,89.81,1,Bridger Skogberg,Paradise,87.72,204.12,115.67,192.78,512.56,Single-ply,SBD,M
Boys,89.81,2,Brian Hernandez,Olney,83.19,204.12,117.93,188.24,510.29,Single-ply,SBD,M
Boys,89.81,3,Erik Delao,Bowie,87.18,208.65,113.4,188.24,510.29,Single-ply,SBD,M
Boys,89.81,4,James Brock,Jacksboro,85.28,158.76,113.4,192.78,464.93,Single-ply,SBD,M
Boys,89.81,5,Nick Rhodes,Paradise,85.64,147.42,92.99,145.15,385.55,Single-ply,SBD,M
Boys,89.81,6,Noah Rogers,Paradise,86.27,136.08,83.91,127.01,347,Single-ply,SBD,M
Boys,89.81,7,Gage Barclay,Alvord,86.82,129.27,61.23,122.47,312.98,Single-ply,SBD,M
Boys,89.81,8,Cole Rodgers,Olney,89.81,92.99,70.31,117.93,281.23,Single-ply,SBD,M
Boys,89.81,DQ,Kaleb Evans,Paradise,84.19,188.24,,,,Single-ply,SBD,M
Boys,89.81,DQ,Hunter Cearley,Boyd,87.27,,,,,Single-ply,SBD,M
Boys,99.79,1,Tristan Dennison,Bowie,97.98,263.08,145.15,244.94,653.17,Single-ply,SBD,M
Boys,99.79,2,Raymond Carrasco,Olney,97.89,247.21,129.27,215.46,591.94,Single-ply,SBD,M
Boys,99.79,3,Cruz Montes,Boyd,99.79,226.8,142.88,183.7,553.38,Single-ply,SBD,M
Boys,99.79,4,Brendan Shafer,Ponder,92.53,145.15,95.25,136.08,376.48,Single-ply,SBD,M
Boys,99.79,DQ,Caelen Green,Paradise,97.34,142.88,,,,Single-ply,SBD,M
Boys,109.77,1,Alex Silva,Boyd,106.41,217.72,108.86,204.12,530.7,Single-ply,SBD,M
Boys,109.77,2,Jacob Landry,Boyd,106.23,181.44,102.06,158.76,442.25,Single-ply,SBD,M
Boys,109.77,3,Will Jones,Chico,104.87,104.33,68.04,117.93,290.3,Single-ply,SBD,M
Boys,124.74,1,Cody Holaway,Paradise,111.22,254.01,133.81,238.14,625.96,Single-ply,SBD,M
Boys,124.74,2,Jared Richardson,Paradise,110.45,188.24,124.74,233.6,546.58,Single-ply,SBD,M
Boys,124.74,3,Fletcher Six,Nocona,111.67,181.44,102.06,204.12,487.61,Single-ply,SBD,M
Boys,124.74,4,KC Rater,Jacksboro,116.94,167.83,102.06,161.03,430.91,Single-ply,SBD,M
Boys,124.74,5,Deuce Glasker,Nocona,111.86,158.76,104.33,147.42,410.5,Single-ply,SBD,M
Boys,124.74,6,Mason Damron,Jacksboro,112.76,136.08,74.84,133.81,344.73,Single-ply,SBD,M
Boys,124.74+,1,Tyler Wagner,Ponder,144.33,251.74,127.01,210.92,589.67,Single-ply,SBD,M
Boys,124.74+,2,Tyler Yeck,Ponder,155.76,226.8,92.99,226.8,546.58,Single-ply,SBD,M
Boys,124.74+,3,Brady York,Nocona,126.37,158.76,99.79,165.56,424.11,Single-ply,SBD,M
