<?xml version="1.0" encoding="UTF-8" standalone="no"?>
<svg
   viewBox="0 0 380 380"
   version="1.1"
   id="svg1670"
   sodipodi:docname="twitter-logo-white.svg"
   inkscape:version="1.2.2 (b0a8486541, 2022-12-01)"
   xml:space="preserve"
   xmlns:inkscape="http://www.inkscape.org/namespaces/inkscape"
   xmlns:sodipodi="http://sodipodi.sourceforge.net/DTD/sodipodi-0.dtd"
   xmlns="http://www.w3.org/2000/svg"
   xmlns:svg="http://www.w3.org/2000/svg"><sodipodi:namedview
     id="namedview1672"
     pagecolor="#8b8b8b"
     bordercolor="#666666"
     borderopacity="1.0"
     inkscape:showpageshadow="2"
     inkscape:pageopacity="0"
     inkscape:pagecheckerboard="0"
     inkscape:deskcolor="#d1d1d1"
     showgrid="false"
     inkscape:zoom="1.6424753"
     inkscape:cx="174.12743"
     inkscape:cy="217.35487"
     inkscape:window-width="1916"
     inkscape:window-height="1035"
     inkscape:window-x="0"
     inkscape:window-y="18"
     inkscape:window-maximized="1"
     inkscape:current-layer="svg1670" /><defs
     id="defs1665"><style
       id="style1663">.cls-1{fill:#fff;}</style></defs><path
     style="fill:#000000;stroke-width:0.512213"
     id="path280"
     d="" /><path
     style="fill:#ffffff;stroke-width:0.512213;fill-opacity:1"
     d="m 136.70267,297.13406 c -20.31146,-1.99073 -33.69184,-5.05751 -50.338089,-11.5375 -6.550375,-2.5499 -21.996204,-10.0884 -24.8849,-12.14533 -3.236775,-2.30479 -3.185342,-7.3034 0.09568,-9.2987 1.460473,-0.88817 2.332803,-0.94584 10.063407,-0.66528 13.249619,0.48086 24.177612,-1.01761 35.914722,-4.92471 5.99744,-1.99646 17.36827,-7.0352 17.36827,-7.69637 0,-0.197 -1.78634,-0.87166 -3.96965,-1.49925 -15.29045,-4.39522 -29.753155,-16.45211 -37.054616,-30.89074 -2.931472,-5.79699 -2.527915,-8.80571 1.401307,-10.44745 1.50447,-0.62861 2.17387,-0.62149 5.086976,0.0541 5.537177,1.28416 5.763578,1.004 1.495527,-1.85065 -4.613227,-3.08552 -11.372542,-9.67994 -14.680257,-14.32214 -6.110116,-8.57522 -10.139897,-19.70645 -10.923322,-30.17287 -0.288393,-3.85286 -0.20423,-4.54682 0.731465,-6.03128 1.907982,-3.02695 5.385904,-3.51058 8.584272,-1.19369 2.826351,2.04739 5.510681,3.41094 4.979288,2.52931 -0.226275,-0.37542 -1.209211,-1.93724 -2.184301,-3.4707 -10.594772,-16.66179 -11.698778,-38.04303 -2.865787,-55.501631 2.315702,-4.57704 3.501087,-5.88826 5.695307,-6.2999 2.665314,-0.50001 4.512673,0.61155 8.069971,4.85571 4.151396,4.952981 14.19547,14.774681 19.4187,18.988781 13.27821,10.71286 32.08333,20.22144 48.99677,24.77465 6.24957,1.68242 14.56458,3.26311 19.51364,3.70956 l 3.89113,0.35101 0.31744,-7.10647 c 0.70176,-15.71044 6.47602,-28.54002 17.63252,-39.176941 7.72419,-7.36447 16.38214,-11.99084 27.44656,-14.66606 5.71254,-1.38121 19.11701,-1.23718 25.10898,0.2698 8.74241,2.19871 17.12259,6.38802 23.63331,11.81445 1.40342,1.1697 2.82548,2.12673 3.16013,2.12673 1.84334,0 15.75142,-5.15964 22.28211,-8.26625 7.18383,-3.4173 7.66881,-3.57301 9.37506,-3.0099 2.48242,0.81927 3.86636,2.73165 3.85482,5.32672 -0.0121,2.71726 -2.75151,9.361361 -5.80769,14.085731 -1.30809,2.0221 -2.37835,3.77882 -2.37835,3.9038 0,0.12499 1.85969,-0.45843 4.13265,-1.2965 2.27296,-0.83807 4.89257,-1.52376 5.82138,-1.52376 3.59914,0 6.36133,4.39473 4.76872,7.58718 -2.51878,5.04902 -14.20724,18.03348 -21.0787,23.41588 l -3.88832,3.04572 -0.002,8.71433 c -0.003,15.37869 -2.12652,27.78884 -7.36583,43.03772 -18.04686,52.52527 -63.94594,92.83763 -116.58827,102.3975 -10.8257,1.96596 -26.20079,2.85118 -34.8305,2.00538 z"
     id="path336" /></svg>
