{
    "/js/admin/admin.js": "/js/admin/admin.js?id=503d147ae372a172bd88",
    "/css/client/client.css": "/css/client/client.css?id=ab9c6ddc4bf45c491495",
    "/js/admin/attributes/attributes.js": "/js/admin/attributes/attributes.js?id=a3c29bcf1d0f897b3cbf",
    "/js/admin/brands/brands.js": "/js/admin/brands/brands.js?id=d6d5228c4283f32352f0",
    "/js/admin/categories/categories.js": "/js/admin/categories/categories.js?id=918fcf48d27b7080252d",
    "/js/admin/orders/orders.js": "/js/admin/orders/orders.js?id=9f9cd8fed1d3e570b974",
    "/js/admin/products/products.js": "/js/admin/products/products.js?id=8bdb52dab3e03f6cd493",
    "/js/admin/users/users.js": "/js/admin/users/users.js?id=253b838830ac36c6e3cf",
    "/js/admin/warehouses/warehouses.js": "/js/admin/warehouses/warehouses.js?id=044659bab81a1161ff35",
    "/js/client/client.js": "/js/client/client.js?id=bcdf66f38fac73462201",
    "/js/client/order.js": "/js/client/order.js?id=7d9508f9378ad05b361a",
    "/js/client/product.js": "/js/client/product.js?id=324200434c5a5c97a31f",
    "/js/client/search.js": "/js/client/search.js?id=0d503b8f78823145e72b",
    "/js/client/summary.js": "/js/client/summary.js?id=9cb48828587e9d309f9d"
}
