com/currency/converter/CurrencyConverterService$1.class
com/currency/converter/CurrencyConverterController.class
com/currency/converter/CurrencyExchangeRequest.class
com/currency/converter/CurrencyConverterService.class
