/Users/nikol/IdeaProjects/CurrencyConverter/src/main/java/com/currency/converter/CurrencyConverterController.java
/Users/nikol/IdeaProjects/CurrencyConverter/src/main/java/com/currency/converter/CurrencyExchangeRequest.java
/Users/nikol/IdeaProjects/CurrencyConverter/src/main/java/com/currency/converter/CurrencyConverterService.java
