ind;val;datetime
0;0;29062021112216
1;143;29062021112216
2;125;29062021112216
3;122;29062021112216
4;124;29062021112216
5;123;29062021112216
6;122;29062021112216
7;124;29062021112216
8;126;29062021112216
9;122;29062021112216
10;125;29062021112216
11;123;29062021112216
12;123;29062021112216
13;126;29062021112216
14;124;29062021112216
15;127;29062021112216
16;126;29062021112216
17;126;29062021112216
18;134;29062021112216
19;141;29062021112216
20;160;29062021112216
21;202;29062021112216
22;319;29062021112216
23;588;29062021112216
24;981;29062021112216
25;1023;29062021112216
26;1023;29062021112216
27;1023;29062021112216
28;1023;29062021112216
29;991;29062021112216
30;731;29062021112216
31;517;29062021112216
32;379;29062021112216
33;293;29062021112216
34;245;29062021112216
35;208;29062021112216
36;179;29062021112216
37;165;29062021112216
38;152;29062021112216
39;145;29062021112216
40;141;29062021112216
41;136;29062021112216
42;137;29062021112216
43;136;29062021112216
44;138;29062021112216
45;142;29062021112216
46;139;29062021112216
47;141;29062021112216
48;141;29062021112216
49;137;29062021112216
50;136;29062021112216
51;133;29062021112216
52;131;29062021112216
53;131;29062021112216
54;127;29062021112216
55;127;29062021112216
56;127;29062021112216
57;125;29062021112216
58;127;29062021112216
59;126;29062021112216
60;126;29062021112216
61;126;29062021112216
62;125;29062021112216
63;127;29062021112216
64;129;29062021112216
65;123;29062021112216
66;127;29062021112216
67;125;29062021112216
68;125;29062021112216
69;126;29062021112216
70;123;29062021112216
71;123;29062021112216
72;125;29062021112216
73;123;29062021112216
74;126;29062021112216
75;124;29062021112216
76;124;29062021112216
77;126;29062021112216
78;124;29062021112216
79;126;29062021112216
80;125;29062021112216
81;123;29062021112216
82;125;29062021112216
83;123;29062021112216
84;123;29062021112216
85;124;29062021112216
86;122;29062021112216
87;124;29062021112216
88;124;29062021112216
89;120;29062021112216
90;125;29062021112216
91;123;29062021112216
92;121;29062021112216
93;125;29062021112216
94;123;29062021112216
95;122;29062021112216
96;123;29062021112216
97;122;29062021112216
98;123;29062021112216
99;122;29062021112216
100;120;29062021112216
101;124;29062021112216
102;123;29062021112216
103;122;29062021112216
104;123;29062021112216
105;120;29062021112216
106;125;29062021112216
107;121;29062021112216
108;121;29062021112216
109;123;29062021112216
110;120;29062021112216
111;122;29062021112216
112;123;29062021112216
113;121;29062021112216
114;122;29062021112216
115;122;29062021112216
116;122;29062021112216
117;125;29062021112216
118;121;29062021112216
119;123;29062021112216
120;121;29062021112216
121;119;29062021112216
122;121;29062021112216
123;121;29062021112216
124;121;29062021112216
125;123;29062021112216
126;121;29062021112216
127;123;29062021112216
128;125;29062021112216
129;122;29062021112216
130;123;29062021112216
131;122;29062021112216
132;121;29062021112216
133;126;29062021112216
134;121;29062021112216
135;122;29062021112216
136;123;29062021112216
137;121;29062021112216
138;124;29062021112216
139;123;29062021112216
140;121;29062021112216
141;123;29062021112216
142;122;29062021112216
143;122;29062021112216
144;123;29062021112216
145;121;29062021112216
146;124;29062021112216
147;123;29062021112216
148;121;29062021112216
149;122;29062021112216
150;122;29062021112216
151;123;29062021112216
152;122;29062021112216
153;121;29062021112216
154;124;29062021112216
155;123;29062021112216
156;121;29062021112216
157;122;29062021112216
158;121;29062021112216
159;121;29062021112216
160;123;29062021112216
161;121;29062021112216
162;123;29062021112216
163;123;29062021112216
164;121;29062021112216
165;124;29062021112216
166;122;29062021112216
167;123;29062021112216
168;125;29062021112216
169;121;29062021112216
170;123;29062021112216
171;122;29062021112216
172;121;29062021112216
173;123;29062021112216
174;122;29062021112216
175;122;29062021112216
176;123;29062021112216
177;121;29062021112216
178;123;29062021112216
179;122;29062021112216
180;122;29062021112216
181;124;29062021112216
182;124;29062021112216
183;122;29062021112216
184;123;29062021112216
185;121;29062021112216
186;124;29062021112216
187;122;29062021112216
188;121;29062021112216
189;122;29062021112216
190;122;29062021112216
191;123;29062021112216
192;126;29062021112216
193;122;29062021112216
194;124;29062021112216
195;122;29062021112216
196;121;29062021112216
197;122;29062021112216
198;122;29062021112216
199;122;29062021112216
200;0;29062021112216
0;0;29062021112217
1;143;29062021112217
2;122;29062021112217
3;121;29062021112217
4;123;29062021112217
5;123;29062021112217
6;121;29062021112217
7;124;29062021112217
8;125;29062021112217
9;121;29062021112217
10;125;29062021112217
11;122;29062021112217
12;121;29062021112217
13;125;29062021112217
14;123;29062021112217
15;127;29062021112217
16;126;29062021112217
17;126;29062021112217
18;133;29062021112217
19;141;29062021112217
20;157;29062021112217
21;202;29062021112217
22;316;29062021112217
23;581;29062021112217
24;981;29062021112217
25;1023;29062021112217
26;1023;29062021112217
27;1023;29062021112217
28;1023;29062021112217
29;996;29062021112217
30;741;29062021112217
31;520;29062021112217
32;381;29062021112217
33;297;29062021112217
34;244;29062021112217
35;206;29062021112217
36;179;29062021112217
37;166;29062021112217
38;151;29062021112217
39;145;29062021112217
40;141;29062021112217
41;135;29062021112217
42;136;29062021112217
43;136;29062021112217
44;138;29062021112217
45;141;29062021112217
46;139;29062021112217
47;139;29062021112217
48;139;29062021112217
49;136;29062021112217
50;137;29062021112217
51;133;29062021112217
52;130;29062021112217
53;130;29062021112217
54;126;29062021112217
55;126;29062021112217
56;127;29062021112217
57;125;29062021112217
58;127;29062021112217
59;126;29062021112217
60;126;29062021112217
61;127;29062021112217
62;125;29062021112217
63;126;29062021112217
64;127;29062021112217
65;123;29062021112217
66;126;29062021112217
67;125;29062021112217
68;123;29062021112217
69;127;29062021112217
70;124;29062021112217
71;123;29062021112217
72;125;29062021112217
73;123;29062021112217
74;125;29062021112217
75;124;29062021112217
76;123;29062021112217
77;125;29062021112217
78;122;29062021112217
79;125;29062021112217
80;124;29062021112217
81;121;29062021112217
82;125;29062021112217
83;123;29062021112217
84;122;29062021112217
85;122;29062021112217
86;122;29062021112217
87;124;29062021112217
88;123;29062021112217
89;119;29062021112217
90;123;29062021112217
91;122;29062021112217
92;122;29062021112217
93;124;29062021112217
94;123;29062021112217
95;122;29062021112217
96;123;29062021112217
97;122;29062021112217
98;121;29062021112217
99;122;29062021112217
100;120;29062021112217
101;124;29062021112217
102;122;29062021112217
103;121;29062021112217
104;123;29062021112217
105;120;29062021112217
106;122;29062021112217
107;121;29062021112217
108;121;29062021112217
109;122;29062021112217
110;120;29062021112217
111;120;29062021112217
112;123;29062021112217
113;120;29062021112217
114;122;29062021112217
115;122;29062021112217
116;121;29062021112217
117;124;29062021112217
118;122;29062021112217
119;123;29062021112217
120;122;29062021112217
121;120;29062021112217
122;122;29062021112217
123;122;29062021112217
124;120;29062021112217
125;123;29062021112217
126;121;29062021112217
127;122;29062021112217
128;123;29062021112217
129;121;29062021112217
130;121;29062021112217
131;122;29062021112217
132;120;29062021112217
133;125;29062021112217
134;120;29062021112217
135;121;29062021112217
136;124;29062021112217
137;120;29062021112217
138;123;29062021112217
139;121;29062021112217
140;121;29062021112217
141;123;29062021112217
142;121;29062021112217
143;120;29062021112217
144;123;29062021112217
145;121;29062021112217
146;124;29062021112217
147;123;29062021112217
148;120;29062021112217
149;122;29062021112217
150;121;29062021112217
151;122;29062021112217
152;122;29062021112217
153;120;29062021112217
154;122;29062021112217
155;122;29062021112217
156;121;29062021112217
157;122;29062021112217
158;121;29062021112217
159;121;29062021112217
160;122;29062021112217
161;121;29062021112217
162;122;29062021112217
163;123;29062021112217
164;122;29062021112217
165;124;29062021112217
166;122;29062021112217
167;122;29062021112217
168;123;29062021112217
169;120;29062021112217
170;123;29062021112217
171;122;29062021112217
172;120;29062021112217
173;122;29062021112217
174;122;29062021112217
175;121;29062021112217
176;123;29062021112217
177;121;29062021112217
178;124;29062021112217
179;122;29062021112217
180;121;29062021112217
181;123;29062021112217
182;123;29062021112217
183;121;29062021112217
184;123;29062021112217
185;120;29062021112217
186;123;29062021112217
187;122;29062021112217
188;121;29062021112217
189;123;29062021112217
190;120;29062021112217
191;122;29062021112217
192;125;29062021112217
193;122;29062021112217
194;123;29062021112217
195;122;29062021112217
196;121;29062021112217
197;123;29062021112217
198;123;29062021112217
199;121;29062021112217
200;0;29062021112217
0;0;29062021112217
1;144;29062021112217
2;124;29062021112217
3;123;29062021112217
4;123;29062021112217
5;125;29062021112217
6;122;29062021112217
7;124;29062021112217
8;124;29062021112217
9;121;29062021112217
10;125;29062021112217
11;123;29062021112217
12;123;29062021112217
13;127;29062021112217
14;124;29062021112217
15;127;29062021112217
16;126;29062021112217
17;127;29062021112217
18;133;29062021112217
19;141;29062021112217
20;158;29062021112217
21;202;29062021112217
22;314;29062021112217
23;572;29062021112217
24;973;29062021112217
25;1023;29062021112217
26;1023;29062021112217
27;1023;29062021112217
28;1023;29062021112217
29;998;29062021112217
30;738;29062021112217
31;524;29062021112217
32;382;29062021112217
33;296;29062021112217
34;245;29062021112217
35;207;29062021112217
36;180;29062021112217
37;167;29062021112217
38;152;29062021112217
39;146;29062021112217
40;141;29062021112217
41;136;29062021112217
42;137;29062021112217
43;135;29062021112217
44;136;29062021112217
45;139;29062021112217
46;139;29062021112217
47;139;29062021112217
48;140;29062021112217
49;138;29062021112217
50;137;29062021112217
51;133;29062021112217
52;130;29062021112217
53;130;29062021112217
54;127;29062021112217
55;126;29062021112217
56;126;29062021112217
57;124;29062021112217
58;126;29062021112217
59;126;29062021112217
60;126;29062021112217
61;127;29062021112217
62;126;29062021112217
63;126;29062021112217
64;128;29062021112217
65;123;29062021112217
66;126;29062021112217
67;124;29062021112217
68;124;29062021112217
69;126;29062021112217
70;124;29062021112217
71;123;29062021112217
72;126;29062021112217
73;123;29062021112217
74;125;29062021112217
75;123;29062021112217
76;123;29062021112217
77;125;29062021112217
78;123;29062021112217
79;126;29062021112217
80;125;29062021112217
81;122;29062021112217
82;125;29062021112217
83;122;29062021112217
84;123;29062021112217
85;124;29062021112217
86;122;29062021112217
87;123;29062021112217
88;124;29062021112217
89;121;29062021112217
90;125;29062021112217
91;123;29062021112217
92;121;29062021112217
93;125;29062021112217
94;122;29062021112217
95;122;29062021112217
96;124;29062021112217
97;122;29062021112217
98;122;29062021112217
99;122;29062021112217
100;121;29062021112217
101;125;29062021112217
102;123;29062021112217
103;122;29062021112217
104;124;29062021112217
105;120;29062021112217
106;123;29062021112217
107;121;29062021112217
108;122;29062021112217
109;123;29062021112217
110;120;29062021112217
111;121;29062021112217
112;123;29062021112217
113;120;29062021112217
114;122;29062021112217
115;124;29062021112217
116;122;29062021112217
117;124;29062021112217
118;122;29062021112217
119;123;29062021112217
120;121;29062021112217
121;120;29062021112217
122;123;29062021112217
123;122;29062021112217
124;122;29062021112217
125;123;29062021112217
126;120;29062021112217
127;122;29062021112217
128;123;29062021112217
129;122;29062021112217
130;122;29062021112217
131;124;29062021112217
132;121;29062021112217
133;127;29062021112217
134;121;29062021112217
135;121;29062021112217
136;123;29062021112217
137;120;29062021112217
138;124;29062021112217
139;122;29062021112217
140;121;29062021112217
141;124;29062021112217
142;122;29062021112217
143;122;29062021112217
144;124;29062021112217
145;121;29062021112217
146;124;29062021112217
147;123;29062021112217
148;121;29062021112217
149;122;29062021112217
150;123;29062021112217
151;123;29062021112217
152;122;29062021112217
153;121;29062021112217
154;123;29062021112217
155;122;29062021112217
156;122;29062021112217
157;122;29062021112217
158;121;29062021112217
159;122;29062021112217
160;122;29062021112217
161;122;29062021112217
162;123;29062021112217
163;124;29062021112217
164;121;29062021112217
165;124;29062021112217
166;121;29062021112217
167;122;29062021112217
168;124;29062021112217
169;121;29062021112217
170;123;29062021112217
171;122;29062021112217
172;122;29062021112217
173;123;29062021112217
174;121;29062021112217
175;121;29062021112217
176;123;29062021112217
177;121;29062021112217
178;124;29062021112217
179;124;29062021112217
180;121;29062021112217
181;124;29062021112217
182;124;29062021112217
183;121;29062021112217
184;123;29062021112217
185;121;29062021112217
186;124;29062021112217
187;123;29062021112217
188;121;29062021112217
189;123;29062021112217
190;121;29062021112217
191;122;29062021112217
192;125;29062021112217
193;122;29062021112217
194;123;29062021112217
195;123;29062021112217
196;121;29062021112217
197;123;29062021112217
198;123;29062021112217
199;122;29062021112217
200;0;29062021112217
0;0;29062021112218
1;143;29062021112218
2;124;29062021112218
3;122;29062021112218
4;124;29062021112218
5;123;29062021112218
6;122;29062021112218
7;124;29062021112218
8;125;29062021112218
9;122;29062021112218
10;125;29062021112218
11;123;29062021112218
12;122;29062021112218
13;127;29062021112218
14;123;29062021112218
15;126;29062021112218
16;127;29062021112218
17;127;29062021112218
18;133;29062021112218
19;141;29062021112218
20;158;29062021112218
21;200;29062021112218
22;308;29062021112218
23;576;29062021112218
24;968;29062021112218
25;1023;29062021112218
26;1023;29062021112218
27;1023;29062021112218
28;1023;29062021112218
29;1000;29062021112218
30;737;29062021112218
31;525;29062021112218
32;381;29062021112218
33;295;29062021112218
34;246;29062021112218
35;206;29062021112218
36;180;29062021112218
37;166;29062021112218
38;152;29062021112218
39;146;29062021112218
40;141;29062021112218
41;135;29062021112218
42;137;29062021112218
43;136;29062021112218
44;137;29062021112218
45;140;29062021112218
46;140;29062021112218
47;140;29062021112218
48;140;29062021112218
49;137;29062021112218
50;137;29062021112218
51;132;29062021112218
52;130;29062021112218
53;130;29062021112218
54;126;29062021112218
55;125;29062021112218
56;127;29062021112218
57;124;29062021112218
58;126;29062021112218
59;127;29062021112218
60;126;29062021112218
61;127;29062021112218
62;125;29062021112218
63;126;29062021112218
64;127;29062021112218
65;123;29062021112218
66;126;29062021112218
67;125;29062021112218
68;124;29062021112218
69;127;29062021112218
70;124;29062021112218
71;123;29062021112218
72;125;29062021112218
73;122;29062021112218
74;125;29062021112218
75;124;29062021112218
76;123;29062021112218
77;125;29062021112218
78;123;29062021112218
79;125;29062021112218
80;125;29062021112218
81;122;29062021112218
82;125;29062021112218
83;123;29062021112218
84;122;29062021112218
85;124;29062021112218
86;123;29062021112218
87;124;29062021112218
88;124;29062021112218
89;120;29062021112218
90;124;29062021112218
91;122;29062021112218
92;121;29062021112218
93;123;29062021112218
94;123;29062021112218
95;121;29062021112218
96;123;29062021112218
97;121;29062021112218
98;123;29062021112218
99;122;29062021112218
100;120;29062021112218
101;124;29062021112218
102;122;29062021112218
103;122;29062021112218
104;123;29062021112218
105;120;29062021112218
106;124;29062021112218
107;121;29062021112218
108;121;29062021112218
109;123;29062021112218
110;121;29062021112218
111;120;29062021112218
112;123;29062021112218
113;120;29062021112218
114;122;29062021112218
115;122;29062021112218
116;121;29062021112218
117;124;29062021112218
118;120;29062021112218
119;122;29062021112218
120;122;29062021112218
121;121;29062021112218
122;122;29062021112218
123;121;29062021112218
124;121;29062021112218
125;123;29062021112218
126;121;29062021112218
127;122;29062021112218
128;124;29062021112218
129;121;29062021112218
130;122;29062021112218
131;122;29062021112218
132;121;29062021112218
133;126;29062021112218
134;121;29062021112218
135;122;29062021112218
136;124;29062021112218
137;120;29062021112218
138;123;29062021112218
139;122;29062021112218
140;121;29062021112218
141;124;29062021112218
142;122;29062021112218
143;121;29062021112218
144;123;29062021112218
145;121;29062021112218
146;123;29062021112218
147;123;29062021112218
148;121;29062021112218
149;123;29062021112218
150;122;29062021112218
151;123;29062021112218
152;123;29062021112218
153;120;29062021112218
154;123;29062021112218
155;122;29062021112218
156;121;29062021112218
157;123;29062021112218
158;120;29062021112218
159;122;29062021112218
160;123;29062021112218
161;120;29062021112218
162;123;29062021112218
163;123;29062021112218
164;122;29062021112218
165;123;29062021112218
166;121;29062021112218
167;122;29062021112218
168;124;29062021112218
169;121;29062021112218
170;124;29062021112218
171;123;29062021112218
172;122;29062021112218
173;123;29062021112218
174;121;29062021112218
175;121;29062021112218
176;124;29062021112218
177;121;29062021112218
178;124;29062021112218
179;123;29062021112218
180;122;29062021112218
181;123;29062021112218
182;124;29062021112218
183;121;29062021112218
184;123;29062021112218
185;120;29062021112218
186;124;29062021112218
187;123;29062021112218
188;121;29062021112218
189;122;29062021112218
190;121;29062021112218
191;122;29062021112218
192;125;29062021112218
193;122;29062021112218
194;123;29062021112218
195;123;29062021112218
196;122;29062021112218
197;122;29062021112218
198;123;29062021112218
199;121;29062021112218
200;0;29062021112218
0;0;29062021112219
1;143;29062021112219
2;123;29062021112219
3;123;29062021112219
4;123;29062021112219
5;124;29062021112219
6;121;29062021112219
7;123;29062021112219
8;122;29062021112219
9;122;29062021112219
10;125;29062021112219
11;123;29062021112219
12;123;29062021112219
13;125;29062021112219
14;123;29062021112219
15;126;29062021112219
16;125;29062021112219
17;127;29062021112219
18;133;29062021112219
19;141;29062021112219
20;158;29062021112219
21;200;29062021112219
22;313;29062021112219
23;577;29062021112219
24;972;29062021112219
25;1023;29062021112219
26;1023;29062021112219
27;1023;29062021112219
28;1023;29062021112219
29;997;29062021112219
30;740;29062021112219
31;523;29062021112219
32;383;29062021112219
33;297;29062021112219
34;245;29062021112219
35;207;29062021112219
36;179;29062021112219
37;166;29062021112219
38;152;29062021112219
39;145;29062021112219
40;141;29062021112219
41;135;29062021112219
42;136;29062021112219
43;136;29062021112219
44;135;29062021112219
45;141;29062021112219
46;139;29062021112219
47;141;29062021112219
48;140;29062021112219
49;135;29062021112219
50;137;29062021112219
51;132;29062021112219
52;130;29062021112219
53;129;29062021112219
54;126;29062021112219
55;125;29062021112219
56;125;29062021112219
57;124;29062021112219
58;127;29062021112219
59;125;29062021112219
60;126;29062021112219
61;127;29062021112219
62;125;29062021112219
63;126;29062021112219
64;128;29062021112219
65;123;29062021112219
66;125;29062021112219
67;124;29062021112219
68;124;29062021112219
69;126;29062021112219
70;123;29062021112219
71;123;29062021112219
72;126;29062021112219
73;122;29062021112219
74;125;29062021112219
75;123;29062021112219
76;124;29062021112219
77;124;29062021112219
78;123;29062021112219
79;125;29062021112219
80;125;29062021112219
81;122;29062021112219
82;124;29062021112219
83;123;29062021112219
84;122;29062021112219
85;124;29062021112219
86;123;29062021112219
87;123;29062021112219
88;123;29062021112219
89;120;29062021112219
90;123;29062021112219
91;122;29062021112219
92;121;29062021112219
93;124;29062021112219
94;122;29062021112219
95;121;29062021112219
96;124;29062021112219
97;121;29062021112219
98;122;29062021112219
99;122;29062021112219
100;120;29062021112219
101;124;29062021112219
102;121;29062021112219
103;121;29062021112219
104;122;29062021112219
105;120;29062021112219
106;122;29062021112219
107;121;29062021112219
108;121;29062021112219
109;122;29062021112219
110;120;29062021112219
111;121;29062021112219
112;123;29062021112219
113;120;29062021112219
114;122;29062021112219
115;122;29062021112219
116;121;29062021112219
117;124;29062021112219
118;121;29062021112219
119;122;29062021112219
120;121;29062021112219
121;121;29062021112219
122;122;29062021112219
123;121;29062021112219
124;122;29062021112219
125;122;29062021112219
126;120;29062021112219
127;123;29062021112219
128;124;29062021112219
129;121;29062021112219
130;121;29062021112219
131;123;29062021112219
132;120;29062021112219
133;126;29062021112219
134;120;29062021112219
135;120;29062021112219
136;123;29062021112219
137;120;29062021112219
138;124;29062021112219
139;121;29062021112219
140;120;29062021112219
141;123;29062021112219
142;121;29062021112219
143;120;29062021112219
144;124;29062021112219
145;120;29062021112219
146;123;29062021112219
147;122;29062021112219
148;121;29062021112219
149;123;29062021112219
150;121;29062021112219
151;122;29062021112219
152;122;29062021112219
153;120;29062021112219
154;122;29062021112219
155;122;29062021112219
156;121;29062021112219
157;122;29062021112219
158;120;29062021112219
159;121;29062021112219
160;123;29062021112219
161;121;29062021112219
162;123;29062021112219
163;122;29062021112219
164;121;29062021112219
165;123;29062021112219
166;121;29062021112219
167;122;29062021112219
168;123;29062021112219
169;119;29062021112219
170;122;29062021112219
171;122;29062021112219
172;121;29062021112219
173;124;29062021112219
174;121;29062021112219
175;121;29062021112219
176;122;29062021112219
177;121;29062021112219
178;122;29062021112219
179;123;29062021112219
180;121;29062021112219
181;122;29062021112219
182;122;29062021112219
183;121;29062021112219
184;123;29062021112219
185;118;29062021112219
186;124;29062021112219
187;122;29062021112219
188;121;29062021112219
189;122;29062021112219
190;121;29062021112219
191;122;29062021112219
192;125;29062021112219
193;121;29062021112219
194;122;29062021112219
195;122;29062021112219
196;121;29062021112219
197;122;29062021112219
198;122;29062021112219
199;121;29062021112219
200;0;29062021112219
0;0;29062021112219
1;143;29062021112219
2;124;29062021112219
3;123;29062021112219
4;124;29062021112219
5;125;29062021112219
6;123;29062021112219
7;123;29062021112219
8;126;29062021112219
9;122;29062021112219
10;125;29062021112219
11;123;29062021112219
12;124;29062021112219
13;126;29062021112219
14;124;29062021112219
15;126;29062021112219
16;127;29062021112219
17;126;29062021112219
18;133;29062021112219
19;141;29062021112219
20;158;29062021112219
21;202;29062021112219
22;311;29062021112219
23;572;29062021112219
24;963;29062021112219
25;1023;29062021112219
26;1023;29062021112219
27;1023;29062021112219
28;1023;29062021112219
29;1002;29062021112219
30;741;29062021112219
31;527;29062021112219
32;386;29062021112219
33;301;29062021112219
34;243;29062021112219
35;208;29062021112219
36;181;29062021112219
37;166;29062021112219
38;152;29062021112219
39;147;29062021112219
40;141;29062021112219
41;135;29062021112219
42;137;29062021112219
43;135;29062021112219
44;138;29062021112219
45;140;29062021112219
46;139;29062021112219
47;141;29062021112219
48;142;29062021112219
49;137;29062021112219
50;136;29062021112219
51;132;29062021112219
52;130;29062021112219
53;130;29062021112219
54;128;29062021112219
55;127;29062021112219
56;127;29062021112219
57;125;29062021112219
58;127;29062021112219
59;126;29062021112219
60;126;29062021112219
61;128;29062021112219
62;126;29062021112219
63;126;29062021112219
64;128;29062021112219
65;122;29062021112219
66;127;29062021112219
67;125;29062021112219
68;125;29062021112219
69;127;29062021112219
70;124;29062021112219
71;123;29062021112219
72;126;29062021112219
73;123;29062021112219
74;125;29062021112219
75;124;29062021112219
76;124;29062021112219
77;125;29062021112219
78;123;29062021112219
79;126;29062021112219
80;125;29062021112219
81;122;29062021112219
82;126;29062021112219
83;123;29062021112219
84;122;29062021112219
85;124;29062021112219
86;123;29062021112219
87;124;29062021112219
88;123;29062021112219
89;120;29062021112219
90;124;29062021112219
91;123;29062021112219
92;121;29062021112219
93;125;29062021112219
94;123;29062021112219
95;122;29062021112219
96;123;29062021112219
97;122;29062021112219
98;123;29062021112219
99;123;29062021112219
100;121;29062021112219
101;124;29062021112219
102;122;29062021112219
103;122;29062021112219
104;122;29062021112219
105;120;29062021112219
106;123;29062021112219
107;121;29062021112219
108;122;29062021112219
109;124;29062021112219
110;121;29062021112219
111;121;29062021112219
112;123;29062021112219
113;120;29062021112219
114;121;29062021112219
115;123;29062021112219
116;122;29062021112219
117;124;29062021112219
118;122;29062021112219
119;123;29062021112219
120;122;29062021112219
121;121;29062021112219
122;122;29062021112219
123;122;29062021112219
124;121;29062021112219
125;123;29062021112219
126;122;29062021112219
127;123;29062021112219
128;125;29062021112219
129;121;29062021112219
130;122;29062021112219
131;123;29062021112219
132;121;29062021112219
133;126;29062021112219
134;121;29062021112219
135;122;29062021112219
136;124;29062021112219
137;121;29062021112219
138;125;29062021112219
139;122;29062021112219
140;121;29062021112219
141;124;29062021112219
142;122;29062021112219
143;121;29062021112219
144;123;29062021112219
145;120;29062021112219
146;125;29062021112219
147;123;29062021112219
148;122;29062021112219
149;121;29062021112219
150;122;29062021112219
151;123;29062021112219
152;122;29062021112219
153;121;29062021112219
154;124;29062021112219
155;123;29062021112219
156;121;29062021112219
157;123;29062021112219
158;121;29062021112219
159;121;29062021112219
160;123;29062021112219
161;120;29062021112219
162;123;29062021112219
163;123;29062021112219
164;122;29062021112219
165;123;29062021112219
166;122;29062021112219
167;122;29062021112219
168;124;29062021112219
169;121;29062021112219
170;123;29062021112219
171;122;29062021112219
172;122;29062021112219
173;123;29062021112219
174;122;29062021112219
175;122;29062021112219
176;123;29062021112219
177;121;29062021112219
178;124;29062021112219
179;122;29062021112219
180;121;29062021112219
181;123;29062021112219
182;123;29062021112219
183;122;29062021112219
184;123;29062021112219
185;120;29062021112219
186;124;29062021112219
187;122;29062021112219
188;121;29062021112219
189;123;29062021112219
190;121;29062021112219
191;123;29062021112219
192;125;29062021112219
193;122;29062021112219
194;122;29062021112219
195;122;29062021112219
196;122;29062021112219
197;123;29062021112219
198;124;29062021112219
199;122;29062021112219
200;0;29062021112219
0;0;29062021112220
1;143;29062021112220
2;124;29062021112220
3;123;29062021112220
4;124;29062021112220
5;124;29062021112220
6;123;29062021112220
7;124;29062021112220
8;125;29062021112220
9;122;29062021112220
10;125;29062021112220
11;124;29062021112220
12;123;29062021112220
13;125;29062021112220
14;124;29062021112220
15;127;29062021112220
16;127;29062021112220
17;127;29062021112220
18;134;29062021112220
19;140;29062021112220
20;156;29062021112220
21;201;29062021112220
22;312;29062021112220
23;567;29062021112220
24;966;29062021112220
25;1023;29062021112220
26;1023;29062021112220
27;1023;29062021112220
28;1023;29062021112220
29;1002;29062021112220
30;744;29062021112220
31;530;29062021112220
32;386;29062021112220
33;299;29062021112220
34;248;29062021112220
35;209;29062021112220
36;181;29062021112220
37;167;29062021112220
38;151;29062021112220
39;145;29062021112220
40;141;29062021112220
41;135;29062021112220
42;137;29062021112220
43;135;29062021112220
44;137;29062021112220
45;141;29062021112220
46;139;29062021112220
47;140;29062021112220
48;139;29062021112220
49;138;29062021112220
50;137;29062021112220
51;132;29062021112220
52;129;29062021112220
53;130;29062021112220
54;128;29062021112220
55;126;29062021112220
56;126;29062021112220
57;124;29062021112220
58;128;29062021112220
59;126;29062021112220
60;126;29062021112220
61;127;29062021112220
62;125;29062021112220
63;125;29062021112220
64;127;29062021112220
65;123;29062021112220
66;127;29062021112220
67;124;29062021112220
68;124;29062021112220
69;127;29062021112220
70;124;29062021112220
71;123;29062021112220
72;126;29062021112220
73;122;29062021112220
74;125;29062021112220
75;124;29062021112220
76;124;29062021112220
77;125;29062021112220
78;124;29062021112220
79;125;29062021112220
80;125;29062021112220
81;121;29062021112220
82;125;29062021112220
83;123;29062021112220
84;123;29062021112220
85;124;29062021112220
86;123;29062021112220
87;124;29062021112220
88;124;29062021112220
89;121;29062021112220
90;124;29062021112220
91;122;29062021112220
92;120;29062021112220
93;123;29062021112220
94;123;29062021112220
95;121;29062021112220
96;124;29062021112220
97;121;29062021112220
98;121;29062021112220
99;121;29062021112220
100;120;29062021112220
101;124;29062021112220
102;123;29062021112220
103;122;29062021112220
104;122;29062021112220
105;121;29062021112220
106;123;29062021112220
107;121;29062021112220
108;121;29062021112220
109;123;29062021112220
110;120;29062021112220
111;121;29062021112220
112;123;29062021112220
113;121;29062021112220
114;122;29062021112220
115;123;29062021112220
116;121;29062021112220
117;124;29062021112220
118;121;29062021112220
119;123;29062021112220
120;121;29062021112220
121;121;29062021112220
122;122;29062021112220
123;122;29062021112220
124;121;29062021112220
125;123;29062021112220
126;120;29062021112220
127;122;29062021112220
128;124;29062021112220
129;121;29062021112220
130;122;29062021112220
131;123;29062021112220
132;121;29062021112220
133;126;29062021112220
134;121;29062021112220
135;121;29062021112220
136;124;29062021112220
137;121;29062021112220
138;123;29062021112220
139;123;29062021112220
140;121;29062021112220
141;124;29062021112220
142;122;29062021112220
143;121;29062021112220
144;124;29062021112220
145;120;29062021112220
146;123;29062021112220
147;123;29062021112220
148;121;29062021112220
149;122;29062021112220
150;122;29062021112220
151;123;29062021112220
152;122;29062021112220
153;120;29062021112220
154;122;29062021112220
155;122;29062021112220
156;121;29062021112220
157;122;29062021112220
158;120;29062021112220
159;122;29062021112220
160;122;29062021112220
161;121;29062021112220
162;123;29062021112220
163;122;29062021112220
164;121;29062021112220
165;124;29062021112220
166;121;29062021112220
167;122;29062021112220
168;124;29062021112220
169;120;29062021112220
170;123;29062021112220
171;122;29062021112220
172;122;29062021112220
173;124;29062021112220
174;121;29062021112220
175;120;29062021112220
176;123;29062021112220
177;122;29062021112220
178;124;29062021112220
179;122;29062021112220
180;121;29062021112220
181;123;29062021112220
182;123;29062021112220
183;122;29062021112220
184;123;29062021112220
185;120;29062021112220
186;124;29062021112220
187;123;29062021112220
188;120;29062021112220
189;124;29062021112220
190;121;29062021112220
191;122;29062021112220
192;125;29062021112220
193;122;29062021112220
194;123;29062021112220
195;122;29062021112220
196;121;29062021112220
197;122;29062021112220
198;123;29062021112220
199;122;29062021112220
200;0;29062021112220
0;0;29062021112220
1;144;29062021112220
2;124;29062021112220
3;122;29062021112220
4;123;29062021112220
5;124;29062021112220
6;122;29062021112220
7;124;29062021112220
8;125;29062021112220
9;122;29062021112220
10;125;29062021112220
11;123;29062021112220
12;122;29062021112220
13;126;29062021112220
14;125;29062021112220
15;127;29062021112220
16;127;29062021112220
17;127;29062021112220
18;133;29062021112220
19;139;29062021112220
20;156;29062021112220
21;199;29062021112220
22;311;29062021112220
23;565;29062021112220
24;959;29062021112220
25;1023;29062021112220
26;1023;29062021112220
27;1023;29062021112220
28;1023;29062021112220
29;1006;29062021112220
30;742;29062021112220
31;528;29062021112220
32;388;29062021112220
33;299;29062021112220
34;247;29062021112220
35;210;29062021112220
36;181;29062021112220
37;167;29062021112220
38;152;29062021112220
39;147;29062021112220
40;141;29062021112220
41;135;29062021112220
42;136;29062021112220
43;137;29062021112220
44;138;29062021112220
45;141;29062021112220
46;140;29062021112220
47;139;29062021112220
48;141;29062021112220
49;136;29062021112220
50;137;29062021112220
51;133;29062021112220
52;130;29062021112220
53;130;29062021112220
54;127;29062021112220
55;126;29062021112220
56;127;29062021112220
57;125;29062021112220
58;127;29062021112220
59;126;29062021112220
60;126;29062021112220
61;126;29062021112220
62;125;29062021112220
63;126;29062021112220
64;128;29062021112220
65;124;29062021112220
66;126;29062021112220
67;124;29062021112220
68;124;29062021112220
69;126;29062021112220
70;125;29062021112220
71;123;29062021112220
72;125;29062021112220
73;122;29062021112220
74;125;29062021112220
75;124;29062021112220
76;123;29062021112220
77;125;29062021112220
78;122;29062021112220
79;125;29062021112220
80;125;29062021112220
81;123;29062021112220
82;125;29062021112220
83;123;29062021112220
84;123;29062021112220
85;123;29062021112220
86;122;29062021112220
87;124;29062021112220
88;124;29062021112220
89;120;29062021112220
90;124;29062021112220
91;123;29062021112220
92;121;29062021112220
93;124;29062021112220
94;123;29062021112220
95;121;29062021112220
96;123;29062021112220
97;122;29062021112220
98;122;29062021112220
99;123;29062021112220
100;121;29062021112220
101;124;29062021112220
102;123;29062021112220
103;122;29062021112220
104;123;29062021112220
105;121;29062021112220
106;124;29062021112220
107;121;29062021112220
108;121;29062021112220
109;124;29062021112220
110;121;29062021112220
111;121;29062021112220
112;123;29062021112220
113;120;29062021112220
114;121;29062021112220
115;123;29062021112220
116;122;29062021112220
117;125;29062021112220
118;122;29062021112220
119;123;29062021112220
120;121;29062021112220
121;120;29062021112220
122;122;29062021112220
123;121;29062021112220
124;122;29062021112220
125;122;29062021112220
126;120;29062021112220
127;121;29062021112220
128;125;29062021112220
129;122;29062021112220
130;122;29062021112220
131;123;29062021112220
132;120;29062021112220
133;126;29062021112220
134;122;29062021112220
135;121;29062021112220
136;124;29062021112220
137;121;29062021112220
138;124;29062021112220
139;122;29062021112220
140;122;29062021112220
141;124;29062021112220
142;121;29062021112220
143;121;29062021112220
144;123;29062021112220
145;121;29062021112220
146;124;29062021112220
147;123;29062021112220
148;122;29062021112220
149;122;29062021112220
150;122;29062021112220
151;122;29062021112220
152;123;29062021112220
153;121;29062021112220
154;123;29062021112220
155;122;29062021112220
156;122;29062021112220
157;123;29062021112220
158;121;29062021112220
159;121;29062021112220
160;122;29062021112220
161;121;29062021112220
162;123;29062021112220
163;122;29062021112220
164;122;29062021112220
165;124;29062021112220
166;121;29062021112220
167;123;29062021112220
168;124;29062021112220
169;120;29062021112220
170;124;29062021112220
171;122;29062021112220
172;121;29062021112220
173;124;29062021112220
174;122;29062021112220
175;121;29062021112220
176;124;29062021112220
177;121;29062021112220
178;124;29062021112220
179;122;29062021112220
180;122;29062021112220
181;123;29062021112220
182;124;29062021112220
183;121;29062021112220
184;122;29062021112220
185;119;29062021112220
186;123;29062021112220
187;123;29062021112220
188;121;29062021112220
189;122;29062021112220
190;121;29062021112220
191;122;29062021112220
192;126;29062021112220
193;122;29062021112220
194;122;29062021112220
195;122;29062021112220
196;121;29062021112220
197;122;29062021112220
198;122;29062021112220
199;122;29062021112220
200;0;29062021112220
0;0;29062021112221
1;144;29062021112221
2;125;29062021112221
3;123;29062021112221
4;123;29062021112221
5;124;29062021112221
6;122;29062021112221
7;124;29062021112221
8;125;29062021112221
9;122;29062021112221
10;126;29062021112221
11;122;29062021112221
12;122;29062021112221
13;126;29062021112221
14;124;29062021112221
15;127;29062021112221
16;127;29062021112221
17;126;29062021112221
18;134;29062021112221
19;140;29062021112221
20;157;29062021112221
21;199;29062021112221
22;311;29062021112221
23;565;29062021112221
24;961;29062021112221
25;1023;29062021112221
26;1023;29062021112221
27;1023;29062021112221
28;1023;29062021112221
29;999;29062021112221
30;748;29062021112221
31;530;29062021112221
32;385;29062021112221
33;300;29062021112221
34;244;29062021112221
35;208;29062021112221
36;180;29062021112221
37;167;29062021112221
38;152;29062021112221
39;147;29062021112221
40;142;29062021112221
41;135;29062021112221
42;136;29062021112221
43;134;29062021112221
44;137;29062021112221
45;141;29062021112221
46;140;29062021112221
47;140;29062021112221
48;140;29062021112221
49;136;29062021112221
50;138;29062021112221
51;132;29062021112221
52;129;29062021112221
53;130;29062021112221
54;128;29062021112221
55;126;29062021112221
56;127;29062021112221
57;125;29062021112221
58;127;29062021112221
59;126;29062021112221
60;126;29062021112221
61;127;29062021112221
62;125;29062021112221
63;126;29062021112221
64;126;29062021112221
65;123;29062021112221
66;126;29062021112221
67;124;29062021112221
68;124;29062021112221
69;127;29062021112221
70;124;29062021112221
71;123;29062021112221
72;126;29062021112221
73;123;29062021112221
74;126;29062021112221
75;124;29062021112221
76;124;29062021112221
77;124;29062021112221
78;123;29062021112221
79;125;29062021112221
80;125;29062021112221
81;122;29062021112221
82;125;29062021112221
83;123;29062021112221
84;122;29062021112221
85;124;29062021112221
86;123;29062021112221
87;123;29062021112221
88;124;29062021112221
89;120;29062021112221
90;123;29062021112221
91;123;29062021112221
92;120;29062021112221
93;125;29062021112221
94;123;29062021112221
95;121;29062021112221
96;123;29062021112221
97;122;29062021112221
98;122;29062021112221
99;122;29062021112221
100;120;29062021112221
101;124;29062021112221
102;121;29062021112221
103;121;29062021112221
104;123;29062021112221
105;120;29062021112221
106;124;29062021112221
107;121;29062021112221
108;120;29062021112221
109;124;29062021112221
110;120;29062021112221
111;122;29062021112221
112;124;29062021112221
113;120;29062021112221
114;122;29062021112221
115;123;29062021112221
116;121;29062021112221
117;124;29062021112221
118;121;29062021112221
119;123;29062021112221
120;122;29062021112221
121;120;29062021112221
122;121;29062021112221
123;121;29062021112221
124;122;29062021112221
125;123;29062021112221
126;120;29062021112221
127;122;29062021112221
128;125;29062021112221
129;121;29062021112221
130;122;29062021112221
131;122;29062021112221
132;121;29062021112221
133;125;29062021112221
134;122;29062021112221
135;121;29062021112221
136;123;29062021112221
137;120;29062021112221
138;123;29062021112221
139;121;29062021112221
140;121;29062021112221
141;124;29062021112221
142;122;29062021112221
143;121;29062021112221
144;122;29062021112221
145;120;29062021112221
146;124;29062021112221
147;123;29062021112221
148;122;29062021112221
149;123;29062021112221
150;122;29062021112221
151;123;29062021112221
152;121;29062021112221
153;120;29062021112221
154;122;29062021112221
155;122;29062021112221
156;122;29062021112221
157;122;29062021112221
158;121;29062021112221
159;121;29062021112221
160;122;29062021112221
161;121;29062021112221
162;122;29062021112221
163;123;29062021112221
164;122;29062021112221
165;124;29062021112221
166;122;29062021112221
167;123;29062021112221
168;124;29062021112221
169;121;29062021112221
170;123;29062021112221
171;122;29062021112221
172;121;29062021112221
173;122;29062021112221
174;122;29062021112221
175;121;29062021112221
176;123;29062021112221
177;121;29062021112221
178;123;29062021112221
179;122;29062021112221
180;122;29062021112221
181;122;29062021112221
182;122;29062021112221
183;121;29062021112221
184;123;29062021112221
185;120;29062021112221
186;125;29062021112221
187;123;29062021112221
188;121;29062021112221
189;122;29062021112221
190;121;29062021112221
191;123;29062021112221
192;125;29062021112221
193;123;29062021112221
194;123;29062021112221
195;122;29062021112221
196;121;29062021112221
197;122;29062021112221
198;122;29062021112221
199;122;29062021112221
200;0;29062021112221
0;0;29062021112221
1;144;29062021112221
2;124;29062021112221
3;122;29062021112221
4;124;29062021112221
5;124;29062021112221
6;122;29062021112221
7;124;29062021112221
8;125;29062021112221
9;122;29062021112221
10;125;29062021112221
11;122;29062021112221
12;122;29062021112221
13;125;29062021112221
14;124;29062021112221
15;126;29062021112221
16;127;29062021112221
17;126;29062021112221
18;133;29062021112221
19;140;29062021112221
20;156;29062021112221
21;199;29062021112221
22;308;29062021112221
23;563;29062021112221
24;961;29062021112221
25;1023;29062021112221
26;1023;29062021112221
27;1023;29062021112221
28;1023;29062021112221
29;1007;29062021112221
30;749;29062021112221
31;531;29062021112221
32;390;29062021112221
33;300;29062021112221
34;246;29062021112221
35;208;29062021112221
36;181;29062021112221
37;167;29062021112221
38;153;29062021112221
39;144;29062021112221
40;142;29062021112221
41;136;29062021112221
42;137;29062021112221
43;135;29062021112221
44;137;29062021112221
45;141;29062021112221
46;140;29062021112221
47;141;29062021112221
48;140;29062021112221
49;138;29062021112221
50;137;29062021112221
51;132;29062021112221
52;129;29062021112221
53;131;29062021112221
54;127;29062021112221
55;126;29062021112221
56;126;29062021112221
57;126;29062021112221
58;127;29062021112221
59;125;29062021112221
60;126;29062021112221
61;127;29062021112221
62;125;29062021112221
63;126;29062021112221
64;128;29062021112221
65;123;29062021112221
66;126;29062021112221
67;124;29062021112221
68;124;29062021112221
69;126;29062021112221
70;124;29062021112221
71;124;29062021112221
72;126;29062021112221
73;124;29062021112221
74;125;29062021112221
75;123;29062021112221
76;124;29062021112221
77;124;29062021112221
78;123;29062021112221
79;125;29062021112221
80;126;29062021112221
81;122;29062021112221
82;125;29062021112221
83;124;29062021112221
84;123;29062021112221
85;123;29062021112221
86;122;29062021112221
87;123;29062021112221
88;123;29062021112221
89;120;29062021112221
90;124;29062021112221
91;123;29062021112221
92;120;29062021112221
93;124;29062021112221
94;122;29062021112221
95;120;29062021112221
96;123;29062021112221
97;122;29062021112221
98;122;29062021112221
99;122;29062021112221
100;120;29062021112221
101;125;29062021112221
102;123;29062021112221
103;121;29062021112221
104;122;29062021112221
105;121;29062021112221
106;123;29062021112221
107;121;29062021112221
108;122;29062021112221
109;124;29062021112221
110;119;29062021112221
111;121;29062021112221
112;122;29062021112221
113;120;29062021112221
114;121;29062021112221
115;122;29062021112221
116;120;29062021112221
117;123;29062021112221
118;121;29062021112221
119;123;29062021112221
120;121;29062021112221
121;121;29062021112221
122;122;29062021112221
123;121;29062021112221
124;121;29062021112221
125;123;29062021112221
126;120;29062021112221
127;122;29062021112221
128;124;29062021112221
129;122;29062021112221
130;122;29062021112221
131;123;29062021112221
132;121;29062021112221
133;126;29062021112221
134;121;29062021112221
135;121;29062021112221
136;123;29062021112221
137;121;29062021112221
138;123;29062021112221
139;122;29062021112221
140;121;29062021112221
141;124;29062021112221
142;121;29062021112221
143;121;29062021112221
144;124;29062021112221
145;121;29062021112221
146;124;29062021112221
147;124;29062021112221
148;122;29062021112221
149;122;29062021112221
150;122;29062021112221
151;122;29062021112221
152;122;29062021112221
153;120;29062021112221
154;122;29062021112221
155;123;29062021112221
156;121;29062021112221
157;123;29062021112221
158;121;29062021112221
159;120;29062021112221
160;122;29062021112221
161;121;29062021112221
162;123;29062021112221
163;123;29062021112221
164;122;29062021112221
165;124;29062021112221
166;122;29062021112221
167;122;29062021112221
168;123;29062021112221
169;119;29062021112221
170;122;29062021112221
171;122;29062021112221
172;121;29062021112221
173;123;29062021112221
174;122;29062021112221
175;121;29062021112221
176;123;29062021112221
177;120;29062021112221
178;123;29062021112221
179;122;29062021112221
180;121;29062021112221
181;123;29062021112221
182;122;29062021112221
183;121;29062021112221
184;122;29062021112221
185;120;29062021112221
186;124;29062021112221
187;121;29062021112221
188;120;29062021112221
189;122;29062021112221
190;121;29062021112221
191;121;29062021112221
192;124;29062021112221
193;121;29062021112221
194;123;29062021112221
195;122;29062021112221
196;120;29062021112221
197;121;29062021112221
198;122;29062021112221
199;120;29062021112221
200;0;29062021112221
