ind;val;datetime
0;0;18062021130852
1;165;18062021130852
2;147;18062021130852
3;143;18062021130852
4;145;18062021130852
5;146;18062021130852
6;144;18062021130852
7;146;18062021130852
8;146;18062021130852
9;143;18062021130852
10;147;18062021130852
11;145;18062021130852
12;143;18062021130852
13;147;18062021130852
14;145;18062021130852
15;147;18062021130852
16;147;18062021130852
17;146;18062021130852
18;154;18062021130852
19;159;18062021130852
20;172;18062021130852
21;208;18062021130852
22;304;18062021130852
23;538;18062021130852
24;904;18062021130852
25;1023;18062021130852
26;1023;18062021130852
27;1023;18062021130852
28;1023;18062021130852
29;831;18062021130852
30;599;18062021130852
31;445;18062021130852
32;353;18062021130852
33;304;18062021130852
34;274;18062021130852
35;258;18062021130852
36;242;18062021130852
37;243;18062021130852
38;245;18062021130852
39;250;18062021130852
40;257;18062021130852
41;259;18062021130852
42;267;18062021130852
43;271;18062021130852
44;277;18062021130852
45;283;18062021130852
46;288;18062021130852
47;288;18062021130852
48;290;18062021130852
49;292;18062021130852
50;292;18062021130852
51;294;18062021130852
52;292;18062021130852
53;303;18062021130852
54;304;18062021130852
55;306;18062021130852
56;311;18062021130852
57;316;18062021130852
58;325;18062021130852
59;329;18062021130852
60;331;18062021130852
61;338;18062021130852
62;342;18062021130852
63;344;18062021130852
64;348;18062021130852
65;341;18062021130852
66;343;18062021130852
67;338;18062021130852
68;337;18062021130852
69;333;18062021130852
70;323;18062021130852
71;315;18062021130852
72;311;18062021130852
73;303;18062021130852
74;298;18062021130852
75;289;18062021130852
76;281;18062021130852
77;274;18062021130852
78;265;18062021130852
79;262;18062021130852
80;258;18062021130852
81;247;18062021130852
82;247;18062021130852
83;239;18062021130852
84;236;18062021130852
85;236;18062021130852
86;232;18062021130852
87;230;18062021130852
88;229;18062021130852
89;223;18062021130852
90;223;18062021130852
91;219;18062021130852
92;214;18062021130852
93;214;18062021130852
94;210;18062021130852
95;205;18062021130852
96;206;18062021130852
97;199;18062021130852
98;198;18062021130852
99;194;18062021130852
100;189;18062021130852
101;194;18062021130852
102;191;18062021130852
103;186;18062021130852
104;185;18062021130852
105;181;18062021130852
106;183;18062021130852
107;177;18062021130852
108;176;18062021130852
109;176;18062021130852
110;172;18062021130852
111;172;18062021130852
112;173;18062021130852
113;168;18062021130852
114;169;18062021130852
115;169;18062021130852
116;168;18062021130852
117;170;18062021130852
118;165;18062021130852
119;166;18062021130852
120;164;18062021130852
121;162;18062021130852
122;161;18062021130852
123;160;18062021130852
124;160;18062021130852
125;158;18062021130852
126;157;18062021130852
127;157;18062021130852
128;160;18062021130852
129;156;18062021130852
130;157;18062021130852
131;157;18062021130852
132;153;18062021130852
133;159;18062021130852
134;153;18062021130852
135;153;18062021130852
136;154;18062021130852
137;151;18062021130852
138;155;18062021130852
139;152;18062021130852
140;151;18062021130852
141;153;18062021130852
142;151;18062021130852
143;149;18062021130852
144;152;18062021130852
145;149;18062021130852
146;152;18062021130852
147;150;18062021130852
148;147;18062021130852
149;149;18062021130852
150;148;18062021130852
151;149;18062021130852
152;147;18062021130852
153;146;18062021130852
154;149;18062021130852
155;149;18062021130852
156;147;18062021130852
157;146;18062021130852
158;145;18062021130852
159;146;18062021130852
160;146;18062021130852
161;146;18062021130852
162;147;18062021130852
163;147;18062021130852
164;146;18062021130852
165;147;18062021130852
166;144;18062021130852
167;146;18062021130852
168;147;18062021130852
169;143;18062021130852
170;147;18062021130852
171;146;18062021130852
172;144;18062021130852
173;147;18062021130852
174;144;18062021130852
175;144;18062021130852
176;146;18062021130852
177;144;18062021130852
178;147;18062021130852
179;146;18062021130852
180;145;18062021130852
181;145;18062021130852
182;146;18062021130852
183;143;18062021130852
184;144;18062021130852
185;142;18062021130852
186;146;18062021130852
187;145;18062021130852
188;144;18062021130852
189;145;18062021130852
190;143;18062021130852
191;145;18062021130852
192;147;18062021130852
193;144;18062021130852
194;146;18062021130852
195;145;18062021130852
196;143;18062021130852
197;144;18062021130852
198;144;18062021130852
199;143;18062021130852
200;0;18062021130852
0;0;18062021130853
1;165;18062021130853
2;146;18062021130853
3;142;18062021130853
4;144;18062021130853
5;144;18062021130853
6;144;18062021130853
7;145;18062021130853
8;145;18062021130853
9;142;18062021130853
10;148;18062021130853
11;144;18062021130853
12;142;18062021130853
13;147;18062021130853
14;144;18062021130853
15;147;18062021130853
16;147;18062021130853
17;145;18062021130853
18;152;18062021130853
19;158;18062021130853
20;171;18062021130853
21;207;18062021130853
22;304;18062021130853
23;536;18062021130853
24;898;18062021130853
25;1023;18062021130853
26;1023;18062021130853
27;1023;18062021130853
28;1023;18062021130853
29;841;18062021130853
30;610;18062021130853
31;449;18062021130853
32;357;18062021130853
33;304;18062021130853
34;274;18062021130853
35;256;18062021130853
36;243;18062021130853
37;246;18062021130853
38;243;18062021130853
39;251;18062021130853
40;258;18062021130853
41;258;18062021130853
42;269;18062021130853
43;271;18062021130853
44;276;18062021130853
45;284;18062021130853
46;285;18062021130853
47;289;18062021130853
48;292;18062021130853
49;291;18062021130853
50;294;18062021130853
51;296;18062021130853
52;297;18062021130853
53;302;18062021130853
54;304;18062021130853
55;308;18062021130853
56;316;18062021130853
57;317;18062021130853
58;326;18062021130853
59;329;18062021130853
60;332;18062021130853
61;341;18062021130853
62;339;18062021130853
63;346;18062021130853
64;349;18062021130853
65;343;18062021130853
66;343;18062021130853
67;342;18062021130853
68;335;18062021130853
69;335;18062021130853
70;322;18062021130853
71;319;18062021130853
72;313;18062021130853
73;305;18062021130853
74;300;18062021130853
75;289;18062021130853
76;281;18062021130853
77;277;18062021130853
78;267;18062021130853
79;263;18062021130853
80;256;18062021130853
81;246;18062021130853
82;247;18062021130853
83;239;18062021130853
84;239;18062021130853
85;233;18062021130853
86;231;18062021130853
87;230;18062021130853
88;229;18062021130853
89;220;18062021130853
90;227;18062021130853
91;220;18062021130853
92;214;18062021130853
93;216;18062021130853
94;209;18062021130853
95;203;18062021130853
96;204;18062021130853
97;199;18062021130853
98;198;18062021130853
99;196;18062021130853
100;191;18062021130853
101;193;18062021130853
102;189;18062021130853
103;185;18062021130853
104;182;18062021130853
105;180;18062021130853
106;183;18062021130853
107;178;18062021130853
108;177;18062021130853
109;177;18062021130853
110;173;18062021130853
111;171;18062021130853
112;172;18062021130853
113;168;18062021130853
114;169;18062021130853
115;169;18062021130853
116;166;18062021130853
117;170;18062021130853
118;164;18062021130853
119;165;18062021130853
120;163;18062021130853
121;161;18062021130853
122;162;18062021130853
123;161;18062021130853
124;159;18062021130853
125;160;18062021130853
126;157;18062021130853
127;158;18062021130853
128;160;18062021130853
129;156;18062021130853
130;157;18062021130853
131;157;18062021130853
132;153;18062021130853
133;159;18062021130853
134;152;18062021130853
135;152;18062021130853
136;156;18062021130853
137;151;18062021130853
138;153;18062021130853
139;150;18062021130853
140;150;18062021130853
141;152;18062021130853
142;149;18062021130853
143;148;18062021130853
144;150;18062021130853
145;148;18062021130853
146;151;18062021130853
147;149;18062021130853
148;148;18062021130853
149;149;18062021130853
150;148;18062021130853
151;148;18062021130853
152;148;18062021130853
153;144;18062021130853
154;147;18062021130853
155;147;18062021130853
156;145;18062021130853
157;146;18062021130853
158;144;18062021130853
159;145;18062021130853
160;146;18062021130853
161;145;18062021130853
162;146;18062021130853
163;146;18062021130853
164;145;18062021130853
165;148;18062021130853
166;144;18062021130853
167;145;18062021130853
168;148;18062021130853
169;143;18062021130853
170;145;18062021130853
171;144;18062021130853
172;144;18062021130853
173;146;18062021130853
174;142;18062021130853
175;143;18062021130853
176;146;18062021130853
177;143;18062021130853
178;146;18062021130853
179;145;18062021130853
180;143;18062021130853
181;144;18062021130853
182;145;18062021130853
183;143;18062021130853
184;144;18062021130853
185;141;18062021130853
186;146;18062021130853
187;145;18062021130853
188;142;18062021130853
189;145;18062021130853
190;142;18062021130853
191;144;18062021130853
192;147;18062021130853
193;141;18062021130853
194;145;18062021130853
195;145;18062021130853
196;143;18062021130853
197;145;18062021130853
198;143;18062021130853
199;142;18062021130853
200;0;18062021130853
0;0;18062021130854
1;165;18062021130854
2;146;18062021130854
3;142;18062021130854
4;144;18062021130854
5;143;18062021130854
6;141;18062021130854
7;146;18062021130854
8;144;18062021130854
9;142;18062021130854
10;146;18062021130854
11;144;18062021130854
12;143;18062021130854
13;147;18062021130854
14;143;18062021130854
15;147;18062021130854
16;146;18062021130854
17;147;18062021130854
18;151;18062021130854
19;158;18062021130854
20;171;18062021130854
21;208;18062021130854
22;306;18062021130854
23;535;18062021130854
24;907;18062021130854
25;1023;18062021130854
26;1023;18062021130854
27;1023;18062021130854
28;1023;18062021130854
29;844;18062021130854
30;616;18062021130854
31;457;18062021130854
32;360;18062021130854
33;306;18062021130854
34;274;18062021130854
35;256;18062021130854
36;244;18062021130854
37;246;18062021130854
38;247;18062021130854
39;251;18062021130854
40;254;18062021130854
41;258;18062021130854
42;268;18062021130854
43;272;18062021130854
44;279;18062021130854
45;285;18062021130854
46;285;18062021130854
47;289;18062021130854
48;292;18062021130854
49;290;18062021130854
50;297;18062021130854
51;298;18062021130854
52;299;18062021130854
53;302;18062021130854
54;304;18062021130854
55;307;18062021130854
56;315;18062021130854
57;321;18062021130854
58;326;18062021130854
59;330;18062021130854
60;334;18062021130854
61;341;18062021130854
62;340;18062021130854
63;348;18062021130854
64;348;18062021130854
65;344;18062021130854
66;348;18062021130854
67;340;18062021130854
68;338;18062021130854
69;332;18062021130854
70;325;18062021130854
71;320;18062021130854
72;314;18062021130854
73;303;18062021130854
74;299;18062021130854
75;288;18062021130854
76;280;18062021130854
77;277;18062021130854
78;269;18062021130854
79;264;18062021130854
80;257;18062021130854
81;248;18062021130854
82;247;18062021130854
83;240;18062021130854
84;237;18062021130854
85;234;18062021130854
86;234;18062021130854
87;231;18062021130854
88;229;18062021130854
89;221;18062021130854
90;223;18062021130854
91;220;18062021130854
92;213;18062021130854
93;215;18062021130854
94;210;18062021130854
95;204;18062021130854
96;206;18062021130854
97;200;18062021130854
98;197;18062021130854
99;195;18062021130854
100;188;18062021130854
101;194;18062021130854
102;190;18062021130854
103;185;18062021130854
104;184;18062021130854
105;180;18062021130854
106;184;18062021130854
107;178;18062021130854
108;177;18062021130854
109;177;18062021130854
110;171;18062021130854
111;171;18062021130854
112;174;18062021130854
113;168;18062021130854
114;168;18062021130854
115;170;18062021130854
116;166;18062021130854
117;170;18062021130854
118;165;18062021130854
119;165;18062021130854
120;163;18062021130854
121;159;18062021130854
122;162;18062021130854
123;160;18062021130854
124;159;18062021130854
125;159;18062021130854
126;156;18062021130854
127;158;18062021130854
128;159;18062021130854
129;155;18062021130854
130;156;18062021130854
131;155;18062021130854
132;153;18062021130854
133;159;18062021130854
134;151;18062021130854
135;151;18062021130854
136;154;18062021130854
137;150;18062021130854
138;154;18062021130854
139;150;18062021130854
140;149;18062021130854
141;153;18062021130854
142;149;18062021130854
143;148;18062021130854
144;150;18062021130854
145;147;18062021130854
146;149;18062021130854
147;149;18062021130854
148;147;18062021130854
149;147;18062021130854
150;147;18062021130854
151;149;18062021130854
152;147;18062021130854
153;146;18062021130854
154;148;18062021130854
155;147;18062021130854
156;145;18062021130854
157;145;18062021130854
158;145;18062021130854
159;144;18062021130854
160;145;18062021130854
161;144;18062021130854
162;146;18062021130854
163;146;18062021130854
164;145;18062021130854
165;146;18062021130854
166;144;18062021130854
167;145;18062021130854
168;147;18062021130854
169;141;18062021130854
170;146;18062021130854
171;144;18062021130854
172;144;18062021130854
173;145;18062021130854
174;144;18062021130854
175;142;18062021130854
176;145;18062021130854
177;141;18062021130854
178;145;18062021130854
179;142;18062021130854
180;142;18062021130854
181;145;18062021130854
182;145;18062021130854
183;142;18062021130854
184;144;18062021130854
185;141;18062021130854
186;145;18062021130854
187;144;18062021130854
188;141;18062021130854
189;144;18062021130854
190;142;18062021130854
191;143;18062021130854
192;146;18062021130854
193;142;18062021130854
194;146;18062021130854
195;144;18062021130854
196;143;18062021130854
197;143;18062021130854
198;144;18062021130854
199;141;18062021130854
200;0;18062021130854
0;0;18062021130854
1;165;18062021130854
2;146;18062021130854
3;143;18062021130854
4;144;18062021130854
5;144;18062021130854
6;143;18062021130854
7;145;18062021130854
8;146;18062021130854
9;142;18062021130854
10;147;18062021130854
11;145;18062021130854
12;142;18062021130854
13;146;18062021130854
14;143;18062021130854
15;147;18062021130854
16;146;18062021130854
17;146;18062021130854
18;153;18062021130854
19;160;18062021130854
20;173;18062021130854
21;209;18062021130854
22;301;18062021130854
23;534;18062021130854
24;906;18062021130854
25;1023;18062021130854
26;1023;18062021130854
27;1023;18062021130854
28;1023;18062021130854
29;849;18062021130854
30;612;18062021130854
31;460;18062021130854
32;364;18062021130854
33;304;18062021130854
34;276;18062021130854
35;256;18062021130854
36;244;18062021130854
37;246;18062021130854
38;245;18062021130854
39;251;18062021130854
40;257;18062021130854
41;259;18062021130854
42;269;18062021130854
43;273;18062021130854
44;280;18062021130854
45;287;18062021130854
46;287;18062021130854
47;290;18062021130854
48;291;18062021130854
49;291;18062021130854
50;294;18062021130854
51;294;18062021130854
52;298;18062021130854
53;303;18062021130854
54;307;18062021130854
55;309;18062021130854
56;316;18062021130854
57;318;18062021130854
58;326;18062021130854
59;335;18062021130854
60;337;18062021130854
61;342;18062021130854
62;344;18062021130854
63;349;18062021130854
64;351;18062021130854
65;345;18062021130854
66;350;18062021130854
67;342;18062021130854
68;338;18062021130854
69;332;18062021130854
70;325;18062021130854
71;320;18062021130854
72;317;18062021130854
73;306;18062021130854
74;298;18062021130854
75;288;18062021130854
76;281;18062021130854
77;275;18062021130854
78;270;18062021130854
79;264;18062021130854
80;259;18062021130854
81;248;18062021130854
82;246;18062021130854
83;241;18062021130854
84;238;18062021130854
85;235;18062021130854
86;234;18062021130854
87;231;18062021130854
88;228;18062021130854
89;225;18062021130854
90;224;18062021130854
91;220;18062021130854
92;217;18062021130854
93;216;18062021130854
94;210;18062021130854
95;204;18062021130854
96;205;18062021130854
97;200;18062021130854
98;197;18062021130854
99;194;18062021130854
100;191;18062021130854
101;195;18062021130854
102;190;18062021130854
103;186;18062021130854
104;185;18062021130854
105;180;18062021130854
106;184;18062021130854
107;179;18062021130854
108;177;18062021130854
109;178;18062021130854
110;173;18062021130854
111;173;18062021130854
112;173;18062021130854
113;169;18062021130854
114;169;18062021130854
115;169;18062021130854
116;166;18062021130854
117;169;18062021130854
118;164;18062021130854
119;166;18062021130854
120;162;18062021130854
121;161;18062021130854
122;162;18062021130854
123;161;18062021130854
124;159;18062021130854
125;160;18062021130854
126;157;18062021130854
127;158;18062021130854
128;161;18062021130854
129;157;18062021130854
130;157;18062021130854
131;157;18062021130854
132;152;18062021130854
133;160;18062021130854
134;152;18062021130854
135;152;18062021130854
136;154;18062021130854
137;151;18062021130854
138;154;18062021130854
139;151;18062021130854
140;151;18062021130854
141;152;18062021130854
142;149;18062021130854
143;150;18062021130854
144;151;18062021130854
145;149;18062021130854
146;150;18062021130854
147;151;18062021130854
148;148;18062021130854
149;148;18062021130854
150;148;18062021130854
151;147;18062021130854
152;146;18062021130854
153;145;18062021130854
154;147;18062021130854
155;148;18062021130854
156;146;18062021130854
157;146;18062021130854
158;145;18062021130854
159;146;18062021130854
160;146;18062021130854
161;144;18062021130854
162;147;18062021130854
163;146;18062021130854
164;146;18062021130854
165;147;18062021130854
166;144;18062021130854
167;145;18062021130854
168;147;18062021130854
169;142;18062021130854
170;146;18062021130854
171;144;18062021130854
172;144;18062021130854
173;146;18062021130854
174;144;18062021130854
175;144;18062021130854
176;145;18062021130854
177;143;18062021130854
178;146;18062021130854
179;144;18062021130854
180;143;18062021130854
181;144;18062021130854
182;145;18062021130854
183;143;18062021130854
184;145;18062021130854
185;141;18062021130854
186;146;18062021130854
187;144;18062021130854
188;143;18062021130854
189;144;18062021130854
190;142;18062021130854
191;145;18062021130854
192;147;18062021130854
193;143;18062021130854
194;145;18062021130854
195;144;18062021130854
196;143;18062021130854
197;144;18062021130854
198;144;18062021130854
199;143;18062021130854
200;0;18062021130854
0;0;18062021130855
1;165;18062021130855
2;146;18062021130855
3;144;18062021130855
4;144;18062021130855
5;146;18062021130855
6;144;18062021130855
7;146;18062021130855
8;146;18062021130855
9;142;18062021130855
10;146;18062021130855
11;143;18062021130855
12;143;18062021130855
13;146;18062021130855
14;145;18062021130855
15;147;18062021130855
16;147;18062021130855
17;146;18062021130855
18;153;18062021130855
19;156;18062021130855
20;172;18062021130855
21;207;18062021130855
22;302;18062021130855
23;531;18062021130855
24;908;18062021130855
25;1023;18062021130855
26;1023;18062021130855
27;1023;18062021130855
28;1023;18062021130855
29;847;18062021130855
30;614;18062021130855
31;455;18062021130855
32;361;18062021130855
33;305;18062021130855
34;275;18062021130855
35;256;18062021130855
36;245;18062021130855
37;244;18062021130855
38;244;18062021130855
39;251;18062021130855
40;256;18062021130855
41;259;18062021130855
42;270;18062021130855
43;272;18062021130855
44;280;18062021130855
45;287;18062021130855
46;288;18062021130855
47;289;18062021130855
48;292;18062021130855
49;292;18062021130855
50;298;18062021130855
51;297;18062021130855
52;294;18062021130855
53;302;18062021130855
54;306;18062021130855
55;310;18062021130855
56;315;18062021130855
57;316;18062021130855
58;327;18062021130855
59;330;18062021130855
60;337;18062021130855
61;343;18062021130855
62;342;18062021130855
63;346;18062021130855
64;351;18062021130855
65;345;18062021130855
66;349;18062021130855
67;344;18062021130855
68;339;18062021130855
69;335;18062021130855
70;327;18062021130855
71;318;18062021130855
72;315;18062021130855
73;301;18062021130855
74;299;18062021130855
75;288;18062021130855
76;283;18062021130855
77;277;18062021130855
78;267;18062021130855
79;262;18062021130855
80;256;18062021130855
81;247;18062021130855
82;248;18062021130855
83;241;18062021130855
84;236;18062021130855
85;234;18062021130855
86;232;18062021130855
87;233;18062021130855
88;231;18062021130855
89;224;18062021130855
90;224;18062021130855
91;218;18062021130855
92;215;18062021130855
93;216;18062021130855
94;210;18062021130855
95;206;18062021130855
96;202;18062021130855
97;201;18062021130855
98;198;18062021130855
99;195;18062021130855
100;192;18062021130855
101;196;18062021130855
102;190;18062021130855
103;186;18062021130855
104;186;18062021130855
105;180;18062021130855
106;183;18062021130855
107;177;18062021130855
108;179;18062021130855
109;179;18062021130855
110;172;18062021130855
111;172;18062021130855
112;172;18062021130855
113;169;18062021130855
114;169;18062021130855
115;169;18062021130855
116;167;18062021130855
117;169;18062021130855
118;164;18062021130855
119;165;18062021130855
120;164;18062021130855
121;161;18062021130855
122;162;18062021130855
123;160;18062021130855
124;158;18062021130855
125;160;18062021130855
126;156;18062021130855
127;158;18062021130855
128;159;18062021130855
129;157;18062021130855
130;156;18062021130855
131;156;18062021130855
132;152;18062021130855
133;159;18062021130855
134;153;18062021130855
135;153;18062021130855
136;155;18062021130855
137;151;18062021130855
138;154;18062021130855
139;152;18062021130855
140;150;18062021130855
141;152;18062021130855
142;149;18062021130855
143;147;18062021130855
144;152;18062021130855
145;147;18062021130855
146;151;18062021130855
147;151;18062021130855
148;148;18062021130855
149;149;18062021130855
150;148;18062021130855
151;149;18062021130855
152;147;18062021130855
153;145;18062021130855
154;148;18062021130855
155;147;18062021130855
156;146;18062021130855
157;145;18062021130855
158;145;18062021130855
159;144;18062021130855
160;145;18062021130855
161;144;18062021130855
162;146;18062021130855
163;146;18062021130855
164;145;18062021130855
165;147;18062021130855
166;143;18062021130855
167;145;18062021130855
168;147;18062021130855
169;142;18062021130855
170;146;18062021130855
171;145;18062021130855
172;143;18062021130855
173;146;18062021130855
174;144;18062021130855
175;142;18062021130855
176;145;18062021130855
177;143;18062021130855
178;146;18062021130855
179;143;18062021130855
180;142;18062021130855
181;144;18062021130855
182;146;18062021130855
183;143;18062021130855
184;145;18062021130855
185;139;18062021130855
186;146;18062021130855
187;143;18062021130855
188;142;18062021130855
189;144;18062021130855
190;143;18062021130855
191;144;18062021130855
192;147;18062021130855
193;142;18062021130855
194;145;18062021130855
195;143;18062021130855
196;142;18062021130855
197;143;18062021130855
198;144;18062021130855
199;143;18062021130855
200;0;18062021130855
0;0;18062021130855
1;165;18062021130855
2;145;18062021130855
3;143;18062021130855
4;145;18062021130855
5;145;18062021130855
6;143;18062021130855
7;146;18062021130855
8;145;18062021130855
9;142;18062021130855
10;145;18062021130855
11;144;18062021130855
12;143;18062021130855
13;147;18062021130855
14;144;18062021130855
15;148;18062021130855
16;147;18062021130855
17;147;18062021130855
18;153;18062021130855
19;158;18062021130855
20;171;18062021130855
21;207;18062021130855
22;304;18062021130855
23;527;18062021130855
24;899;18062021130855
25;1023;18062021130855
26;1023;18062021130855
27;1023;18062021130855
28;1023;18062021130855
29;841;18062021130855
30;612;18062021130855
31;458;18062021130855
32;360;18062021130855
33;305;18062021130855
34;275;18062021130855
35;256;18062021130855
36;246;18062021130855
37;247;18062021130855
38;244;18062021130855
39;250;18062021130855
40;254;18062021130855
41;258;18062021130855
42;269;18062021130855
43;271;18062021130855
44;278;18062021130855
45;283;18062021130855
46;286;18062021130855
47;288;18062021130855
48;290;18062021130855
49;289;18062021130855
50;294;18062021130855
51;296;18062021130855
52;299;18062021130855
53;304;18062021130855
54;305;18062021130855
55;308;18062021130855
56;313;18062021130855
57;319;18062021130855
58;324;18062021130855
59;332;18062021130855
60;336;18062021130855
61;339;18062021130855
62;341;18062021130855
63;345;18062021130855
64;348;18062021130855
65;341;18062021130855
66;346;18062021130855
67;337;18062021130855
68;338;18062021130855
69;337;18062021130855
70;327;18062021130855
71;322;18062021130855
72;316;18062021130855
73;302;18062021130855
74;299;18062021130855
75;288;18062021130855
76;282;18062021130855
77;278;18062021130855
78;269;18062021130855
79;263;18062021130855
80;257;18062021130855
81;249;18062021130855
82;246;18062021130855
83;239;18062021130855
84;237;18062021130855
85;234;18062021130855
86;233;18062021130855
87;233;18062021130855
88;227;18062021130855
89;223;18062021130855
90;226;18062021130855
91;222;18062021130855
92;215;18062021130855
93;215;18062021130855
94;210;18062021130855
95;204;18062021130855
96;204;18062021130855
97;200;18062021130855
98;198;18062021130855
99;196;18062021130855
100;190;18062021130855
101;194;18062021130855
102;190;18062021130855
103;186;18062021130855
104;185;18062021130855
105;181;18062021130855
106;182;18062021130855
107;179;18062021130855
108;177;18062021130855
109;178;18062021130855
110;171;18062021130855
111;171;18062021130855
112;174;18062021130855
113;168;18062021130855
114;169;18062021130855
115;170;18062021130855
116;167;18062021130855
117;169;18062021130855
118;165;18062021130855
119;165;18062021130855
120;163;18062021130855
121;161;18062021130855
122;161;18062021130855
123;161;18062021130855
124;159;18062021130855
125;160;18062021130855
126;157;18062021130855
127;157;18062021130855
128;160;18062021130855
129;156;18062021130855
130;155;18062021130855
131;155;18062021130855
132;152;18062021130855
133;160;18062021130855
134;153;18062021130855
135;154;18062021130855
136;154;18062021130855
137;150;18062021130855
138;154;18062021130855
139;150;18062021130855
140;150;18062021130855
141;153;18062021130855
142;150;18062021130855
143;148;18062021130855
144;151;18062021130855
145;148;18062021130855
146;150;18062021130855
147;150;18062021130855
148;149;18062021130855
149;147;18062021130855
150;149;18062021130855
151;148;18062021130855
152;147;18062021130855
153;146;18062021130855
154;147;18062021130855
155;146;18062021130855
156;145;18062021130855
157;147;18062021130855
158;144;18062021130855
159;145;18062021130855
160;146;18062021130855
161;145;18062021130855
162;147;18062021130855
163;147;18062021130855
164;144;18062021130855
165;147;18062021130855
166;145;18062021130855
167;146;18062021130855
168;147;18062021130855
169;142;18062021130855
170;146;18062021130855
171;145;18062021130855
172;143;18062021130855
173;146;18062021130855
174;142;18062021130855
175;143;18062021130855
176;145;18062021130855
177;143;18062021130855
178;146;18062021130855
179;145;18062021130855
180;144;18062021130855
181;145;18062021130855
182;145;18062021130855
183;142;18062021130855
184;144;18062021130855
185;141;18062021130855
186;145;18062021130855
187;145;18062021130855
188;142;18062021130855
189;145;18062021130855
190;143;18062021130855
191;144;18062021130855
192;148;18062021130855
193;141;18062021130855
194;144;18062021130855
195;144;18062021130855
196;142;18062021130855
197;143;18062021130855
198;144;18062021130855
199;143;18062021130855
200;0;18062021130855
0;0;18062021130856
1;165;18062021130856
2;147;18062021130856
3;144;18062021130856
4;145;18062021130856
5;145;18062021130856
6;143;18062021130856
7;146;18062021130856
8;145;18062021130856
9;142;18062021130856
10;146;18062021130856
11;144;18062021130856
12;143;18062021130856
13;146;18062021130856
14;144;18062021130856
15;147;18062021130856
16;147;18062021130856
17;146;18062021130856
18;153;18062021130856
19;159;18062021130856
20;173;18062021130856
21;208;18062021130856
22;304;18062021130856
23;532;18062021130856
24;901;18062021130856
25;1023;18062021130856
26;1023;18062021130856
27;1023;18062021130856
28;1023;18062021130856
29;854;18062021130856
30;618;18062021130856
31;459;18062021130856
32;364;18062021130856
33;305;18062021130856
34;277;18062021130856
35;257;18062021130856
36;245;18062021130856
37;248;18062021130856
38;246;18062021130856
39;252;18062021130856
40;257;18062021130856
41;259;18062021130856
42;268;18062021130856
43;274;18062021130856
44;278;18062021130856
45;288;18062021130856
46;287;18062021130856
47;289;18062021130856
48;291;18062021130856
49;291;18062021130856
50;295;18062021130856
51;299;18062021130856
52;299;18062021130856
53;304;18062021130856
54;302;18062021130856
55;307;18062021130856
56;313;18062021130856
57;319;18062021130856
58;327;18062021130856
59;330;18062021130856
60;336;18062021130856
61;342;18062021130856
62;342;18062021130856
63;344;18062021130856
64;350;18062021130856
65;344;18062021130856
66;347;18062021130856
67;345;18062021130856
68;338;18062021130856
69;333;18062021130856
70;328;18062021130856
71;321;18062021130856
72;316;18062021130856
73;306;18062021130856
74;301;18062021130856
75;289;18062021130856
76;285;18062021130856
77;277;18062021130856
78;269;18062021130856
79;266;18062021130856
80;258;18062021130856
81;249;18062021130856
82;246;18062021130856
83;240;18062021130856
84;236;18062021130856
85;237;18062021130856
86;234;18062021130856
87;232;18062021130856
88;229;18062021130856
89;221;18062021130856
90;225;18062021130856
91;220;18062021130856
92;217;18062021130856
93;215;18062021130856
94;211;18062021130856
95;206;18062021130856
96;206;18062021130856
97;201;18062021130856
98;197;18062021130856
99;196;18062021130856
100;190;18062021130856
101;194;18062021130856
102;188;18062021130856
103;186;18062021130856
104;186;18062021130856
105;181;18062021130856
106;182;18062021130856
107;178;18062021130856
108;177;18062021130856
109;177;18062021130856
110;171;18062021130856
111;173;18062021130856
112;173;18062021130856
113;168;18062021130856
114;168;18062021130856
115;169;18062021130856
116;168;18062021130856
117;169;18062021130856
118;165;18062021130856
119;165;18062021130856
120;161;18062021130856
121;161;18062021130856
122;162;18062021130856
123;162;18062021130856
124;159;18062021130856
125;160;18062021130856
126;156;18062021130856
127;159;18062021130856
128;161;18062021130856
129;155;18062021130856
130;157;18062021130856
131;157;18062021130856
132;153;18062021130856
133;160;18062021130856
134;152;18062021130856
135;152;18062021130856
136;154;18062021130856
137;151;18062021130856
138;154;18062021130856
139;150;18062021130856
140;150;18062021130856
141;152;18062021130856
142;149;18062021130856
143;148;18062021130856
144;150;18062021130856
145;149;18062021130856
146;151;18062021130856
147;150;18062021130856
148;148;18062021130856
149;148;18062021130856
150;149;18062021130856
151;148;18062021130856
152;146;18062021130856
153;146;18062021130856
154;148;18062021130856
155;148;18062021130856
156;146;18062021130856
157;146;18062021130856
158;144;18062021130856
159;144;18062021130856
160;145;18062021130856
161;145;18062021130856
162;146;18062021130856
163;146;18062021130856
164;146;18062021130856
165;147;18062021130856
166;145;18062021130856
167;145;18062021130856
168;147;18062021130856
169;142;18062021130856
170;146;18062021130856
171;145;18062021130856
172;144;18062021130856
173;146;18062021130856
174;145;18062021130856
175;143;18062021130856
176;146;18062021130856
177;142;18062021130856
178;147;18062021130856
179;145;18062021130856
180;143;18062021130856
181;145;18062021130856
182;146;18062021130856
183;144;18062021130856
184;146;18062021130856
185;142;18062021130856
186;146;18062021130856
187;144;18062021130856
188;143;18062021130856
189;145;18062021130856
190;143;18062021130856
191;144;18062021130856
192;147;18062021130856
193;142;18062021130856
194;146;18062021130856
195;144;18062021130856
196;142;18062021130856
197;144;18062021130856
198;145;18062021130856
199;143;18062021130856
200;0;18062021130856
0;0;18062021130856
1;165;18062021130856
2;146;18062021130856
3;144;18062021130856
4;145;18062021130856
5;145;18062021130856
6;142;18062021130856
7;144;18062021130856
8;145;18062021130856
9;143;18062021130856
10;146;18062021130856
11;143;18062021130856
12;144;18062021130856
13;148;18062021130856
14;145;18062021130856
15;147;18062021130856
16;147;18062021130856
17;147;18062021130856
18;153;18062021130856
19;158;18062021130856
20;172;18062021130856
21;206;18062021130856
22;301;18062021130856
23;531;18062021130856
24;902;18062021130856
25;1023;18062021130856
26;1023;18062021130856
27;1023;18062021130856
28;1023;18062021130856
29;848;18062021130856
30;616;18062021130856
31;460;18062021130856
32;362;18062021130856
33;305;18062021130856
34;276;18062021130856
35;257;18062021130856
36;247;18062021130856
37;249;18062021130856
38;246;18062021130856
39;252;18062021130856
40;257;18062021130856
41;258;18062021130856
42;268;18062021130856
43;271;18062021130856
44;278;18062021130856
45;284;18062021130856
46;288;18062021130856
47;292;18062021130856
48;290;18062021130856
49;289;18062021130856
50;296;18062021130856
51;300;18062021130856
52;295;18062021130856
53;305;18062021130856
54;305;18062021130856
55;309;18062021130856
56;316;18062021130856
57;317;18062021130856
58;328;18062021130856
59;333;18062021130856
60;334;18062021130856
61;342;18062021130856
62;342;18062021130856
63;349;18062021130856
64;353;18062021130856
65;346;18062021130856
66;350;18062021130856
67;343;18062021130856
68;340;18062021130856
69;333;18062021130856
70;325;18062021130856
71;320;18062021130856
72;316;18062021130856
73;303;18062021130856
74;300;18062021130856
75;289;18062021130856
76;283;18062021130856
77;279;18062021130856
78;270;18062021130856
79;263;18062021130856
80;257;18062021130856
81;249;18062021130856
82;247;18062021130856
83;241;18062021130856
84;238;18062021130856
85;237;18062021130856
86;233;18062021130856
87;233;18062021130856
88;231;18062021130856
89;222;18062021130856
90;227;18062021130856
91;221;18062021130856
92;215;18062021130856
93;217;18062021130856
94;209;18062021130856
95;206;18062021130856
96;204;18062021130856
97;201;18062021130856
98;198;18062021130856
99;196;18062021130856
100;190;18062021130856
101;195;18062021130856
102;190;18062021130856
103;185;18062021130856
104;186;18062021130856
105;181;18062021130856
106;182;18062021130856
107;179;18062021130856
108;177;18062021130856
109;178;18062021130856
110;172;18062021130856
111;171;18062021130856
112;174;18062021130856
113;169;18062021130856
114;168;18062021130856
115;169;18062021130856
116;168;18062021130856
117;169;18062021130856
118;165;18062021130856
119;166;18062021130856
120;163;18062021130856
121;160;18062021130856
122;162;18062021130856
123;160;18062021130856
124;159;18062021130856
125;160;18062021130856
126;157;18062021130856
127;159;18062021130856
128;161;18062021130856
129;156;18062021130856
130;156;18062021130856
131;155;18062021130856
132;153;18062021130856
133;159;18062021130856
134;152;18062021130856
135;152;18062021130856
136;153;18062021130856
137;150;18062021130856
138;154;18062021130856
139;152;18062021130856
140;150;18062021130856
141;153;18062021130856
142;150;18062021130856
143;148;18062021130856
144;152;18062021130856
145;148;18062021130856
146;150;18062021130856
147;151;18062021130856
148;147;18062021130856
149;148;18062021130856
150;148;18062021130856
151;148;18062021130856
152;146;18062021130856
153;145;18062021130856
154;148;18062021130856
155;147;18062021130856
156;146;18062021130856
157;146;18062021130856
158;145;18062021130856
159;145;18062021130856
160;145;18062021130856
161;144;18062021130856
162;145;18062021130856
163;146;18062021130856
164;145;18062021130856
165;147;18062021130856
166;146;18062021130856
167;146;18062021130856
168;148;18062021130856
169;142;18062021130856
170;147;18062021130856
171;144;18062021130856
172;143;18062021130856
173;146;18062021130856
174;144;18062021130856
175;144;18062021130856
176;145;18062021130856
177;143;18062021130856
178;146;18062021130856
179;144;18062021130856
180;143;18062021130856
181;146;18062021130856
182;145;18062021130856
183;143;18062021130856
184;144;18062021130856
185;141;18062021130856
186;147;18062021130856
187;145;18062021130856
188;142;18062021130856
189;144;18062021130856
190;143;18062021130856
191;144;18062021130856
192;147;18062021130856
193;142;18062021130856
194;145;18062021130856
195;144;18062021130856
196;142;18062021130856
197;143;18062021130856
198;144;18062021130856
199;141;18062021130856
200;0;18062021130856
0;0;18062021130857
1;165;18062021130857
2;146;18062021130857
3;143;18062021130857
4;145;18062021130857
5;144;18062021130857
6;143;18062021130857
7;145;18062021130857
8;145;18062021130857
9;143;18062021130857
10;146;18062021130857
11;144;18062021130857
12;143;18062021130857
13;146;18062021130857
14;144;18062021130857
15;146;18062021130857
16;148;18062021130857
17;147;18062021130857
18;153;18062021130857
19;159;18062021130857
20;170;18062021130857
21;207;18062021130857
22;302;18062021130857
23;528;18062021130857
24;898;18062021130857
25;1023;18062021130857
26;1023;18062021130857
27;1023;18062021130857
28;1023;18062021130857
29;850;18062021130857
30;618;18062021130857
31;458;18062021130857
32;362;18062021130857
33;305;18062021130857
34;276;18062021130857
35;257;18062021130857
36;244;18062021130857
37;247;18062021130857
38;243;18062021130857
39;250;18062021130857
40;256;18062021130857
41;260;18062021130857
42;267;18062021130857
43;272;18062021130857
44;278;18062021130857
45;286;18062021130857
46;287;18062021130857
47;289;18062021130857
48;292;18062021130857
49;294;18062021130857
50;296;18062021130857
51;296;18062021130857
52;296;18062021130857
53;304;18062021130857
54;305;18062021130857
55;309;18062021130857
56;315;18062021130857
57;317;18062021130857
58;327;18062021130857
59;333;18062021130857
60;335;18062021130857
61;343;18062021130857
62;341;18062021130857
63;347;18062021130857
64;350;18062021130857
65;344;18062021130857
66;345;18062021130857
67;344;18062021130857
68;335;18062021130857
69;336;18062021130857
70;326;18062021130857
71;319;18062021130857
72;316;18062021130857
73;302;18062021130857
74;299;18062021130857
75;288;18062021130857
76;283;18062021130857
77;277;18062021130857
78;269;18062021130857
79;266;18062021130857
80;259;18062021130857
81;248;18062021130857
82;246;18062021130857
83;242;18062021130857
84;237;18062021130857
85;236;18062021130857
86;236;18062021130857
87;231;18062021130857
88;229;18062021130857
89;222;18062021130857
90;226;18062021130857
91;221;18062021130857
92;215;18062021130857
93;215;18062021130857
94;211;18062021130857
95;204;18062021130857
96;202;18062021130857
97;200;18062021130857
98;196;18062021130857
99;195;18062021130857
100;192;18062021130857
101;197;18062021130857
102;192;18062021130857
103;187;18062021130857
104;185;18062021130857
105;182;18062021130857
106;181;18062021130857
107;179;18062021130857
108;177;18062021130857
109;178;18062021130857
110;174;18062021130857
111;171;18062021130857
112;173;18062021130857
113;168;18062021130857
114;168;18062021130857
115;170;18062021130857
116;167;18062021130857
117;170;18062021130857
118;166;18062021130857
119;166;18062021130857
120;163;18062021130857
121;160;18062021130857
122;161;18062021130857
123;159;18062021130857
124;160;18062021130857
125;160;18062021130857
126;158;18062021130857
127;160;18062021130857
128;159;18062021130857
129;157;18062021130857
130;156;18062021130857
131;157;18062021130857
132;153;18062021130857
133;160;18062021130857
134;153;18062021130857
135;153;18062021130857
136;155;18062021130857
137;152;18062021130857
138;154;18062021130857
139;151;18062021130857
140;149;18062021130857
141;152;18062021130857
142;150;18062021130857
143;149;18062021130857
144;151;18062021130857
145;148;18062021130857
146;151;18062021130857
147;151;18062021130857
148;146;18062021130857
149;148;18062021130857
150;147;18062021130857
151;147;18062021130857
152;147;18062021130857
153;145;18062021130857
154;148;18062021130857
155;147;18062021130857
156;145;18062021130857
157;145;18062021130857
158;146;18062021130857
159;143;18062021130857
160;146;18062021130857
161;145;18062021130857
162;147;18062021130857
163;146;18062021130857
164;144;18062021130857
165;147;18062021130857
166;145;18062021130857
167;146;18062021130857
168;148;18062021130857
169;142;18062021130857
170;146;18062021130857
171;144;18062021130857
172;144;18062021130857
173;146;18062021130857
174;144;18062021130857
175;144;18062021130857
176;145;18062021130857
177;143;18062021130857
178;147;18062021130857
179;145;18062021130857
180;143;18062021130857
181;145;18062021130857
182;146;18062021130857
183;143;18062021130857
184;145;18062021130857
185;141;18062021130857
186;147;18062021130857
187;143;18062021130857
188;142;18062021130857
189;145;18062021130857
190;142;18062021130857
191;144;18062021130857
192;148;18062021130857
193;143;18062021130857
194;145;18062021130857
195;144;18062021130857
196;142;18062021130857
197;143;18062021130857
198;143;18062021130857
199;143;18062021130857
200;0;18062021130857
0;0;18062021130857
1;166;18062021130857
2;147;18062021130857
3;143;18062021130857
4;146;18062021130857
5;146;18062021130857
6;143;18062021130857
7;147;18062021130857
8;146;18062021130857
9;143;18062021130857
10;147;18062021130857
11;143;18062021130857
12;143;18062021130857
13;148;18062021130857
14;145;18062021130857
15;148;18062021130857
16;148;18062021130857
17;147;18062021130857
18;154;18062021130857
19;158;18062021130857
20;173;18062021130857
21;208;18062021130857
22;303;18062021130857
23;528;18062021130857
24;892;18062021130857
25;1023;18062021130857
26;1023;18062021130857
27;1023;18062021130857
28;1023;18062021130857
29;853;18062021130857
30;614;18062021130857
31;464;18062021130857
32;362;18062021130857
33;306;18062021130857
34;277;18062021130857
35;258;18062021130857
36;246;18062021130857
37;245;18062021130857
38;245;18062021130857
39;252;18062021130857
40;259;18062021130857
41;259;18062021130857
42;270;18062021130857
43;274;18062021130857
44;279;18062021130857
45;286;18062021130857
46;288;18062021130857
47;290;18062021130857
48;290;18062021130857
49;292;18062021130857
50;295;18062021130857
51;295;18062021130857
52;301;18062021130857
53;306;18062021130857
54;306;18062021130857
55;310;18062021130857
56;314;18062021130857
57;318;18062021130857
58;325;18062021130857
59;330;18062021130857
60;333;18062021130857
61;342;18062021130857
62;341;18062021130857
63;347;18062021130857
64;350;18062021130857
65;344;18062021130857
66;346;18062021130857
67;344;18062021130857
68;337;18062021130857
69;335;18062021130857
70;327;18062021130857
71;322;18062021130857
72;314;18062021130857
73;302;18062021130857
74;301;18062021130857
75;289;18062021130857
76;282;18062021130857
77;279;18062021130857
78;269;18062021130857
79;264;18062021130857
80;257;18062021130857
81;247;18062021130857
82;248;18062021130857
83;241;18062021130857
84;240;18062021130857
85;236;18062021130857
86;232;18062021130857
87;233;18062021130857
88;229;18062021130857
89;223;18062021130857
90;225;18062021130857
91;222;18062021130857
92;215;18062021130857
93;218;18062021130857
94;212;18062021130857
95;206;18062021130857
96;205;18062021130857
97;201;18062021130857
98;197;18062021130857
99;196;18062021130857
100;189;18062021130857
101;195;18062021130857
102;192;18062021130857
103;187;18062021130857
104;184;18062021130857
105;182;18062021130857
106;183;18062021130857
107;181;18062021130857
108;178;18062021130857
109;179;18062021130857
110;174;18062021130857
111;173;18062021130857
112;174;18062021130857
113;168;18062021130857
114;170;18062021130857
115;170;18062021130857
116;167;18062021130857
117;170;18062021130857
118;166;18062021130857
119;167;18062021130857
120;165;18062021130857
121;162;18062021130857
122;163;18062021130857
123;162;18062021130857
124;160;18062021130857
125;160;18062021130857
126;158;18062021130857
127;159;18062021130857
128;162;18062021130857
129;158;18062021130857
130;157;18062021130857
131;158;18062021130857
132;155;18062021130857
133;160;18062021130857
134;153;18062021130857
135;154;18062021130857
136;156;18062021130857
137;152;18062021130857
138;155;18062021130857
139;152;18062021130857
140;151;18062021130857
141;153;18062021130857
142;151;18062021130857
143;149;18062021130857
144;152;18062021130857
145;150;18062021130857
146;152;18062021130857
147;151;18062021130857
148;148;18062021130857
149;149;18062021130857
150;149;18062021130857
151;150;18062021130857
152;147;18062021130857
153;146;18062021130857
154;150;18062021130857
155;147;18062021130857
156;146;18062021130857
157;148;18062021130857
158;144;18062021130857
159;145;18062021130857
160;147;18062021130857
161;145;18062021130857
162;147;18062021130857
163;147;18062021130857
164;147;18062021130857
165;148;18062021130857
166;145;18062021130857
167;146;18062021130857
168;148;18062021130857
169;142;18062021130857
170;146;18062021130857
171;144;18062021130857
172;144;18062021130857
173;146;18062021130857
174;144;18062021130857
175;144;18062021130857
176;147;18062021130857
177;144;18062021130857
178;147;18062021130857
179;145;18062021130857
180;146;18062021130857
181;146;18062021130857
182;146;18062021130857
183;143;18062021130857
184;146;18062021130857
185;142;18062021130857
186;147;18062021130857
187;144;18062021130857
188;143;18062021130857
189;145;18062021130857
190;144;18062021130857
191;145;18062021130857
192;148;18062021130857
193;143;18062021130857
194;146;18062021130857
195;145;18062021130857
196;143;18062021130857
197;144;18062021130857
198;145;18062021130857
199;143;18062021130857
200;0;18062021130857
