ind;val;datetime
0;0;29062021162748
1;142;29062021162748
2;130;29062021162748
3;127;29062021162748
4;129;29062021162748
5;129;29062021162748
6;128;29062021162748
7;129;29062021162748
8;131;29062021162748
9;129;29062021162748
10;134;29062021162748
11;132;29062021162748
12;133;29062021162748
13;139;29062021162748
14;140;29062021162748
15;145;29062021162748
16;152;29062021162748
17;167;29062021162748
18;197;29062021162748
19;262;29062021162748
20;400;29062021162748
21;735;29062021162748
22;1023;29062021162748
23;1023;29062021162748
24;1023;29062021162748
25;1023;29062021162748
26;1023;29062021162748
27;1023;29062021162748
28;1023;29062021162748
29;1023;29062021162748
30;1023;29062021162748
31;1023;29062021162748
32;1023;29062021162748
33;1023;29062021162748
34;1020;29062021162748
35;817;29062021162748
36;618;29062021162748
37;488;29062021162748
38;396;29062021162748
39;338;29062021162748
40;298;29062021162748
41;267;29062021162748
42;257;29062021162748
43;245;29062021162748
44;242;29062021162748
45;242;29062021162748
46;240;29062021162748
47;238;29062021162748
48;238;29062021162748
49;234;29062021162748
50;234;29062021162748
51;232;29062021162748
52;231;29062021162748
53;236;29062021162748
54;234;29062021162748
55;236;29062021162748
56;239;29062021162748
57;242;29062021162748
58;248;29062021162748
59;250;29062021162748
60;254;29062021162748
61;260;29062021162748
62;261;29062021162748
63;262;29062021162748
64;266;29062021162748
65;262;29062021162748
66;267;29062021162748
67;261;29062021162748
68;260;29062021162748
69;258;29062021162748
70;251;29062021162748
71;249;29062021162748
72;246;29062021162748
73;239;29062021162748
74;237;29062021162748
75;228;29062021162748
76;225;29062021162748
77;221;29062021162748
78;215;29062021162748
79;212;29062021162748
80;207;29062021162748
81;200;29062021162748
82;200;29062021162748
83;195;29062021162748
84;191;29062021162748
85;192;29062021162748
86;187;29062021162748
87;188;29062021162748
88;186;29062021162748
89;181;29062021162748
90;182;29062021162748
91;178;29062021162748
92;174;29062021162748
93;175;29062021162748
94;171;29062021162748
95;167;29062021162748
96;168;29062021162748
97;164;29062021162748
98;162;29062021162748
99;161;29062021162748
100;156;29062021162748
101;159;29062021162748
102;154;29062021162748
103;152;29062021162748
104;153;29062021162748
105;149;29062021162748
106;151;29062021162748
107;147;29062021162748
108;146;29062021162748
109;147;29062021162748
110;144;29062021162748
111;143;29062021162748
112;144;29062021162748
113;140;29062021162748
114;141;29062021162748
115;142;29062021162748
116;139;29062021162748
117;141;29062021162748
118;138;29062021162748
119;138;29062021162748
120;137;29062021162748
121;135;29062021162748
122;136;29062021162748
123;135;29062021162748
124;133;29062021162748
125;134;29062021162748
126;131;29062021162748
127;133;29062021162748
128;134;29062021162748
129;131;29062021162748
130;131;29062021162748
131;130;29062021162748
132;128;29062021162748
133;132;29062021162748
134;127;29062021162748
135;128;29062021162748
136;129;29062021162748
137;126;29062021162748
138;129;29062021162748
139;127;29062021162748
140;126;29062021162748
141;128;29062021162748
142;126;29062021162748
143;125;29062021162748
144;127;29062021162748
145;123;29062021162748
146;126;29062021162748
147;126;29062021162748
148;124;29062021162748
149;124;29062021162748
150;125;29062021162748
151;125;29062021162748
152;124;29062021162748
153;122;29062021162748
154;125;29062021162748
155;124;29062021162748
156;123;29062021162748
157;124;29062021162748
158;122;29062021162748
159;123;29062021162748
160;124;29062021162748
161;122;29062021162748
162;123;29062021162748
163;123;29062021162748
164;122;29062021162748
165;124;29062021162748
166;122;29062021162748
167;123;29062021162748
168;125;29062021162748
169;121;29062021162748
170;123;29062021162748
171;121;29062021162748
172;121;29062021162748
173;123;29062021162748
174;121;29062021162748
175;120;29062021162748
176;123;29062021162748
177;120;29062021162748
178;123;29062021162748
179;122;29062021162748
180;121;29062021162748
181;122;29062021162748
182;122;29062021162748
183;121;29062021162748
184;122;29062021162748
185;119;29062021162748
186;123;29062021162748
187;122;29062021162748
188;121;29062021162748
189;121;29062021162748
190;120;29062021162748
191;121;29062021162748
192;124;29062021162748
193;120;29062021162748
194;122;29062021162748
195;121;29062021162748
196;120;29062021162748
197;122;29062021162748
198;122;29062021162748
199;121;29062021162748
200;0;29062021162748
0;0;29062021162749
1;142;29062021162749
2;128;29062021162749
3;127;29062021162749
4;128;29062021162749
5;128;29062021162749
6;126;29062021162749
7;129;29062021162749
8;132;29062021162749
9;130;29062021162749
10;133;29062021162749
11;132;29062021162749
12;133;29062021162749
13;138;29062021162749
14;140;29062021162749
15;145;29062021162749
16;153;29062021162749
17;165;29062021162749
18;198;29062021162749
19;257;29062021162749
20;395;29062021162749
21;729;29062021162749
22;1023;29062021162749
23;1023;29062021162749
24;1023;29062021162749
25;1023;29062021162749
26;1023;29062021162749
27;1023;29062021162749
28;1023;29062021162749
29;1023;29062021162749
30;1023;29062021162749
31;1023;29062021162749
32;1023;29062021162749
33;1023;29062021162749
34;1021;29062021162749
35;821;29062021162749
36;626;29062021162749
37;490;29062021162749
38;400;29062021162749
39;341;29062021162749
40;298;29062021162749
41;271;29062021162749
42;259;29062021162749
43;244;29062021162749
44;242;29062021162749
45;240;29062021162749
46;238;29062021162749
47;239;29062021162749
48;239;29062021162749
49;231;29062021162749
50;236;29062021162749
51;232;29062021162749
52;231;29062021162749
53;235;29062021162749
54;236;29062021162749
55;237;29062021162749
56;241;29062021162749
57;241;29062021162749
58;248;29062021162749
59;249;29062021162749
60;256;29062021162749
61;258;29062021162749
62;259;29062021162749
63;263;29062021162749
64;264;29062021162749
65;259;29062021162749
66;266;29062021162749
67;264;29062021162749
68;259;29062021162749
69;260;29062021162749
70;253;29062021162749
71;248;29062021162749
72;249;29062021162749
73;237;29062021162749
74;236;29062021162749
75;228;29062021162749
76;227;29062021162749
77;222;29062021162749
78;214;29062021162749
79;211;29062021162749
80;208;29062021162749
81;199;29062021162749
82;199;29062021162749
83;194;29062021162749
84;191;29062021162749
85;189;29062021162749
86;187;29062021162749
87;186;29062021162749
88;185;29062021162749
89;179;29062021162749
90;180;29062021162749
91;176;29062021162749
92;174;29062021162749
93;173;29062021162749
94;170;29062021162749
95;165;29062021162749
96;166;29062021162749
97;164;29062021162749
98;162;29062021162749
99;159;29062021162749
100;157;29062021162749
101;160;29062021162749
102;155;29062021162749
103;152;29062021162749
104;152;29062021162749
105;148;29062021162749
106;152;29062021162749
107;148;29062021162749
108;146;29062021162749
109;145;29062021162749
110;142;29062021162749
111;143;29062021162749
112;143;29062021162749
113;140;29062021162749
114;141;29062021162749
115;140;29062021162749
116;139;29062021162749
117;141;29062021162749
118;136;29062021162749
119;137;29062021162749
120;136;29062021162749
121;134;29062021162749
122;135;29062021162749
123;135;29062021162749
124;134;29062021162749
125;134;29062021162749
126;131;29062021162749
127;132;29062021162749
128;133;29062021162749
129;130;29062021162749
130;130;29062021162749
131;131;29062021162749
132;128;29062021162749
133;132;29062021162749
134;128;29062021162749
135;127;29062021162749
136;128;29062021162749
137;125;29062021162749
138;128;29062021162749
139;127;29062021162749
140;125;29062021162749
141;127;29062021162749
142;126;29062021162749
143;125;29062021162749
144;127;29062021162749
145;123;29062021162749
146;126;29062021162749
147;125;29062021162749
148;123;29062021162749
149;123;29062021162749
150;123;29062021162749
151;124;29062021162749
152;124;29062021162749
153;122;29062021162749
154;125;29062021162749
155;123;29062021162749
156;122;29062021162749
157;122;29062021162749
158;122;29062021162749
159;122;29062021162749
160;123;29062021162749
161;121;29062021162749
162;123;29062021162749
163;123;29062021162749
164;122;29062021162749
165;124;29062021162749
166;122;29062021162749
167;122;29062021162749
168;123;29062021162749
169;120;29062021162749
170;122;29062021162749
171;121;29062021162749
172;122;29062021162749
173;122;29062021162749
174;122;29062021162749
175;120;29062021162749
176;122;29062021162749
177;120;29062021162749
178;123;29062021162749
179;121;29062021162749
180;120;29062021162749
181;122;29062021162749
182;122;29062021162749
183;120;29062021162749
184;122;29062021162749
185;120;29062021162749
186;124;29062021162749
187;121;29062021162749
188;119;29062021162749
189;120;29062021162749
190;119;29062021162749
191;121;29062021162749
192;122;29062021162749
193;121;29062021162749
194;121;29062021162749
195;121;29062021162749
196;120;29062021162749
197;121;29062021162749
198;121;29062021162749
199;119;29062021162749
200;0;29062021162749
0;0;29062021162749
1;143;29062021162749
2;128;29062021162749
3;126;29062021162749
4;128;29062021162749
5;130;29062021162749
6;127;29062021162749
7;130;29062021162749
8;131;29062021162749
9;129;29062021162749
10;134;29062021162749
11;132;29062021162749
12;133;29062021162749
13;138;29062021162749
14;138;29062021162749
15;146;29062021162749
16;153;29062021162749
17;166;29062021162749
18;197;29062021162749
19;260;29062021162749
20;396;29062021162749
21;722;29062021162749
22;1023;29062021162749
23;1023;29062021162749
24;1023;29062021162749
25;1023;29062021162749
26;1023;29062021162749
27;1023;29062021162749
28;1023;29062021162749
29;1023;29062021162749
30;1023;29062021162749
31;1023;29062021162749
32;1023;29062021162749
33;1023;29062021162749
34;1022;29062021162749
35;824;29062021162749
36;625;29062021162749
37;488;29062021162749
38;399;29062021162749
39;338;29062021162749
40;299;29062021162749
41;271;29062021162749
42;260;29062021162749
43;246;29062021162749
44;240;29062021162749
45;240;29062021162749
46;238;29062021162749
47;237;29062021162749
48;237;29062021162749
49;233;29062021162749
50;234;29062021162749
51;231;29062021162749
52;228;29062021162749
53;235;29062021162749
54;234;29062021162749
55;237;29062021162749
56;238;29062021162749
57;245;29062021162749
58;247;29062021162749
59;250;29062021162749
60;251;29062021162749
61;257;29062021162749
62;258;29062021162749
63;260;29062021162749
64;267;29062021162749
65;263;29062021162749
66;261;29062021162749
67;261;29062021162749
68;261;29062021162749
69;258;29062021162749
70;250;29062021162749
71;248;29062021162749
72;245;29062021162749
73;238;29062021162749
74;236;29062021162749
75;229;29062021162749
76;225;29062021162749
77;222;29062021162749
78;214;29062021162749
79;212;29062021162749
80;208;29062021162749
81;200;29062021162749
82;199;29062021162749
83;193;29062021162749
84;191;29062021162749
85;190;29062021162749
86;189;29062021162749
87;187;29062021162749
88;187;29062021162749
89;180;29062021162749
90;180;29062021162749
91;178;29062021162749
92;174;29062021162749
93;174;29062021162749
94;172;29062021162749
95;167;29062021162749
96;166;29062021162749
97;163;29062021162749
98;162;29062021162749
99;162;29062021162749
100;156;29062021162749
101;158;29062021162749
102;155;29062021162749
103;152;29062021162749
104;153;29062021162749
105;148;29062021162749
106;151;29062021162749
107;147;29062021162749
108;147;29062021162749
109;148;29062021162749
110;143;29062021162749
111;143;29062021162749
112;144;29062021162749
113;141;29062021162749
114;140;29062021162749
115;141;29062021162749
116;140;29062021162749
117;141;29062021162749
118;138;29062021162749
119;138;29062021162749
120;138;29062021162749
121;134;29062021162749
122;135;29062021162749
123;135;29062021162749
124;134;29062021162749
125;135;29062021162749
126;132;29062021162749
127;133;29062021162749
128;135;29062021162749
129;131;29062021162749
130;130;29062021162749
131;131;29062021162749
132;128;29062021162749
133;133;29062021162749
134;128;29062021162749
135;129;29062021162749
136;129;29062021162749
137;127;29062021162749
138;128;29062021162749
139;128;29062021162749
140;125;29062021162749
141;128;29062021162749
142;125;29062021162749
143;125;29062021162749
144;127;29062021162749
145;124;29062021162749
146;126;29062021162749
147;127;29062021162749
148;124;29062021162749
149;126;29062021162749
150;123;29062021162749
151;125;29062021162749
152;124;29062021162749
153;123;29062021162749
154;125;29062021162749
155;124;29062021162749
156;123;29062021162749
157;124;29062021162749
158;123;29062021162749
159;123;29062021162749
160;123;29062021162749
161;122;29062021162749
162;122;29062021162749
163;122;29062021162749
164;122;29062021162749
165;124;29062021162749
166;123;29062021162749
167;123;29062021162749
168;124;29062021162749
169;120;29062021162749
170;123;29062021162749
171;122;29062021162749
172;122;29062021162749
173;123;29062021162749
174;120;29062021162749
175;120;29062021162749
176;123;29062021162749
177;120;29062021162749
178;124;29062021162749
179;121;29062021162749
180;121;29062021162749
181;122;29062021162749
182;123;29062021162749
183;120;29062021162749
184;122;29062021162749
185;119;29062021162749
186;122;29062021162749
187;121;29062021162749
188;120;29062021162749
189;122;29062021162749
190;121;29062021162749
191;121;29062021162749
192;124;29062021162749
193;122;29062021162749
194;122;29062021162749
195;121;29062021162749
196;121;29062021162749
197;121;29062021162749
198;122;29062021162749
199;120;29062021162749
200;0;29062021162749
0;0;29062021162750
1;143;29062021162750
2;128;29062021162750
3;126;29062021162750
4;128;29062021162750
5;130;29062021162750
6;127;29062021162750
7;129;29062021162750
8;131;29062021162750
9;129;29062021162750
10;133;29062021162750
11;132;29062021162750
12;134;29062021162750
13;139;29062021162750
14;139;29062021162750
15;145;29062021162750
16;153;29062021162750
17;166;29062021162750
18;199;29062021162750
19;259;29062021162750
20;393;29062021162750
21;722;29062021162750
22;1023;29062021162750
23;1023;29062021162750
24;1023;29062021162750
25;1023;29062021162750
26;1023;29062021162750
27;1023;29062021162750
28;1023;29062021162750
29;1023;29062021162750
30;1023;29062021162750
31;1023;29062021162750
32;1023;29062021162750
33;1023;29062021162750
34;1023;29062021162750
35;832;29062021162750
36;624;29062021162750
37;491;29062021162750
38;398;29062021162750
39;335;29062021162750
40;298;29062021162750
41;271;29062021162750
42;258;29062021162750
43;246;29062021162750
44;243;29062021162750
45;242;29062021162750
46;240;29062021162750
47;239;29062021162750
48;235;29062021162750
49;233;29062021162750
50;235;29062021162750
51;232;29062021162750
52;231;29062021162750
53;235;29062021162750
54;234;29062021162750
55;235;29062021162750
56;239;29062021162750
57;244;29062021162750
58;247;29062021162750
59;249;29062021162750
60;254;29062021162750
61;259;29062021162750
62;258;29062021162750
63;260;29062021162750
64;266;29062021162750
65;262;29062021162750
66;265;29062021162750
67;262;29062021162750
68;258;29062021162750
69;258;29062021162750
70;254;29062021162750
71;249;29062021162750
72;246;29062021162750
73;239;29062021162750
74;236;29062021162750
75;228;29062021162750
76;225;29062021162750
77;221;29062021162750
78;215;29062021162750
79;210;29062021162750
80;208;29062021162750
81;200;29062021162750
82;200;29062021162750
83;193;29062021162750
84;192;29062021162750
85;190;29062021162750
86;186;29062021162750
87;186;29062021162750
88;186;29062021162750
89;180;29062021162750
90;181;29062021162750
91;177;29062021162750
92;173;29062021162750
93;173;29062021162750
94;169;29062021162750
95;166;29062021162750
96;168;29062021162750
97;162;29062021162750
98;164;29062021162750
99;161;29062021162750
100;157;29062021162750
101;159;29062021162750
102;153;29062021162750
103;154;29062021162750
104;153;29062021162750
105;149;29062021162750
106;151;29062021162750
107;147;29062021162750
108;147;29062021162750
109;147;29062021162750
110;143;29062021162750
111;143;29062021162750
112;145;29062021162750
113;140;29062021162750
114;140;29062021162750
115;140;29062021162750
116;138;29062021162750
117;141;29062021162750
118;138;29062021162750
119;139;29062021162750
120;136;29062021162750
121;134;29062021162750
122;137;29062021162750
123;135;29062021162750
124;133;29062021162750
125;133;29062021162750
126;133;29062021162750
127;132;29062021162750
128;133;29062021162750
129;131;29062021162750
130;130;29062021162750
131;131;29062021162750
132;128;29062021162750
133;133;29062021162750
134;127;29062021162750
135;127;29062021162750
136;129;29062021162750
137;126;29062021162750
138;129;29062021162750
139;127;29062021162750
140;125;29062021162750
141;127;29062021162750
142;125;29062021162750
143;125;29062021162750
144;127;29062021162750
145;123;29062021162750
146;127;29062021162750
147;125;29062021162750
148;124;29062021162750
149;125;29062021162750
150;124;29062021162750
151;124;29062021162750
152;124;29062021162750
153;122;29062021162750
154;123;29062021162750
155;123;29062021162750
156;122;29062021162750
157;123;29062021162750
158;122;29062021162750
159;121;29062021162750
160;123;29062021162750
161;123;29062021162750
162;124;29062021162750
163;123;29062021162750
164;122;29062021162750
165;124;29062021162750
166;122;29062021162750
167;122;29062021162750
168;124;29062021162750
169;120;29062021162750
170;125;29062021162750
171;122;29062021162750
172;121;29062021162750
173;123;29062021162750
174;122;29062021162750
175;120;29062021162750
176;123;29062021162750
177;120;29062021162750
178;123;29062021162750
179;121;29062021162750
180;121;29062021162750
181;122;29062021162750
182;122;29062021162750
183;121;29062021162750
184;122;29062021162750
185;120;29062021162750
186;123;29062021162750
187;121;29062021162750
188;119;29062021162750
189;122;29062021162750
190;121;29062021162750
191;121;29062021162750
192;124;29062021162750
193;121;29062021162750
194;121;29062021162750
195;121;29062021162750
196;120;29062021162750
197;121;29062021162750
198;122;29062021162750
199;120;29062021162750
200;0;29062021162750
0;0;29062021162751
1;143;29062021162751
2;129;29062021162751
3;127;29062021162751
4;128;29062021162751
5;129;29062021162751
6;127;29062021162751
7;129;29062021162751
8;131;29062021162751
9;129;29062021162751
10;134;29062021162751
11;131;29062021162751
12;133;29062021162751
13;138;29062021162751
14;138;29062021162751
15;147;29062021162751
16;153;29062021162751
17;165;29062021162751
18;198;29062021162751
19;258;29062021162751
20;394;29062021162751
21;720;29062021162751
22;1023;29062021162751
23;1023;29062021162751
24;1023;29062021162751
25;1023;29062021162751
26;1023;29062021162751
27;1023;29062021162751
28;1023;29062021162751
29;1023;29062021162751
30;1023;29062021162751
31;1023;29062021162751
32;1023;29062021162751
33;1023;29062021162751
34;1023;29062021162751
35;830;29062021162751
36;629;29062021162751
37;495;29062021162751
38;401;29062021162751
39;338;29062021162751
40;298;29062021162751
41;270;29062021162751
42;260;29062021162751
43;248;29062021162751
44;240;29062021162751
45;242;29062021162751
46;236;29062021162751
47;238;29062021162751
48;239;29062021162751
49;233;29062021162751
50;236;29062021162751
51;233;29062021162751
52;231;29062021162751
53;233;29062021162751
54;234;29062021162751
55;234;29062021162751
56;239;29062021162751
57;239;29062021162751
58;247;29062021162751
59;248;29062021162751
60;256;29062021162751
61;257;29062021162751
62;258;29062021162751
63;262;29062021162751
64;265;29062021162751
65;263;29062021162751
66;265;29062021162751
67;266;29062021162751
68;260;29062021162751
69;257;29062021162751
70;251;29062021162751
71;248;29062021162751
72;245;29062021162751
73;236;29062021162751
74;235;29062021162751
75;229;29062021162751
76;224;29062021162751
77;223;29062021162751
78;215;29062021162751
79;212;29062021162751
80;207;29062021162751
81;200;29062021162751
82;200;29062021162751
83;193;29062021162751
84;191;29062021162751
85;191;29062021162751
86;188;29062021162751
87;188;29062021162751
88;186;29062021162751
89;179;29062021162751
90;181;29062021162751
91;179;29062021162751
92;172;29062021162751
93;174;29062021162751
94;170;29062021162751
95;166;29062021162751
96;167;29062021162751
97;163;29062021162751
98;162;29062021162751
99;160;29062021162751
100;157;29062021162751
101;158;29062021162751
102;156;29062021162751
103;151;29062021162751
104;153;29062021162751
105;149;29062021162751
106;152;29062021162751
107;147;29062021162751
108;147;29062021162751
109;148;29062021162751
110;142;29062021162751
111;142;29062021162751
112;143;29062021162751
113;139;29062021162751
114;140;29062021162751
115;139;29062021162751
116;139;29062021162751
117;141;29062021162751
118;138;29062021162751
119;137;29062021162751
120;136;29062021162751
121;134;29062021162751
122;137;29062021162751
123;136;29062021162751
124;134;29062021162751
125;132;29062021162751
126;131;29062021162751
127;133;29062021162751
128;134;29062021162751
129;129;29062021162751
130;129;29062021162751
131;131;29062021162751
132;128;29062021162751
133;132;29062021162751
134;128;29062021162751
135;127;29062021162751
136;130;29062021162751
137;126;29062021162751
138;129;29062021162751
139;127;29062021162751
140;126;29062021162751
141;129;29062021162751
142;126;29062021162751
143;125;29062021162751
144;127;29062021162751
145;123;29062021162751
146;126;29062021162751
147;126;29062021162751
148;124;29062021162751
149;124;29062021162751
150;125;29062021162751
151;124;29062021162751
152;124;29062021162751
153;123;29062021162751
154;124;29062021162751
155;122;29062021162751
156;122;29062021162751
157;123;29062021162751
158;121;29062021162751
159;122;29062021162751
160;124;29062021162751
161;122;29062021162751
162;125;29062021162751
163;123;29062021162751
164;122;29062021162751
165;124;29062021162751
166;122;29062021162751
167;123;29062021162751
168;124;29062021162751
169;121;29062021162751
170;123;29062021162751
171;122;29062021162751
172;121;29062021162751
173;123;29062021162751
174;121;29062021162751
175;120;29062021162751
176;123;29062021162751
177;120;29062021162751
178;122;29062021162751
179;121;29062021162751
180;121;29062021162751
181;123;29062021162751
182;122;29062021162751
183;120;29062021162751
184;121;29062021162751
185;119;29062021162751
186;122;29062021162751
187;120;29062021162751
188;119;29062021162751
189;122;29062021162751
190;120;29062021162751
191;121;29062021162751
192;124;29062021162751
193;122;29062021162751
194;121;29062021162751
195;122;29062021162751
196;120;29062021162751
197;122;29062021162751
198;122;29062021162751
199;120;29062021162751
200;0;29062021162751
0;0;29062021162751
1;142;29062021162751
2;129;29062021162751
3;127;29062021162751
4;127;29062021162751
5;129;29062021162751
6;128;29062021162751
7;129;29062021162751
8;131;29062021162751
9;128;29062021162751
10;132;29062021162751
11;131;29062021162751
12;132;29062021162751
13;137;29062021162751
14;139;29062021162751
15;146;29062021162751
16;152;29062021162751
17;165;29062021162751
18;199;29062021162751
19;258;29062021162751
20;394;29062021162751
21;720;29062021162751
22;1023;29062021162751
23;1023;29062021162751
24;1023;29062021162751
25;1023;29062021162751
26;1023;29062021162751
27;1023;29062021162751
28;1023;29062021162751
29;1023;29062021162751
30;1023;29062021162751
31;1023;29062021162751
32;1023;29062021162751
33;1023;29062021162751
34;1023;29062021162751
35;830;29062021162751
36;628;29062021162751
37;497;29062021162751
38;404;29062021162751
39;342;29062021162751
40;299;29062021162751
41;270;29062021162751
42;256;29062021162751
43;245;29062021162751
44;242;29062021162751
45;240;29062021162751
46;238;29062021162751
47;237;29062021162751
48;237;29062021162751
49;234;29062021162751
50;234;29062021162751
51;232;29062021162751
52;230;29062021162751
53;233;29062021162751
54;235;29062021162751
55;236;29062021162751
56;240;29062021162751
57;242;29062021162751
58;247;29062021162751
59;249;29062021162751
60;253;29062021162751
61;257;29062021162751
62;259;29062021162751
63;263;29062021162751
64;264;29062021162751
65;260;29062021162751
66;262;29062021162751
67;261;29062021162751
68;261;29062021162751
69;258;29062021162751
70;251;29062021162751
71;248;29062021162751
72;246;29062021162751
73;238;29062021162751
74;234;29062021162751
75;227;29062021162751
76;222;29062021162751
77;221;29062021162751
78;214;29062021162751
79;210;29062021162751
80;207;29062021162751
81;201;29062021162751
82;199;29062021162751
83;193;29062021162751
84;191;29062021162751
85;191;29062021162751
86;187;29062021162751
87;186;29062021162751
88;186;29062021162751
89;179;29062021162751
90;182;29062021162751
91;179;29062021162751
92;174;29062021162751
93;175;29062021162751
94;172;29062021162751
95;167;29062021162751
96;166;29062021162751
97;163;29062021162751
98;161;29062021162751
99;159;29062021162751
100;157;29062021162751
101;157;29062021162751
102;155;29062021162751
103;153;29062021162751
104;152;29062021162751
105;148;29062021162751
106;152;29062021162751
107;147;29062021162751
108;146;29062021162751
109;146;29062021162751
110;144;29062021162751
111;143;29062021162751
112;145;29062021162751
113;139;29062021162751
114;140;29062021162751
115;140;29062021162751
116;139;29062021162751
117;140;29062021162751
118;137;29062021162751
119;137;29062021162751
120;136;29062021162751
121;134;29062021162751
122;135;29062021162751
123;134;29062021162751
124;134;29062021162751
125;134;29062021162751
126;131;29062021162751
127;133;29062021162751
128;133;29062021162751
129;130;29062021162751
130;130;29062021162751
131;131;29062021162751
132;128;29062021162751
133;133;29062021162751
134;129;29062021162751
135;128;29062021162751
136;129;29062021162751
137;126;29062021162751
138;128;29062021162751
139;127;29062021162751
140;125;29062021162751
141;127;29062021162751
142;125;29062021162751
143;124;29062021162751
144;127;29062021162751
145;124;29062021162751
146;127;29062021162751
147;126;29062021162751
148;124;29062021162751
149;124;29062021162751
150;125;29062021162751
151;124;29062021162751
152;124;29062021162751
153;122;29062021162751
154;125;29062021162751
155;123;29062021162751
156;122;29062021162751
157;124;29062021162751
158;122;29062021162751
159;122;29062021162751
160;122;29062021162751
161;121;29062021162751
162;123;29062021162751
163;123;29062021162751
164;122;29062021162751
165;123;29062021162751
166;122;29062021162751
167;122;29062021162751
168;123;29062021162751
169;120;29062021162751
170;123;29062021162751
171;122;29062021162751
172;121;29062021162751
173;123;29062021162751
174;121;29062021162751
175;121;29062021162751
176;123;29062021162751
177;121;29062021162751
178;124;29062021162751
179;121;29062021162751
180;121;29062021162751
181;122;29062021162751
182;121;29062021162751
183;120;29062021162751
184;122;29062021162751
185;120;29062021162751
186;123;29062021162751
187;122;29062021162751
188;119;29062021162751
189;122;29062021162751
190;120;29062021162751
191;121;29062021162751
192;124;29062021162751
193;121;29062021162751
194;122;29062021162751
195;121;29062021162751
196;121;29062021162751
197;121;29062021162751
198;121;29062021162751
199;120;29062021162751
200;0;29062021162751
0;0;29062021162752
1;142;29062021162752
2;129;29062021162752
3;126;29062021162752
4;128;29062021162752
5;129;29062021162752
6;128;29062021162752
7;130;29062021162752
8;131;29062021162752
9;130;29062021162752
10;134;29062021162752
11;132;29062021162752
12;133;29062021162752
13;138;29062021162752
14;139;29062021162752
15;146;29062021162752
16;152;29062021162752
17;166;29062021162752
18;199;29062021162752
19;259;29062021162752
20;393;29062021162752
21;713;29062021162752
22;1023;29062021162752
23;1023;29062021162752
24;1023;29062021162752
25;1023;29062021162752
26;1023;29062021162752
27;1023;29062021162752
28;1023;29062021162752
29;1023;29062021162752
30;1023;29062021162752
31;1023;29062021162752
32;1023;29062021162752
33;1023;29062021162752
34;1023;29062021162752
35;836;29062021162752
36;632;29062021162752
37;498;29062021162752
38;404;29062021162752
39;339;29062021162752
40;300;29062021162752
41;268;29062021162752
42;257;29062021162752
43;248;29062021162752
44;242;29062021162752
45;241;29062021162752
46;239;29062021162752
47;236;29062021162752
48;235;29062021162752
49;234;29062021162752
50;233;29062021162752
51;234;29062021162752
52;233;29062021162752
53;236;29062021162752
54;234;29062021162752
55;237;29062021162752
56;238;29062021162752
57;241;29062021162752
58;249;29062021162752
59;250;29062021162752
60;255;29062021162752
61;256;29062021162752
62;258;29062021162752
63;260;29062021162752
64;266;29062021162752
65;259;29062021162752
66;266;29062021162752
67;262;29062021162752
68;258;29062021162752
69;258;29062021162752
70;254;29062021162752
71;247;29062021162752
72;245;29062021162752
73;238;29062021162752
74;237;29062021162752
75;229;29062021162752
76;225;29062021162752
77;220;29062021162752
78;217;29062021162752
79;210;29062021162752
80;209;29062021162752
81;201;29062021162752
82;199;29062021162752
83;193;29062021162752
84;192;29062021162752
85;191;29062021162752
86;188;29062021162752
87;187;29062021162752
88;187;29062021162752
89;181;29062021162752
90;183;29062021162752
91;177;29062021162752
92;175;29062021162752
93;175;29062021162752
94;169;29062021162752
95;166;29062021162752
96;168;29062021162752
97;164;29062021162752
98;161;29062021162752
99;161;29062021162752
100;158;29062021162752
101;160;29062021162752
102;155;29062021162752
103;153;29062021162752
104;151;29062021162752
105;150;29062021162752
106;151;29062021162752
107;147;29062021162752
108;147;29062021162752
109;147;29062021162752
110;142;29062021162752
111;142;29062021162752
112;143;29062021162752
113;140;29062021162752
114;139;29062021162752
115;141;29062021162752
116;139;29062021162752
117;143;29062021162752
118;139;29062021162752
119;138;29062021162752
120;137;29062021162752
121;135;29062021162752
122;136;29062021162752
123;135;29062021162752
124;133;29062021162752
125;135;29062021162752
126;131;29062021162752
127;133;29062021162752
128;134;29062021162752
129;131;29062021162752
130;131;29062021162752
131;130;29062021162752
132;128;29062021162752
133;132;29062021162752
134;127;29062021162752
135;128;29062021162752
136;128;29062021162752
137;126;29062021162752
138;128;29062021162752
139;127;29062021162752
140;126;29062021162752
141;129;29062021162752
142;125;29062021162752
143;125;29062021162752
144;126;29062021162752
145;123;29062021162752
146;127;29062021162752
147;126;29062021162752
148;125;29062021162752
149;125;29062021162752
150;124;29062021162752
151;124;29062021162752
152;124;29062021162752
153;123;29062021162752
154;125;29062021162752
155;124;29062021162752
156;123;29062021162752
157;123;29062021162752
158;122;29062021162752
159;123;29062021162752
160;124;29062021162752
161;122;29062021162752
162;123;29062021162752
163;122;29062021162752
164;121;29062021162752
165;124;29062021162752
166;123;29062021162752
167;124;29062021162752
168;124;29062021162752
169;120;29062021162752
170;123;29062021162752
171;122;29062021162752
172;122;29062021162752
173;124;29062021162752
174;121;29062021162752
175;120;29062021162752
176;122;29062021162752
177;121;29062021162752
178;123;29062021162752
179;122;29062021162752
180;121;29062021162752
181;122;29062021162752
182;121;29062021162752
183;121;29062021162752
184;121;29062021162752
185;120;29062021162752
186;123;29062021162752
187;121;29062021162752
188;119;29062021162752
189;121;29062021162752
190;120;29062021162752
191;121;29062021162752
192;124;29062021162752
193;120;29062021162752
194;121;29062021162752
195;121;29062021162752
196;120;29062021162752
197;122;29062021162752
198;121;29062021162752
199;120;29062021162752
200;0;29062021162752
0;0;29062021162753
1;142;29062021162753
2;128;29062021162753
3;127;29062021162753
4;128;29062021162753
5;129;29062021162753
6;128;29062021162753
7;128;29062021162753
8;131;29062021162753
9;128;29062021162753
10;134;29062021162753
11;133;29062021162753
12;134;29062021162753
13;139;29062021162753
14;140;29062021162753
15;145;29062021162753
16;153;29062021162753
17;166;29062021162753
18;200;29062021162753
19;258;29062021162753
20;396;29062021162753
21;715;29062021162753
22;1023;29062021162753
23;1023;29062021162753
24;1023;29062021162753
25;1023;29062021162753
26;1023;29062021162753
27;1023;29062021162753
28;1023;29062021162753
29;1023;29062021162753
30;1023;29062021162753
31;1023;29062021162753
32;1023;29062021162753
33;1023;29062021162753
34;1023;29062021162753
35;831;29062021162753
36;634;29062021162753
37;499;29062021162753
38;400;29062021162753
39;342;29062021162753
40;298;29062021162753
41;271;29062021162753
42;261;29062021162753
43;245;29062021162753
44;241;29062021162753
45;239;29062021162753
46;238;29062021162753
47;236;29062021162753
48;236;29062021162753
49;233;29062021162753
50;234;29062021162753
51;231;29062021162753
52;227;29062021162753
53;234;29062021162753
54;232;29062021162753
55;237;29062021162753
56;241;29062021162753
57;240;29062021162753
58;248;29062021162753
59;251;29062021162753
60;252;29062021162753
61;257;29062021162753
62;258;29062021162753
63;264;29062021162753
64;266;29062021162753
65;261;29062021162753
66;267;29062021162753
67;261;29062021162753
68;260;29062021162753
69;259;29062021162753
70;252;29062021162753
71;248;29062021162753
72;245;29062021162753
73;240;29062021162753
74;234;29062021162753
75;229;29062021162753
76;225;29062021162753
77;221;29062021162753
78;214;29062021162753
79;209;29062021162753
80;204;29062021162753
81;198;29062021162753
82;198;29062021162753
83;195;29062021162753
84;191;29062021162753
85;191;29062021162753
86;187;29062021162753
87;186;29062021162753
88;187;29062021162753
89;179;29062021162753
90;181;29062021162753
91;177;29062021162753
92;172;29062021162753
93;174;29062021162753
94;171;29062021162753
95;166;29062021162753
96;167;29062021162753
97;163;29062021162753
98;161;29062021162753
99;160;29062021162753
100;156;29062021162753
101;159;29062021162753
102;154;29062021162753
103;153;29062021162753
104;151;29062021162753
105;150;29062021162753
106;150;29062021162753
107;148;29062021162753
108;147;29062021162753
109;147;29062021162753
110;143;29062021162753
111;143;29062021162753
112;144;29062021162753
113;139;29062021162753
114;141;29062021162753
115;141;29062021162753
116;139;29062021162753
117;141;29062021162753
118;138;29062021162753
119;138;29062021162753
120;136;29062021162753
121;135;29062021162753
122;137;29062021162753
123;136;29062021162753
124;133;29062021162753
125;134;29062021162753
126;131;29062021162753
127;133;29062021162753
128;134;29062021162753
129;130;29062021162753
130;132;29062021162753
131;130;29062021162753
132;128;29062021162753
133;133;29062021162753
134;128;29062021162753
135;127;29062021162753
136;129;29062021162753
137;126;29062021162753
138;128;29062021162753
139;127;29062021162753
140;126;29062021162753
141;128;29062021162753
142;127;29062021162753
143;124;29062021162753
144;127;29062021162753
145;124;29062021162753
146;126;29062021162753
147;126;29062021162753
148;125;29062021162753
149;124;29062021162753
150;124;29062021162753
151;124;29062021162753
152;123;29062021162753
153;123;29062021162753
154;125;29062021162753
155;124;29062021162753
156;123;29062021162753
157;123;29062021162753
158;123;29062021162753
159;122;29062021162753
160;125;29062021162753
161;122;29062021162753
162;123;29062021162753
163;123;29062021162753
164;122;29062021162753
165;124;29062021162753
166;122;29062021162753
167;123;29062021162753
168;124;29062021162753
169;120;29062021162753
170;123;29062021162753
171;122;29062021162753
172;120;29062021162753
173;123;29062021162753
174;121;29062021162753
175;121;29062021162753
176;123;29062021162753
177;120;29062021162753
178;123;29062021162753
179;122;29062021162753
180;120;29062021162753
181;122;29062021162753
182;122;29062021162753
183;121;29062021162753
184;122;29062021162753
185;119;29062021162753
186;124;29062021162753
187;122;29062021162753
188;120;29062021162753
189;122;29062021162753
190;121;29062021162753
191;121;29062021162753
192;124;29062021162753
193;121;29062021162753
194;121;29062021162753
195;121;29062021162753
196;119;29062021162753
197;122;29062021162753
198;121;29062021162753
199;120;29062021162753
200;0;29062021162753
0;0;29062021162753
1;143;29062021162753
2;128;29062021162753
3;127;29062021162753
4;127;29062021162753
5;129;29062021162753
6;127;29062021162753
7;129;29062021162753
8;131;29062021162753
9;129;29062021162753
10;133;29062021162753
11;131;29062021162753
12;132;29062021162753
13;138;29062021162753
14;138;29062021162753
15;146;29062021162753
16;153;29062021162753
17;166;29062021162753
18;198;29062021162753
19;257;29062021162753
20;392;29062021162753
21;716;29062021162753
22;1023;29062021162753
23;1023;29062021162753
24;1023;29062021162753
25;1023;29062021162753
26;1023;29062021162753
27;1023;29062021162753
28;1023;29062021162753
29;1023;29062021162753
30;1023;29062021162753
31;1023;29062021162753
32;1023;29062021162753
33;1023;29062021162753
34;1023;29062021162753
35;834;29062021162753
36;631;29062021162753
37;494;29062021162753
38;404;29062021162753
39;342;29062021162753
40;299;29062021162753
41;271;29062021162753
42;256;29062021162753
43;244;29062021162753
44;240;29062021162753
45;239;29062021162753
46;236;29062021162753
47;236;29062021162753
48;235;29062021162753
49;233;29062021162753
50;235;29062021162753
51;232;29062021162753
52;232;29062021162753
53;235;29062021162753
54;232;29062021162753
55;235;29062021162753
56;241;29062021162753
57;241;29062021162753
58;249;29062021162753
59;249;29062021162753
60;253;29062021162753
61;256;29062021162753
62;258;29062021162753
63;262;29062021162753
64;263;29062021162753
65;260;29062021162753
66;262;29062021162753
67;260;29062021162753
68;258;29062021162753
69;258;29062021162753
70;250;29062021162753
71;246;29062021162753
72;243;29062021162753
73;235;29062021162753
74;234;29062021162753
75;228;29062021162753
76;223;29062021162753
77;221;29062021162753
78;216;29062021162753
79;209;29062021162753
80;206;29062021162753
81;198;29062021162753
82;199;29062021162753
83;193;29062021162753
84;190;29062021162753
85;191;29062021162753
86;188;29062021162753
87;186;29062021162753
88;185;29062021162753
89;179;29062021162753
90;182;29062021162753
91;176;29062021162753
92;174;29062021162753
93;173;29062021162753
94;170;29062021162753
95;167;29062021162753
96;166;29062021162753
97;162;29062021162753
98;161;29062021162753
99;160;29062021162753
100;156;29062021162753
101;159;29062021162753
102;154;29062021162753
103;153;29062021162753
104;153;29062021162753
105;151;29062021162753
106;150;29062021162753
107;148;29062021162753
108;147;29062021162753
109;146;29062021162753
110;143;29062021162753
111;144;29062021162753
112;144;29062021162753
113;139;29062021162753
114;140;29062021162753
115;140;29062021162753
116;140;29062021162753
117;141;29062021162753
118;137;29062021162753
119;137;29062021162753
120;136;29062021162753
121;135;29062021162753
122;136;29062021162753
123;134;29062021162753
124;134;29062021162753
125;134;29062021162753
126;131;29062021162753
127;131;29062021162753
128;133;29062021162753
129;130;29062021162753
130;130;29062021162753
131;132;29062021162753
132;128;29062021162753
133;132;29062021162753
134;127;29062021162753
135;127;29062021162753
136;128;29062021162753
137;126;29062021162753
138;128;29062021162753
139;127;29062021162753
140;124;29062021162753
141;128;29062021162753
142;125;29062021162753
143;125;29062021162753
144;127;29062021162753
145;123;29062021162753
146;125;29062021162753
147;125;29062021162753
148;124;29062021162753
149;124;29062021162753
150;124;29062021162753
151;123;29062021162753
152;125;29062021162753
153;122;29062021162753
154;124;29062021162753
155;122;29062021162753
156;122;29062021162753
157;123;29062021162753
158;122;29062021162753
159;122;29062021162753
160;123;29062021162753
161;121;29062021162753
162;123;29062021162753
163;123;29062021162753
164;121;29062021162753
165;123;29062021162753
166;122;29062021162753
167;122;29062021162753
168;123;29062021162753
169;119;29062021162753
170;123;29062021162753
171;121;29062021162753
172;121;29062021162753
173;123;29062021162753
174;121;29062021162753
175;119;29062021162753
176;123;29062021162753
177;120;29062021162753
178;123;29062021162753
179;121;29062021162753
180;121;29062021162753
181;121;29062021162753
182;122;29062021162753
183;121;29062021162753
184;122;29062021162753
185;119;29062021162753
186;122;29062021162753
187;121;29062021162753
188;119;29062021162753
189;121;29062021162753
190;120;29062021162753
191;121;29062021162753
192;123;29062021162753
193;121;29062021162753
194;122;29062021162753
195;121;29062021162753
196;121;29062021162753
197;122;29062021162753
198;122;29062021162753
199;120;29062021162753
200;0;29062021162753
0;0;29062021162754
1;142;29062021162754
2;129;29062021162754
3;127;29062021162754
4;129;29062021162754
5;128;29062021162754
6;128;29062021162754
7;130;29062021162754
8;131;29062021162754
9;129;29062021162754
10;133;29062021162754
11;132;29062021162754
12;133;29062021162754
13;138;29062021162754
14;140;29062021162754
15;145;29062021162754
16;153;29062021162754
17;164;29062021162754
18;195;29062021162754
19;257;29062021162754
20;390;29062021162754
21;718;29062021162754
22;1023;29062021162754
23;1023;29062021162754
24;1023;29062021162754
25;1023;29062021162754
26;1023;29062021162754
27;1023;29062021162754
28;1023;29062021162754
29;1023;29062021162754
30;1023;29062021162754
31;1023;29062021162754
32;1023;29062021162754
33;1023;29062021162754
34;1023;29062021162754
35;835;29062021162754
36;628;29062021162754
37;491;29062021162754
38;401;29062021162754
39;339;29062021162754
40;298;29062021162754
41;271;29062021162754
42;258;29062021162754
43;247;29062021162754
44;241;29062021162754
45;240;29062021162754
46;238;29062021162754
47;235;29062021162754
48;238;29062021162754
49;234;29062021162754
50;234;29062021162754
51;233;29062021162754
52;231;29062021162754
53;232;29062021162754
54;233;29062021162754
55;235;29062021162754
56;238;29062021162754
57;240;29062021162754
58;245;29062021162754
59;250;29062021162754
60;253;29062021162754
61;259;29062021162754
62;258;29062021162754
63;261;29062021162754
64;264;29062021162754
65;260;29062021162754
66;263;29062021162754
67;260;29062021162754
68;257;29062021162754
69;256;29062021162754
70;251;29062021162754
71;246;29062021162754
72;246;29062021162754
73;236;29062021162754
74;234;29062021162754
75;229;29062021162754
76;223;29062021162754
77;220;29062021162754
78;214;29062021162754
79;212;29062021162754
80;205;29062021162754
81;201;29062021162754
82;200;29062021162754
83;193;29062021162754
84;191;29062021162754
85;191;29062021162754
86;187;29062021162754
87;187;29062021162754
88;186;29062021162754
89;180;29062021162754
90;181;29062021162754
91;177;29062021162754
92;174;29062021162754
93;175;29062021162754
94;170;29062021162754
95;166;29062021162754
96;167;29062021162754
97;162;29062021162754
98;162;29062021162754
99;160;29062021162754
100;157;29062021162754
101;157;29062021162754
102;155;29062021162754
103;152;29062021162754
104;151;29062021162754
105;149;29062021162754
106;152;29062021162754
107;148;29062021162754
108;147;29062021162754
109;147;29062021162754
110;143;29062021162754
111;143;29062021162754
112;144;29062021162754
113;140;29062021162754
114;142;29062021162754
115;141;29062021162754
116;139;29062021162754
117;142;29062021162754
118;137;29062021162754
119;137;29062021162754
120;137;29062021162754
121;133;29062021162754
122;135;29062021162754
123;135;29062021162754
124;133;29062021162754
125;135;29062021162754
126;131;29062021162754
127;132;29062021162754
128;134;29062021162754
129;131;29062021162754
130;130;29062021162754
131;130;29062021162754
132;128;29062021162754
133;133;29062021162754
134;128;29062021162754
135;128;29062021162754
136;130;29062021162754
137;126;29062021162754
138;127;29062021162754
139;127;29062021162754
140;127;29062021162754
141;127;29062021162754
142;125;29062021162754
143;126;29062021162754
144;127;29062021162754
145;125;29062021162754
146;128;29062021162754
147;127;29062021162754
148;123;29062021162754
149;125;29062021162754
150;124;29062021162754
151;125;29062021162754
152;125;29062021162754
153;123;29062021162754
154;126;29062021162754
155;124;29062021162754
156;123;29062021162754
157;123;29062021162754
158;122;29062021162754
159;122;29062021162754
160;123;29062021162754
161;122;29062021162754
162;124;29062021162754
163;124;29062021162754
164;123;29062021162754
165;125;29062021162754
166;122;29062021162754
167;123;29062021162754
168;124;29062021162754
169;120;29062021162754
170;123;29062021162754
171;122;29062021162754
172;122;29062021162754
173;125;29062021162754
174;121;29062021162754
175;121;29062021162754
176;122;29062021162754
177;121;29062021162754
178;125;29062021162754
179;123;29062021162754
180;120;29062021162754
181;123;29062021162754
182;123;29062021162754
183;121;29062021162754
184;123;29062021162754
185;119;29062021162754
186;124;29062021162754
187;123;29062021162754
188;120;29062021162754
189;122;29062021162754
190;121;29062021162754
191;122;29062021162754
192;124;29062021162754
193;121;29062021162754
194;122;29062021162754
195;121;29062021162754
196;121;29062021162754
197;122;29062021162754
198;122;29062021162754
199;121;29062021162754
200;0;29062021162754
