ind;val;datetime
0;0;29062021130759
1;141;29062021130759
2;125;29062021130759
3;124;29062021130759
4;125;29062021130759
5;126;29062021130759
6;124;29062021130759
7;124;29062021130759
8;127;29062021130759
9;126;29062021130759
10;129;29062021130759
11;128;29062021130759
12;129;29062021130759
13;132;29062021130759
14;133;29062021130759
15;138;29062021130759
16;144;29062021130759
17;151;29062021130759
18;174;29062021130759
19;218;29062021130759
20;319;29062021130759
21;590;29062021130759
22;1023;29062021130759
23;1023;29062021130759
24;1023;29062021130759
25;1023;29062021130759
26;1023;29062021130759
27;1023;29062021130759
28;1023;29062021130759
29;1023;29062021130759
30;1023;29062021130759
31;1023;29062021130759
32;1023;29062021130759
33;1023;29062021130759
34;1023;29062021130759
35;953;29062021130759
36;746;29062021130759
37;585;29062021130759
38;476;29062021130759
39;401;29062021130759
40;347;29062021130759
41;304;29062021130759
42;287;29062021130759
43;268;29062021130759
44;256;29062021130759
45;250;29062021130759
46;245;29062021130759
47;243;29062021130759
48;245;29062021130759
49;244;29062021130759
50;244;29062021130759
51;246;29062021130759
52;246;29062021130759
53;252;29062021130759
54;253;29062021130759
55;259;29062021130759
56;262;29062021130759
57;265;29062021130759
58;276;29062021130759
59;276;29062021130759
60;285;29062021130759
61;294;29062021130759
62;293;29062021130759
63;302;29062021130759
64;301;29062021130759
65;301;29062021130759
66;308;29062021130759
67;304;29062021130759
68;301;29062021130759
69;302;29062021130759
70;294;29062021130759
71;292;29062021130759
72;288;29062021130759
73;280;29062021130759
74;278;29062021130759
75;270;29062021130759
76;263;29062021130759
77;257;29062021130759
78;252;29062021130759
79;247;29062021130759
80;243;29062021130759
81;231;29062021130759
82;231;29062021130759
83;223;29062021130759
84;222;29062021130759
85;220;29062021130759
86;217;29062021130759
87;215;29062021130759
88;215;29062021130759
89;209;29062021130759
90;211;29062021130759
91;207;29062021130759
92;202;29062021130759
93;201;29062021130759
94;197;29062021130759
95;191;29062021130759
96;190;29062021130759
97;186;29062021130759
98;183;29062021130759
99;181;29062021130759
100;177;29062021130759
101;178;29062021130759
102;172;29062021130759
103;171;29062021130759
104;170;29062021130759
105;165;29062021130759
106;167;29062021130759
107;163;29062021130759
108;162;29062021130759
109;162;29062021130759
110;158;29062021130759
111;158;29062021130759
112;157;29062021130759
113;152;29062021130759
114;153;29062021130759
115;153;29062021130759
116;151;29062021130759
117;152;29062021130759
118;146;29062021130759
119;147;29062021130759
120;146;29062021130759
121;144;29062021130759
122;145;29062021130759
123;143;29062021130759
124;141;29062021130759
125;142;29062021130759
126;139;29062021130759
127;138;29062021130759
128;142;29062021130759
129;137;29062021130759
130;138;29062021130759
131;137;29062021130759
132;133;29062021130759
133;137;29062021130759
134;133;29062021130759
135;132;29062021130759
136;133;29062021130759
137;130;29062021130759
138;132;29062021130759
139;131;29062021130759
140;129;29062021130759
141;131;29062021130759
142;128;29062021130759
143;127;29062021130759
144;129;29062021130759
145;125;29062021130759
146;128;29062021130759
147;126;29062021130759
148;126;29062021130759
149;125;29062021130759
150;125;29062021130759
151;126;29062021130759
152;124;29062021130759
153;123;29062021130759
154;126;29062021130759
155;122;29062021130759
156;123;29062021130759
157;124;29062021130759
158;122;29062021130759
159;122;29062021130759
160;123;29062021130759
161;122;29062021130759
162;124;29062021130759
163;123;29062021130759
164;122;29062021130759
165;124;29062021130759
166;123;29062021130759
167;122;29062021130759
168;123;29062021130759
169;120;29062021130759
170;123;29062021130759
171;122;29062021130759
172;121;29062021130759
173;122;29062021130759
174;120;29062021130759
175;120;29062021130759
176;122;29062021130759
177;119;29062021130759
178;121;29062021130759
179;121;29062021130759
180;121;29062021130759
181;121;29062021130759
182;121;29062021130759
183;119;29062021130759
184;120;29062021130759
185;118;29062021130759
186;121;29062021130759
187;120;29062021130759
188;119;29062021130759
189;120;29062021130759
190;120;29062021130759
191;120;29062021130759
192;123;29062021130759
193;119;29062021130759
194;120;29062021130759
195;119;29062021130759
196;118;29062021130759
197;120;29062021130759
198;120;29062021130759
199;119;29062021130759
200;0;29062021130759
0;0;29062021130759
1;140;29062021130759
2;123;29062021130759
3;123;29062021130759
4;124;29062021130759
5;126;29062021130759
6;123;29062021130759
7;125;29062021130759
8;127;29062021130759
9;125;29062021130759
10;128;29062021130759
11;126;29062021130759
12;128;29062021130759
13;130;29062021130759
14;132;29062021130759
15;138;29062021130759
16;143;29062021130759
17;151;29062021130759
18;175;29062021130759
19;216;29062021130759
20;317;29062021130759
21;589;29062021130759
22;1023;29062021130759
23;1023;29062021130759
24;1023;29062021130759
25;1023;29062021130759
26;1023;29062021130759
27;1023;29062021130759
28;1023;29062021130759
29;1023;29062021130759
30;1023;29062021130759
31;1023;29062021130759
32;1023;29062021130759
33;1023;29062021130759
34;1023;29062021130759
35;963;29062021130759
36;761;29062021130759
37;599;29062021130759
38;486;29062021130759
39;403;29062021130759
40;348;29062021130759
41;310;29062021130759
42;289;29062021130759
43;270;29062021130759
44;256;29062021130759
45;252;29062021130759
46;248;29062021130759
47;242;29062021130759
48;246;29062021130759
49;243;29062021130759
50;248;29062021130759
51;246;29062021130759
52;247;29062021130759
53;254;29062021130759
54;255;29062021130759
55;259;29062021130759
56;264;29062021130759
57;266;29062021130759
58;274;29062021130759
59;280;29062021130759
60;285;29062021130759
61;291;29062021130759
62;295;29062021130759
63;300;29062021130759
64;306;29062021130759
65;303;29062021130759
66;306;29062021130759
67;307;29062021130759
68;304;29062021130759
69;304;29062021130759
70;297;29062021130759
71;292;29062021130759
72;292;29062021130759
73;280;29062021130759
74;276;29062021130759
75;269;29062021130759
76;263;29062021130759
77;260;29062021130759
78;250;29062021130759
79;245;29062021130759
80;240;29062021130759
81;233;29062021130759
82;232;29062021130759
83;224;29062021130759
84;221;29062021130759
85;219;29062021130759
86;219;29062021130759
87;217;29062021130759
88;216;29062021130759
89;210;29062021130759
90;212;29062021130759
91;206;29062021130759
92;200;29062021130759
93;202;29062021130759
94;195;29062021130759
95;190;29062021130759
96;189;29062021130759
97;184;29062021130759
98;182;29062021130759
99;180;29062021130759
100;178;29062021130759
101;178;29062021130759
102;171;29062021130759
103;171;29062021130759
104;170;29062021130759
105;167;29062021130759
106;168;29062021130759
107;163;29062021130759
108;160;29062021130759
109;161;29062021130759
110;157;29062021130759
111;156;29062021130759
112;157;29062021130759
113;152;29062021130759
114;154;29062021130759
115;152;29062021130759
116;150;29062021130759
117;151;29062021130759
118;147;29062021130759
119;147;29062021130759
120;145;29062021130759
121;143;29062021130759
122;144;29062021130759
123;143;29062021130759
124;140;29062021130759
125;142;29062021130759
126;139;29062021130759
127;138;29062021130759
128;139;29062021130759
129;134;29062021130759
130;136;29062021130759
131;137;29062021130759
132;133;29062021130759
133;135;29062021130759
134;132;29062021130759
135;132;29062021130759
136;135;29062021130759
137;130;29062021130759
138;131;29062021130759
139;129;29062021130759
140;128;29062021130759
141;130;29062021130759
142;128;29062021130759
143;127;29062021130759
144;129;29062021130759
145;125;29062021130759
146;127;29062021130759
147;125;29062021130759
148;124;29062021130759
149;125;29062021130759
150;124;29062021130759
151;124;29062021130759
152;125;29062021130759
153;122;29062021130759
154;125;29062021130759
155;123;29062021130759
156;123;29062021130759
157;123;29062021130759
158;121;29062021130759
159;122;29062021130759
160;123;29062021130759
161;121;29062021130759
162;123;29062021130759
163;123;29062021130759
164;121;29062021130759
165;123;29062021130759
166;121;29062021130759
167;122;29062021130759
168;122;29062021130759
169;119;29062021130759
170;122;29062021130759
171;121;29062021130759
172;120;29062021130759
173;121;29062021130759
174;120;29062021130759
175;119;29062021130759
176;121;29062021130759
177;120;29062021130759
178;121;29062021130759
179;119;29062021130759
180;119;29062021130759
181;121;29062021130759
182;121;29062021130759
183;118;29062021130759
184;121;29062021130759
185;117;29062021130759
186;121;29062021130759
187;120;29062021130759
188;118;29062021130759
189;120;29062021130759
190;118;29062021130759
191;118;29062021130759
192;121;29062021130759
193;119;29062021130759
194;119;29062021130759
195;118;29062021130759
196;118;29062021130759
197;119;29062021130759
198;118;29062021130759
199;118;29062021130759
200;0;29062021130759
0;0;29062021130801
1;141;29062021130801
2;124;29062021130801
3;123;29062021130801
4;124;29062021130801
5;125;29062021130801
6;123;29062021130801
7;126;29062021130801
8;127;29062021130801
9;125;29062021130801
10;128;29062021130801
11;127;29062021130801
12;127;29062021130801
13;132;29062021130801
14;132;29062021130801
15;137;29062021130801
16;142;29062021130801
17;149;29062021130801
18;175;29062021130801
19;217;29062021130801
20;321;29062021130801
21;593;29062021130801
22;1023;29062021130801
23;1023;29062021130801
24;1023;29062021130801
25;1023;29062021130801
26;1023;29062021130801
27;1023;29062021130801
28;1023;29062021130801
29;1023;29062021130801
30;1023;29062021130801
31;1023;29062021130801
32;1023;29062021130801
33;1023;29062021130801
34;1023;29062021130801
35;957;29062021130801
36;750;29062021130801
37;596;29062021130801
38;482;29062021130801
39;402;29062021130801
40;345;29062021130801
41;304;29062021130801
42;286;29062021130801
43;265;29062021130801
44;256;29062021130801
45;249;29062021130801
46;242;29062021130801
47;240;29062021130801
48;245;29062021130801
49;240;29062021130801
50;245;29062021130801
51;246;29062021130801
52;247;29062021130801
53;251;29062021130801
54;251;29062021130801
55;257;29062021130801
56;264;29062021130801
57;268;29062021130801
58;278;29062021130801
59;278;29062021130801
60;284;29062021130801
61;292;29062021130801
62;294;29062021130801
63;298;29062021130801
64;305;29062021130801
65;301;29062021130801
66;306;29062021130801
67;303;29062021130801
68;302;29062021130801
69;303;29062021130801
70;295;29062021130801
71;293;29062021130801
72;290;29062021130801
73;280;29062021130801
74;277;29062021130801
75;268;29062021130801
76;262;29062021130801
77;260;29062021130801
78;250;29062021130801
79;244;29062021130801
80;240;29062021130801
81;231;29062021130801
82;231;29062021130801
83;224;29062021130801
84;222;29062021130801
85;217;29062021130801
86;215;29062021130801
87;217;29062021130801
88;217;29062021130801
89;211;29062021130801
90;209;29062021130801
91;207;29062021130801
92;200;29062021130801
93;202;29062021130801
94;198;29062021130801
95;191;29062021130801
96;190;29062021130801
97;185;29062021130801
98;184;29062021130801
99;179;29062021130801
100;176;29062021130801
101;177;29062021130801
102;172;29062021130801
103;171;29062021130801
104;170;29062021130801
105;166;29062021130801
106;166;29062021130801
107;163;29062021130801
108;160;29062021130801
109;161;29062021130801
110;157;29062021130801
111;154;29062021130801
112;157;29062021130801
113;152;29062021130801
114;153;29062021130801
115;152;29062021130801
116;150;29062021130801
117;151;29062021130801
118;147;29062021130801
119;147;29062021130801
120;145;29062021130801
121;144;29062021130801
122;143;29062021130801
123;143;29062021130801
124;140;29062021130801
125;141;29062021130801
126;139;29062021130801
127;138;29062021130801
128;140;29062021130801
129;136;29062021130801
130;136;29062021130801
131;136;29062021130801
132;133;29062021130801
133;137;29062021130801
134;132;29062021130801
135;131;29062021130801
136;133;29062021130801
137;130;29062021130801
138;132;29062021130801
139;130;29062021130801
140;129;29062021130801
141;130;29062021130801
142;129;29062021130801
143;127;29062021130801
144;128;29062021130801
145;126;29062021130801
146;128;29062021130801
147;126;29062021130801
148;125;29062021130801
149;126;29062021130801
150;124;29062021130801
151;124;29062021130801
152;125;29062021130801
153;123;29062021130801
154;125;29062021130801
155;123;29062021130801
156;123;29062021130801
157;123;29062021130801
158;122;29062021130801
159;123;29062021130801
160;124;29062021130801
161;122;29062021130801
162;123;29062021130801
163;123;29062021130801
164;122;29062021130801
165;123;29062021130801
166;120;29062021130801
167;122;29062021130801
168;122;29062021130801
169;119;29062021130801
170;122;29062021130801
171;121;29062021130801
172;121;29062021130801
173;121;29062021130801
174;120;29062021130801
175;118;29062021130801
176;121;29062021130801
177;119;29062021130801
178;121;29062021130801
179;120;29062021130801
180;120;29062021130801
181;121;29062021130801
182;121;29062021130801
183;120;29062021130801
184;120;29062021130801
185;117;29062021130801
186;121;29062021130801
187;119;29062021130801
188;117;29062021130801
189;120;29062021130801
190;119;29062021130801
191;119;29062021130801
192;122;29062021130801
193;119;29062021130801
194;119;29062021130801
195;119;29062021130801
196;117;29062021130801
197;120;29062021130801
198;119;29062021130801
199;119;29062021130801
200;0;29062021130801
0;0;29062021130801
1;141;29062021130801
2;125;29062021130801
3;124;29062021130801
4;124;29062021130801
5;125;29062021130801
6;123;29062021130801
7;124;29062021130801
8;126;29062021130801
9;124;29062021130801
10;128;29062021130801
11;127;29062021130801
12;126;29062021130801
13;131;29062021130801
14;131;29062021130801
15;137;29062021130801
16;143;29062021130801
17;152;29062021130801
18;175;29062021130801
19;219;29062021130801
20;318;29062021130801
21;585;29062021130801
22;1023;29062021130801
23;1023;29062021130801
24;1023;29062021130801
25;1023;29062021130801
26;1023;29062021130801
27;1023;29062021130801
28;1023;29062021130801
29;1023;29062021130801
30;1023;29062021130801
31;1023;29062021130801
32;1023;29062021130801
33;1023;29062021130801
34;1023;29062021130801
35;969;29062021130801
36;762;29062021130801
37;602;29062021130801
38;486;29062021130801
39;406;29062021130801
40;348;29062021130801
41;307;29062021130801
42;287;29062021130801
43;267;29062021130801
44;255;29062021130801
45;251;29062021130801
46;243;29062021130801
47;245;29062021130801
48;245;29062021130801
49;240;29062021130801
50;244;29062021130801
51;246;29062021130801
52;246;29062021130801
53;254;29062021130801
54;254;29062021130801
55;258;29062021130801
56;264;29062021130801
57;268;29062021130801
58;275;29062021130801
59;278;29062021130801
60;282;29062021130801
61;290;29062021130801
62;294;29062021130801
63;300;29062021130801
64;302;29062021130801
65;305;29062021130801
66;305;29062021130801
67;305;29062021130801
68;303;29062021130801
69;300;29062021130801
70;294;29062021130801
71;291;29062021130801
72;290;29062021130801
73;278;29062021130801
74;278;29062021130801
75;268;29062021130801
76;263;29062021130801
77;260;29062021130801
78;252;29062021130801
79;244;29062021130801
80;239;29062021130801
81;234;29062021130801
82;232;29062021130801
83;224;29062021130801
84;222;29062021130801
85;218;29062021130801
86;215;29062021130801
87;217;29062021130801
88;215;29062021130801
89;208;29062021130801
90;209;29062021130801
91;205;29062021130801
92;200;29062021130801
93;200;29062021130801
94;196;29062021130801
95;190;29062021130801
96;189;29062021130801
97;186;29062021130801
98;182;29062021130801
99;181;29062021130801
100;176;29062021130801
101;176;29062021130801
102;171;29062021130801
103;169;29062021130801
104;169;29062021130801
105;166;29062021130801
106;167;29062021130801
107;164;29062021130801
108;161;29062021130801
109;161;29062021130801
110;158;29062021130801
111;153;29062021130801
112;155;29062021130801
113;151;29062021130801
114;153;29062021130801
115;152;29062021130801
116;148;29062021130801
117;149;29062021130801
118;148;29062021130801
119;147;29062021130801
120;145;29062021130801
121;143;29062021130801
122;143;29062021130801
123;143;29062021130801
124;140;29062021130801
125;141;29062021130801
126;139;29062021130801
127;138;29062021130801
128;139;29062021130801
129;135;29062021130801
130;136;29062021130801
131;136;29062021130801
132;132;29062021130801
133;137;29062021130801
134;132;29062021130801
135;131;29062021130801
136;133;29062021130801
137;130;29062021130801
138;131;29062021130801
139;129;29062021130801
140;127;29062021130801
141;129;29062021130801
142;126;29062021130801
143;128;29062021130801
144;128;29062021130801
145;125;29062021130801
146;127;29062021130801
147;126;29062021130801
148;125;29062021130801
149;125;29062021130801
150;124;29062021130801
151;124;29062021130801
152;124;29062021130801
153;122;29062021130801
154;124;29062021130801
155;122;29062021130801
156;123;29062021130801
157;123;29062021130801
158;123;29062021130801
159;123;29062021130801
160;123;29062021130801
161;122;29062021130801
162;122;29062021130801
163;122;29062021130801
164;121;29062021130801
165;122;29062021130801
166;122;29062021130801
167;121;29062021130801
168;123;29062021130801
169;119;29062021130801
170;121;29062021130801
171;120;29062021130801
172;119;29062021130801
173;121;29062021130801
174;119;29062021130801
175;119;29062021130801
176;121;29062021130801
177;119;29062021130801
178;120;29062021130801
179;119;29062021130801
180;120;29062021130801
181;120;29062021130801
182;119;29062021130801
183;119;29062021130801
184;119;29062021130801
185;117;29062021130801
186;120;29062021130801
187;120;29062021130801
188;117;29062021130801
189;119;29062021130801
190;118;29062021130801
191;118;29062021130801
192;122;29062021130801
193;118;29062021130801
194;119;29062021130801
195;119;29062021130801
196;118;29062021130801
197;119;29062021130801
198;120;29062021130801
199;117;29062021130801
200;0;29062021130801
0;0;29062021130802
1;141;29062021130802
2;124;29062021130802
3;123;29062021130802
4;124;29062021130802
5;126;29062021130802
6;123;29062021130802
7;124;29062021130802
8;126;29062021130802
9;125;29062021130802
10;128;29062021130802
11;127;29062021130802
12;127;29062021130802
13;131;29062021130802
14;132;29062021130802
15;138;29062021130802
16;142;29062021130802
17;151;29062021130802
18;174;29062021130802
19;215;29062021130802
20;318;29062021130802
21;584;29062021130802
22;1023;29062021130802
23;1023;29062021130802
24;1023;29062021130802
25;1023;29062021130802
26;1023;29062021130802
27;1023;29062021130802
28;1023;29062021130802
29;1023;29062021130802
30;1023;29062021130802
31;1023;29062021130802
32;1023;29062021130802
33;1023;29062021130802
34;1023;29062021130802
35;960;29062021130802
36;752;29062021130802
37;596;29062021130802
38;481;29062021130802
39;403;29062021130802
40;346;29062021130802
41;306;29062021130802
42;285;29062021130802
43;268;29062021130802
44;253;29062021130802
45;250;29062021130802
46;243;29062021130802
47;243;29062021130802
48;245;29062021130802
49;241;29062021130802
50;244;29062021130802
51;245;29062021130802
52;245;29062021130802
53;252;29062021130802
54;252;29062021130802
55;255;29062021130802
56;264;29062021130802
57;266;29062021130802
58;277;29062021130802
59;278;29062021130802
60;283;29062021130802
61;293;29062021130802
62;291;29062021130802
63;298;29062021130802
64;299;29062021130802
65;299;29062021130802
66;305;29062021130802
67;304;29062021130802
68;302;29062021130802
69;299;29062021130802
70;293;29062021130802
71;293;29062021130802
72;288;29062021130802
73;278;29062021130802
74;277;29062021130802
75;268;29062021130802
76;263;29062021130802
77;259;29062021130802
78;250;29062021130802
79;243;29062021130802
80;238;29062021130802
81;230;29062021130802
82;229;29062021130802
83;226;29062021130802
84;221;29062021130802
85;219;29062021130802
86;215;29062021130802
87;214;29062021130802
88;216;29062021130802
89;211;29062021130802
90;209;29062021130802
91;206;29062021130802
92;200;29062021130802
93;199;29062021130802
94;194;29062021130802
95;190;29062021130802
96;190;29062021130802
97;185;29062021130802
98;182;29062021130802
99;179;29062021130802
100;176;29062021130802
101;176;29062021130802
102;172;29062021130802
103;171;29062021130802
104;169;29062021130802
105;165;29062021130802
106;166;29062021130802
107;162;29062021130802
108;163;29062021130802
109;160;29062021130802
110;156;29062021130802
111;156;29062021130802
112;157;29062021130802
113;151;29062021130802
114;153;29062021130802
115;152;29062021130802
116;149;29062021130802
117;151;29062021130802
118;148;29062021130802
119;147;29062021130802
120;146;29062021130802
121;144;29062021130802
122;145;29062021130802
123;142;29062021130802
124;139;29062021130802
125;143;29062021130802
126;139;29062021130802
127;139;29062021130802
128;140;29062021130802
129;135;29062021130802
130;136;29062021130802
131;135;29062021130802
132;133;29062021130802
133;137;29062021130802
134;133;29062021130802
135;131;29062021130802
136;133;29062021130802
137;130;29062021130802
138;132;29062021130802
139;130;29062021130802
140;128;29062021130802
141;130;29062021130802
142;127;29062021130802
143;126;29062021130802
144;128;29062021130802
145;127;29062021130802
146;128;29062021130802
147;126;29062021130802
148;126;29062021130802
149;125;29062021130802
150;123;29062021130802
151;125;29062021130802
152;125;29062021130802
153;123;29062021130802
154;125;29062021130802
155;123;29062021130802
156;122;29062021130802
157;123;29062021130802
158;123;29062021130802
159;122;29062021130802
160;123;29062021130802
161;122;29062021130802
162;123;29062021130802
163;123;29062021130802
164;122;29062021130802
165;124;29062021130802
166;121;29062021130802
167;121;29062021130802
168;123;29062021130802
169;119;29062021130802
170;122;29062021130802
171;121;29062021130802
172;121;29062021130802
173;122;29062021130802
174;120;29062021130802
175;119;29062021130802
176;121;29062021130802
177;119;29062021130802
178;121;29062021130802
179;120;29062021130802
180;119;29062021130802
181;121;29062021130802
182;120;29062021130802
183;118;29062021130802
184;120;29062021130802
185;117;29062021130802
186;121;29062021130802
187;120;29062021130802
188;118;29062021130802
189;120;29062021130802
190;120;29062021130802
191;119;29062021130802
192;123;29062021130802
193;118;29062021130802
194;118;29062021130802
195;119;29062021130802
196;118;29062021130802
197;120;29062021130802
198;121;29062021130802
199;117;29062021130802
200;0;29062021130802
0;0;29062021130803
1;141;29062021130803
2;125;29062021130803
3;124;29062021130803
4;124;29062021130803
5;126;29062021130803
6;124;29062021130803
7;125;29062021130803
8;127;29062021130803
9;125;29062021130803
10;128;29062021130803
11;128;29062021130803
12;127;29062021130803
13;133;29062021130803
14;132;29062021130803
15;137;29062021130803
16;144;29062021130803
17;151;29062021130803
18;175;29062021130803
19;218;29062021130803
20;317;29062021130803
21;589;29062021130803
22;1023;29062021130803
23;1023;29062021130803
24;1023;29062021130803
25;1023;29062021130803
26;1023;29062021130803
27;1023;29062021130803
28;1023;29062021130803
29;1023;29062021130803
30;1023;29062021130803
31;1023;29062021130803
32;1023;29062021130803
33;1023;29062021130803
34;1023;29062021130803
35;963;29062021130803
36;758;29062021130803
37;597;29062021130803
38;484;29062021130803
39;402;29062021130803
40;346;29062021130803
41;312;29062021130803
42;286;29062021130803
43;267;29062021130803
44;256;29062021130803
45;251;29062021130803
46;245;29062021130803
47;243;29062021130803
48;243;29062021130803
49;241;29062021130803
50;243;29062021130803
51;243;29062021130803
52;247;29062021130803
53;253;29062021130803
54;254;29062021130803
55;257;29062021130803
56;262;29062021130803
57;268;29062021130803
58;274;29062021130803
59;279;29062021130803
60;285;29062021130803
61;290;29062021130803
62;294;29062021130803
63;299;29062021130803
64;303;29062021130803
65;302;29062021130803
66;308;29062021130803
67;301;29062021130803
68;300;29062021130803
69;300;29062021130803
70;293;29062021130803
71;291;29062021130803
72;288;29062021130803
73;280;29062021130803
74;274;29062021130803
75;266;29062021130803
76;263;29062021130803
77;258;29062021130803
78;252;29062021130803
79;244;29062021130803
80;240;29062021130803
81;230;29062021130803
82;232;29062021130803
83;223;29062021130803
84;223;29062021130803
85;220;29062021130803
86;216;29062021130803
87;214;29062021130803
88;216;29062021130803
89;209;29062021130803
90;211;29062021130803
91;206;29062021130803
92;199;29062021130803
93;200;29062021130803
94;193;29062021130803
95;191;29062021130803
96;190;29062021130803
97;184;29062021130803
98;182;29062021130803
99;182;29062021130803
100;175;29062021130803
101;176;29062021130803
102;174;29062021130803
103;170;29062021130803
104;170;29062021130803
105;166;29062021130803
106;167;29062021130803
107;162;29062021130803
108;161;29062021130803
109;161;29062021130803
110;157;29062021130803
111;156;29062021130803
112;156;29062021130803
113;153;29062021130803
114;153;29062021130803
115;152;29062021130803
116;150;29062021130803
117;151;29062021130803
118;146;29062021130803
119;147;29062021130803
120;145;29062021130803
121;143;29062021130803
122;145;29062021130803
123;143;29062021130803
124;139;29062021130803
125;142;29062021130803
126;138;29062021130803
127;138;29062021130803
128;140;29062021130803
129;136;29062021130803
130;136;29062021130803
131;137;29062021130803
132;133;29062021130803
133;136;29062021130803
134;133;29062021130803
135;132;29062021130803
136;133;29062021130803
137;129;29062021130803
138;131;29062021130803
139;130;29062021130803
140;128;29062021130803
141;130;29062021130803
142;127;29062021130803
143;127;29062021130803
144;128;29062021130803
145;125;29062021130803
146;128;29062021130803
147;126;29062021130803
148;124;29062021130803
149;125;29062021130803
150;125;29062021130803
151;124;29062021130803
152;125;29062021130803
153;123;29062021130803
154;125;29062021130803
155;123;29062021130803
156;122;29062021130803
157;124;29062021130803
158;122;29062021130803
159;122;29062021130803
160;124;29062021130803
161;122;29062021130803
162;123;29062021130803
163;122;29062021130803
164;122;29062021130803
165;123;29062021130803
166;121;29062021130803
167;121;29062021130803
168;122;29062021130803
169;118;29062021130803
170;121;29062021130803
171;121;29062021130803
172;120;29062021130803
173;121;29062021130803
174;121;29062021130803
175;119;29062021130803
176;121;29062021130803
177;119;29062021130803
178;122;29062021130803
179;120;29062021130803
180;120;29062021130803
181;121;29062021130803
182;120;29062021130803
183;119;29062021130803
184;121;29062021130803
185;118;29062021130803
186;121;29062021130803
187;120;29062021130803
188;118;29062021130803
189;119;29062021130803
190;119;29062021130803
191;119;29062021130803
192;122;29062021130803
193;119;29062021130803
194;119;29062021130803
195;119;29062021130803
196;118;29062021130803
197;120;29062021130803
198;120;29062021130803
199;118;29062021130803
200;0;29062021130803
0;0;29062021130803
1;141;29062021130803
2;124;29062021130803
3;123;29062021130803
4;124;29062021130803
5;125;29062021130803
6;124;29062021130803
7;125;29062021130803
8;126;29062021130803
9;125;29062021130803
10;128;29062021130803
11;126;29062021130803
12;127;29062021130803
13;132;29062021130803
14;132;29062021130803
15;138;29062021130803
16;143;29062021130803
17;151;29062021130803
18;175;29062021130803
19;216;29062021130803
20;317;29062021130803
21;578;29062021130803
22;1023;29062021130803
23;1023;29062021130803
24;1023;29062021130803
25;1023;29062021130803
26;1023;29062021130803
27;1023;29062021130803
28;1023;29062021130803
29;1023;29062021130803
30;1023;29062021130803
31;1023;29062021130803
32;1023;29062021130803
33;1023;29062021130803
34;1023;29062021130803
35;970;29062021130803
36;769;29062021130803
37;604;29062021130803
38;483;29062021130803
39;402;29062021130803
40;349;29062021130803
41;307;29062021130803
42;288;29062021130803
43;268;29062021130803
44;255;29062021130803
45;248;29062021130803
46;243;29062021130803
47;241;29062021130803
48;243;29062021130803
49;243;29062021130803
50;245;29062021130803
51;246;29062021130803
52;249;29062021130803
53;253;29062021130803
54;254;29062021130803
55;257;29062021130803
56;263;29062021130803
57;268;29062021130803
58;275;29062021130803
59;276;29062021130803
60;284;29062021130803
61;290;29062021130803
62;290;29062021130803
63;297;29062021130803
64;302;29062021130803
65;302;29062021130803
66;305;29062021130803
67;305;29062021130803
68;300;29062021130803
69;303;29062021130803
70;295;29062021130803
71;293;29062021130803
72;290;29062021130803
73;283;29062021130803
74;278;29062021130803
75;265;29062021130803
76;263;29062021130803
77;259;29062021130803
78;249;29062021130803
79;244;29062021130803
80;239;29062021130803
81;233;29062021130803
82;230;29062021130803
83;223;29062021130803
84;222;29062021130803
85;217;29062021130803
86;215;29062021130803
87;214;29062021130803
88;214;29062021130803
89;207;29062021130803
90;209;29062021130803
91;207;29062021130803
92;200;29062021130803
93;198;29062021130803
94;194;29062021130803
95;190;29062021130803
96;190;29062021130803
97;184;29062021130803
98;182;29062021130803
99;179;29062021130803
100;176;29062021130803
101;177;29062021130803
102;173;29062021130803
103;171;29062021130803
104;168;29062021130803
105;165;29062021130803
106;166;29062021130803
107;162;29062021130803
108;160;29062021130803
109;160;29062021130803
110;156;29062021130803
111;156;29062021130803
112;157;29062021130803
113;152;29062021130803
114;152;29062021130803
115;152;29062021130803
116;148;29062021130803
117;152;29062021130803
118;147;29062021130803
119;147;29062021130803
120;145;29062021130803
121;143;29062021130803
122;143;29062021130803
123;143;29062021130803
124;140;29062021130803
125;141;29062021130803
126;139;29062021130803
127;138;29062021130803
128;140;29062021130803
129;137;29062021130803
130;136;29062021130803
131;136;29062021130803
132;133;29062021130803
133;136;29062021130803
134;131;29062021130803
135;133;29062021130803
136;132;29062021130803
137;129;29062021130803
138;131;29062021130803
139;130;29062021130803
140;128;29062021130803
141;131;29062021130803
142;129;29062021130803
143;126;29062021130803
144;128;29062021130803
145;126;29062021130803
146;128;29062021130803
147;126;29062021130803
148;125;29062021130803
149;126;29062021130803
150;124;29062021130803
151;125;29062021130803
152;124;29062021130803
153;123;29062021130803
154;125;29062021130803
155;124;29062021130803
156;122;29062021130803
157;123;29062021130803
158;121;29062021130803
159;122;29062021130803
160;123;29062021130803
161;122;29062021130803
162;123;29062021130803
163;122;29062021130803
164;121;29062021130803
165;123;29062021130803
166;120;29062021130803
167;122;29062021130803
168;121;29062021130803
169;120;29062021130803
170;121;29062021130803
171;120;29062021130803
172;120;29062021130803
173;121;29062021130803
174;120;29062021130803
175;118;29062021130803
176;121;29062021130803
177;119;29062021130803
178;121;29062021130803
179;119;29062021130803
180;119;29062021130803
181;121;29062021130803
182;120;29062021130803
183;118;29062021130803
184;120;29062021130803
185;118;29062021130803
186;120;29062021130803
187;120;29062021130803
188;118;29062021130803
189;120;29062021130803
190;119;29062021130803
191;118;29062021130803
192;121;29062021130803
193;119;29062021130803
194;119;29062021130803
195;119;29062021130803
196;118;29062021130803
197;120;29062021130803
198;119;29062021130803
199;118;29062021130803
200;0;29062021130803
0;0;29062021130804
1;141;29062021130804
2;124;29062021130804
3;123;29062021130804
4;123;29062021130804
5;125;29062021130804
6;123;29062021130804
7;126;29062021130804
8;127;29062021130804
9;125;29062021130804
10;129;29062021130804
11;127;29062021130804
12;128;29062021130804
13;133;29062021130804
14;132;29062021130804
15;138;29062021130804
16;142;29062021130804
17;152;29062021130804
18;176;29062021130804
19;218;29062021130804
20;319;29062021130804
21;582;29062021130804
22;1023;29062021130804
23;1023;29062021130804
24;1023;29062021130804
25;1023;29062021130804
26;1023;29062021130804
27;1023;29062021130804
28;1023;29062021130804
29;1023;29062021130804
30;1023;29062021130804
31;1023;29062021130804
32;1023;29062021130804
33;1023;29062021130804
34;1023;29062021130804
35;967;29062021130804
36;763;29062021130804
37;598;29062021130804
38;484;29062021130804
39;403;29062021130804
40;347;29062021130804
41;307;29062021130804
42;288;29062021130804
43;267;29062021130804
44;257;29062021130804
45;250;29062021130804
46;247;29062021130804
47;244;29062021130804
48;242;29062021130804
49;242;29062021130804
50;247;29062021130804
51;245;29062021130804
52;246;29062021130804
53;252;29062021130804
54;252;29062021130804
55;258;29062021130804
56;262;29062021130804
57;266;29062021130804
58;277;29062021130804
59;276;29062021130804
60;283;29062021130804
61;291;29062021130804
62;291;29062021130804
63;300;29062021130804
64;304;29062021130804
65;301;29062021130804
66;303;29062021130804
67;305;29062021130804
68;303;29062021130804
69;300;29062021130804
70;295;29062021130804
71;292;29062021130804
72;286;29062021130804
73;279;29062021130804
74;277;29062021130804
75;263;29062021130804
76;260;29062021130804
77;258;29062021130804
78;249;29062021130804
79;245;29062021130804
80;239;29062021130804
81;232;29062021130804
82;230;29062021130804
83;225;29062021130804
84;222;29062021130804
85;217;29062021130804
86;214;29062021130804
87;214;29062021130804
88;214;29062021130804
89;209;29062021130804
90;210;29062021130804
91;206;29062021130804
92;201;29062021130804
93;199;29062021130804
94;196;29062021130804
95;191;29062021130804
96;189;29062021130804
97;184;29062021130804
98;182;29062021130804
99;180;29062021130804
100;176;29062021130804
101;178;29062021130804
102;171;29062021130804
103;171;29062021130804
104;167;29062021130804
105;166;29062021130804
106;166;29062021130804
107;164;29062021130804
108;162;29062021130804
109;161;29062021130804
110;157;29062021130804
111;156;29062021130804
112;157;29062021130804
113;151;29062021130804
114;153;29062021130804
115;152;29062021130804
116;150;29062021130804
117;151;29062021130804
118;147;29062021130804
119;147;29062021130804
120;144;29062021130804
121;144;29062021130804
122;143;29062021130804
123;143;29062021130804
124;141;29062021130804
125;143;29062021130804
126;138;29062021130804
127;138;29062021130804
128;140;29062021130804
129;136;29062021130804
130;135;29062021130804
131;136;29062021130804
132;134;29062021130804
133;136;29062021130804
134;132;29062021130804
135;131;29062021130804
136;132;29062021130804
137;129;29062021130804
138;131;29062021130804
139;129;29062021130804
140;127;29062021130804
141;129;29062021130804
142;127;29062021130804
143;127;29062021130804
144;129;29062021130804
145;125;29062021130804
146;128;29062021130804
147;127;29062021130804
148;125;29062021130804
149;125;29062021130804
150;125;29062021130804
151;125;29062021130804
152;124;29062021130804
153;123;29062021130804
154;124;29062021130804
155;123;29062021130804
156;123;29062021130804
157;123;29062021130804
158;121;29062021130804
159;122;29062021130804
160;123;29062021130804
161;121;29062021130804
162;123;29062021130804
163;122;29062021130804
164;121;29062021130804
165;123;29062021130804
166;122;29062021130804
167;122;29062021130804
168;122;29062021130804
169;119;29062021130804
170;122;29062021130804
171;121;29062021130804
172;120;29062021130804
173;121;29062021130804
174;120;29062021130804
175;119;29062021130804
176;122;29062021130804
177;120;29062021130804
178;122;29062021130804
179;120;29062021130804
180;120;29062021130804
181;121;29062021130804
182;119;29062021130804
183;119;29062021130804
184;120;29062021130804
185;118;29062021130804
186;120;29062021130804
187;119;29062021130804
188;119;29062021130804
189;119;29062021130804
190;118;29062021130804
191;119;29062021130804
192;122;29062021130804
193;119;29062021130804
194;119;29062021130804
195;119;29062021130804
196;119;29062021130804
197;120;29062021130804
198;118;29062021130804
199;118;29062021130804
200;0;29062021130804
0;0;29062021130805
1;141;29062021130805
2;124;29062021130805
3;124;29062021130805
4;124;29062021130805
5;126;29062021130805
6;122;29062021130805
7;126;29062021130805
8;127;29062021130805
9;125;29062021130805
10;129;29062021130805
11;128;29062021130805
12;127;29062021130805
13;132;29062021130805
14;131;29062021130805
15;138;29062021130805
16;142;29062021130805
17;151;29062021130805
18;176;29062021130805
19;219;29062021130805
20;317;29062021130805
21;582;29062021130805
22;1023;29062021130805
23;1023;29062021130805
24;1023;29062021130805
25;1023;29062021130805
26;1023;29062021130805
27;1023;29062021130805
28;1023;29062021130805
29;1023;29062021130805
30;1023;29062021130805
31;1023;29062021130805
32;1023;29062021130805
33;1023;29062021130805
34;1023;29062021130805
35;964;29062021130805
36;756;29062021130805
37;598;29062021130805
38;482;29062021130805
39;401;29062021130805
40;348;29062021130805
41;305;29062021130805
42;285;29062021130805
43;267;29062021130805
44;257;29062021130805
45;250;29062021130805
46;245;29062021130805
47;243;29062021130805
48;244;29062021130805
49;242;29062021130805
50;246;29062021130805
51;244;29062021130805
52;244;29062021130805
53;252;29062021130805
54;254;29062021130805
55;256;29062021130805
56;263;29062021130805
57;267;29062021130805
58;276;29062021130805
59;279;29062021130805
60;284;29062021130805
61;291;29062021130805
62;290;29062021130805
63;297;29062021130805
64;302;29062021130805
65;301;29062021130805
66;305;29062021130805
67;303;29062021130805
68;304;29062021130805
69;302;29062021130805
70;294;29062021130805
71;292;29062021130805
72;290;29062021130805
73;280;29062021130805
74;275;29062021130805
75;266;29062021130805
76;262;29062021130805
77;258;29062021130805
78;251;29062021130805
79;246;29062021130805
80;240;29062021130805
81;232;29062021130805
82;231;29062021130805
83;224;29062021130805
84;220;29062021130805
85;218;29062021130805
86;215;29062021130805
87;214;29062021130805
88;214;29062021130805
89;207;29062021130805
90;210;29062021130805
91;206;29062021130805
92;199;29062021130805
93;199;29062021130805
94;197;29062021130805
95;188;29062021130805
96;189;29062021130805
97;183;29062021130805
98;183;29062021130805
99;180;29062021130805
100;176;29062021130805
101;176;29062021130805
102;171;29062021130805
103;171;29062021130805
104;170;29062021130805
105;166;29062021130805
106;168;29062021130805
107;163;29062021130805
108;160;29062021130805
109;160;29062021130805
110;157;29062021130805
111;155;29062021130805
112;156;29062021130805
113;152;29062021130805
114;152;29062021130805
115;153;29062021130805
116;150;29062021130805
117;151;29062021130805
118;147;29062021130805
119;146;29062021130805
120;146;29062021130805
121;143;29062021130805
122;143;29062021130805
123;143;29062021130805
124;140;29062021130805
125;142;29062021130805
126;139;29062021130805
127;138;29062021130805
128;139;29062021130805
129;135;29062021130805
130;136;29062021130805
131;135;29062021130805
132;134;29062021130805
133;137;29062021130805
134;132;29062021130805
135;132;29062021130805
136;133;29062021130805
137;130;29062021130805
138;131;29062021130805
139;130;29062021130805
140;127;29062021130805
141;129;29062021130805
142;127;29062021130805
143;128;29062021130805
144;128;29062021130805
145;125;29062021130805
146;128;29062021130805
147;127;29062021130805
148;124;29062021130805
149;125;29062021130805
150;124;29062021130805
151;125;29062021130805
152;125;29062021130805
153;124;29062021130805
154;125;29062021130805
155;124;29062021130805
156;123;29062021130805
157;123;29062021130805
158;123;29062021130805
159;122;29062021130805
160;123;29062021130805
161;122;29062021130805
162;123;29062021130805
163;123;29062021130805
164;121;29062021130805
165;124;29062021130805
166;121;29062021130805
167;121;29062021130805
168;122;29062021130805
169;119;29062021130805
170;121;29062021130805
171;121;29062021130805
172;120;29062021130805
173;121;29062021130805
174;120;29062021130805
175;119;29062021130805
176;121;29062021130805
177;119;29062021130805
178;122;29062021130805
179;120;29062021130805
180;119;29062021130805
181;121;29062021130805
182;120;29062021130805
183;119;29062021130805
184;121;29062021130805
185;118;29062021130805
186;121;29062021130805
187;120;29062021130805
188;118;29062021130805
189;120;29062021130805
190;119;29062021130805
191;118;29062021130805
192;122;29062021130805
193;119;29062021130805
194;119;29062021130805
195;119;29062021130805
196;118;29062021130805
197;120;29062021130805
198;119;29062021130805
199;118;29062021130805
200;0;29062021130805
0;0;29062021130805
1;141;29062021130805
2;125;29062021130805
3;123;29062021130805
4;123;29062021130805
5;125;29062021130805
6;123;29062021130805
7;125;29062021130805
8;127;29062021130805
9;124;29062021130805
10;128;29062021130805
11;126;29062021130805
12;127;29062021130805
13;132;29062021130805
14;133;29062021130805
15;137;29062021130805
16;143;29062021130805
17;151;29062021130805
18;173;29062021130805
19;216;29062021130805
20;316;29062021130805
21;580;29062021130805
22;1023;29062021130805
23;1023;29062021130805
24;1023;29062021130805
25;1023;29062021130805
26;1023;29062021130805
27;1023;29062021130805
28;1023;29062021130805
29;1023;29062021130805
30;1023;29062021130805
31;1023;29062021130805
32;1023;29062021130805
33;1023;29062021130805
34;1023;29062021130805
35;976;29062021130805
36;765;29062021130805
37;606;29062021130805
38;491;29062021130805
39;412;29062021130805
40;356;29062021130805
41;313;29062021130805
42;290;29062021130805
43;267;29062021130805
44;256;29062021130805
45;245;29062021130805
46;245;29062021130805
47;244;29062021130805
48;243;29062021130805
49;244;29062021130805
50;245;29062021130805
51;248;29062021130805
52;246;29062021130805
53;252;29062021130805
54;252;29062021130805
55;257;29062021130805
56;263;29062021130805
57;265;29062021130805
58;274;29062021130805
59;282;29062021130805
60;284;29062021130805
61;290;29062021130805
62;292;29062021130805
63;299;29062021130805
64;301;29062021130805
65;303;29062021130805
66;305;29062021130805
67;305;29062021130805
68;302;29062021130805
69;298;29062021130805
70;295;29062021130805
71;290;29062021130805
72;288;29062021130805
73;280;29062021130805
74;275;29062021130805
75;270;29062021130805
76;262;29062021130805
77;261;29062021130805
78;251;29062021130805
79;244;29062021130805
80;240;29062021130805
81;233;29062021130805
82;229;29062021130805
83;225;29062021130805
84;223;29062021130805
85;219;29062021130805
86;216;29062021130805
87;214;29062021130805
88;214;29062021130805
89;207;29062021130805
90;206;29062021130805
91;204;29062021130805
92;200;29062021130805
93;198;29062021130805
94;195;29062021130805
95;190;29062021130805
96;189;29062021130805
97;186;29062021130805
98;183;29062021130805
99;179;29062021130805
100;177;29062021130805
101;176;29062021130805
102;173;29062021130805
103;170;29062021130805
104;168;29062021130805
105;166;29062021130805
106;167;29062021130805
107;162;29062021130805
108;161;29062021130805
109;161;29062021130805
110;157;29062021130805
111;155;29062021130805
112;157;29062021130805
113;150;29062021130805
114;153;29062021130805
115;152;29062021130805
116;149;29062021130805
117;152;29062021130805
118;147;29062021130805
119;146;29062021130805
120;146;29062021130805
121;144;29062021130805
122;143;29062021130805
123;142;29062021130805
124;140;29062021130805
125;141;29062021130805
126;138;29062021130805
127;138;29062021130805
128;138;29062021130805
129;137;29062021130805
130;135;29062021130805
131;136;29062021130805
132;133;29062021130805
133;137;29062021130805
134;132;29062021130805
135;131;29062021130805
136;132;29062021130805
137;130;29062021130805
138;131;29062021130805
139;130;29062021130805
140;128;29062021130805
141;130;29062021130805
142;128;29062021130805
143;128;29062021130805
144;128;29062021130805
145;125;29062021130805
146;128;29062021130805
147;126;29062021130805
148;124;29062021130805
149;124;29062021130805
150;124;29062021130805
151;124;29062021130805
152;124;29062021130805
153;122;29062021130805
154;124;29062021130805
155;122;29062021130805
156;123;29062021130805
157;123;29062021130805
158;122;29062021130805
159;121;29062021130805
160;124;29062021130805
161;120;29062021130805
162;122;29062021130805
163;122;29062021130805
164;121;29062021130805
165;123;29062021130805
166;121;29062021130805
167;121;29062021130805
168;121;29062021130805
169;119;29062021130805
170;122;29062021130805
171;120;29062021130805
172;120;29062021130805
173;121;29062021130805
174;119;29062021130805
175;119;29062021130805
176;121;29062021130805
177;119;29062021130805
178;121;29062021130805
179;120;29062021130805
180;119;29062021130805
181;120;29062021130805
182;119;29062021130805
183;118;29062021130805
184;120;29062021130805
185;118;29062021130805
186;121;29062021130805
187;119;29062021130805
188;117;29062021130805
189;119;29062021130805
190;118;29062021130805
191;118;29062021130805
192;122;29062021130805
193;119;29062021130805
194;119;29062021130805
195;119;29062021130805
196;118;29062021130805
197;119;29062021130805
198;119;29062021130805
199;117;29062021130805
200;0;29062021130805
0;0;29062021130806
1;141;29062021130806
2;124;29062021130806
3;124;29062021130806
4;125;29062021130806
5;126;29062021130806
6;123;29062021130806
7;125;29062021130806
8;126;29062021130806
9;125;29062021130806
10;128;29062021130806
11;127;29062021130806
12;129;29062021130806
13;131;29062021130806
14;133;29062021130806
15;136;29062021130806
16;142;29062021130806
17;151;29062021130806
18;174;29062021130806
19;217;29062021130806
20;319;29062021130806
21;582;29062021130806
22;1023;29062021130806
23;1023;29062021130806
24;1023;29062021130806
25;1023;29062021130806
26;1023;29062021130806
27;1023;29062021130806
28;1023;29062021130806
29;1023;29062021130806
30;1023;29062021130806
31;1023;29062021130806
32;1023;29062021130806
33;1023;29062021130806
34;1023;29062021130806
35;970;29062021130806
36;765;29062021130806
37;600;29062021130806
38;486;29062021130806
39;405;29062021130806
40;346;29062021130806
41;309;29062021130806
42;283;29062021130806
43;268;29062021130806
44;256;29062021130806
45;249;29062021130806
46;245;29062021130806
47;244;29062021130806
48;243;29062021130806
49;238;29062021130806
50;244;29062021130806
51;246;29062021130806
52;245;29062021130806
53;251;29062021130806
54;253;29062021130806
55;259;29062021130806
56;264;29062021130806
57;266;29062021130806
58;273;29062021130806
59;280;29062021130806
60;281;29062021130806
61;288;29062021130806
62;291;29062021130806
63;298;29062021130806
64;301;29062021130806
65;297;29062021130806
66;307;29062021130806
67;302;29062021130806
68;299;29062021130806
69;301;29062021130806
70;291;29062021130806
71;294;29062021130806
72;287;29062021130806
73;280;29062021130806
74;277;29062021130806
75;268;29062021130806
76;263;29062021130806
77;257;29062021130806
78;250;29062021130806
79;245;29062021130806
80;240;29062021130806
81;231;29062021130806
82;232;29062021130806
83;226;29062021130806
84;220;29062021130806
85;220;29062021130806
86;215;29062021130806
87;215;29062021130806
88;213;29062021130806
89;208;29062021130806
90;208;29062021130806
91;206;29062021130806
92;202;29062021130806
93;200;29062021130806
94;194;29062021130806
95;190;29062021130806
96;188;29062021130806
97;187;29062021130806
98;182;29062021130806
99;179;29062021130806
100;176;29062021130806
101;177;29062021130806
102;172;29062021130806
103;171;29062021130806
104;169;29062021130806
105;165;29062021130806
106;165;29062021130806
107;162;29062021130806
108;161;29062021130806
109;160;29062021130806
110;155;29062021130806
111;155;29062021130806
112;156;29062021130806
113;152;29062021130806
114;152;29062021130806
115;153;29062021130806
116;149;29062021130806
117;150;29062021130806
118;148;29062021130806
119;146;29062021130806
120;144;29062021130806
121;143;29062021130806
122;144;29062021130806
123;141;29062021130806
124;141;29062021130806
125;141;29062021130806
126;139;29062021130806
127;138;29062021130806
128;139;29062021130806
129;136;29062021130806
130;136;29062021130806
131;135;29062021130806
132;133;29062021130806
133;137;29062021130806
134;132;29062021130806
135;131;29062021130806
136;133;29062021130806
137;130;29062021130806
138;131;29062021130806
139;130;29062021130806
140;127;29062021130806
141;130;29062021130806
142;127;29062021130806
143;127;29062021130806
144;128;29062021130806
145;125;29062021130806
146;129;29062021130806
147;127;29062021130806
148;125;29062021130806
149;124;29062021130806
150;124;29062021130806
151;125;29062021130806
152;125;29062021130806
153;122;29062021130806
154;124;29062021130806
155;123;29062021130806
156;123;29062021130806
157;123;29062021130806
158;123;29062021130806
159;122;29062021130806
160;123;29062021130806
161;121;29062021130806
162;123;29062021130806
163;122;29062021130806
164;121;29062021130806
165;124;29062021130806
166;121;29062021130806
167;121;29062021130806
168;122;29062021130806
169;120;29062021130806
170;122;29062021130806
171;121;29062021130806
172;120;29062021130806
173;121;29062021130806
174;120;29062021130806
175;118;29062021130806
176;122;29062021130806
177;118;29062021130806
178;122;29062021130806
179;121;29062021130806
180;119;29062021130806
181;121;29062021130806
182;120;29062021130806
183;119;29062021130806
184;120;29062021130806
185;117;29062021130806
186;120;29062021130806
187;120;29062021130806
188;118;29062021130806
189;120;29062021130806
190;119;29062021130806
191;118;29062021130806
192;121;29062021130806
193;119;29062021130806
194;119;29062021130806
195;120;29062021130806
196;118;29062021130806
197;120;29062021130806
198;119;29062021130806
199;117;29062021130806
200;0;29062021130806
0;0;29062021130806
1;141;29062021130806
2;124;29062021130806
3;123;29062021130806
4;124;29062021130806
5;126;29062021130806
6;123;29062021130806
7;126;29062021130806
8;127;29062021130806
9;124;29062021130806
10;128;29062021130806
11;127;29062021130806
12;127;29062021130806
13;132;29062021130806
14;132;29062021130806
15;138;29062021130806
16;142;29062021130806
17;150;29062021130806
18;173;29062021130806
19;216;29062021130806
20;318;29062021130806
21;573;29062021130806
22;1023;29062021130806
23;1023;29062021130806
24;1023;29062021130806
25;1023;29062021130806
26;1023;29062021130806
27;1023;29062021130806
28;1023;29062021130806
29;1023;29062021130806
30;1023;29062021130806
31;1023;29062021130806
32;1023;29062021130806
33;1023;29062021130806
34;1023;29062021130806
35;981;29062021130806
36;771;29062021130806
37;611;29062021130806
38;491;29062021130806
39;412;29062021130806
40;354;29062021130806
41;311;29062021130806
42;288;29062021130806
43;270;29062021130806
44;258;29062021130806
45;251;29062021130806
46;243;29062021130806
47;243;29062021130806
48;245;29062021130806
49;241;29062021130806
50;245;29062021130806
51;246;29062021130806
52;245;29062021130806
53;252;29062021130806
54;253;29062021130806
55;258;29062021130806
56;264;29062021130806
57;268;29062021130806
58;275;29062021130806
59;276;29062021130806
60;284;29062021130806
61;291;29062021130806
62;291;29062021130806
63;299;29062021130806
64;304;29062021130806
65;302;29062021130806
66;304;29062021130806
67;301;29062021130806
68;301;29062021130806
69;300;29062021130806
70;293;29062021130806
71;292;29062021130806
72;290;29062021130806
73;277;29062021130806
74;277;29062021130806
75;264;29062021130806
76;259;29062021130806
77;259;29062021130806
78;250;29062021130806
79;243;29062021130806
80;237;29062021130806
81;232;29062021130806
82;232;29062021130806
83;226;29062021130806
84;220;29062021130806
85;219;29062021130806
86;214;29062021130806
87;214;29062021130806
88;216;29062021130806
89;208;29062021130806
90;208;29062021130806
91;205;29062021130806
92;201;29062021130806
93;199;29062021130806
94;195;29062021130806
95;189;29062021130806
96;189;29062021130806
97;185;29062021130806
98;183;29062021130806
99;179;29062021130806
100;176;29062021130806
101;175;29062021130806
102;173;29062021130806
103;170;29062021130806
104;169;29062021130806
105;166;29062021130806
106;167;29062021130806
107;163;29062021130806
108;160;29062021130806
109;161;29062021130806
110;157;29062021130806
111;154;29062021130806
112;156;29062021130806
113;151;29062021130806
114;153;29062021130806
115;153;29062021130806
116;149;29062021130806
117;151;29062021130806
118;147;29062021130806
119;145;29062021130806
120;145;29062021130806
121;143;29062021130806
122;143;29062021130806
123;143;29062021130806
124;139;29062021130806
125;141;29062021130806
126;139;29062021130806
127;137;29062021130806
128;140;29062021130806
129;135;29062021130806
130;135;29062021130806
131;136;29062021130806
132;133;29062021130806
133;136;29062021130806
134;132;29062021130806
135;130;29062021130806
136;133;29062021130806
137;130;29062021130806
138;131;29062021130806
139;130;29062021130806
140;128;29062021130806
141;130;29062021130806
142;128;29062021130806
143;126;29062021130806
144;128;29062021130806
145;125;29062021130806
146;128;29062021130806
147;126;29062021130806
148;125;29062021130806
149;125;29062021130806
150;124;29062021130806
151;124;29062021130806
152;124;29062021130806
153;122;29062021130806
154;124;29062021130806
155;123;29062021130806
156;122;29062021130806
157;123;29062021130806
158;123;29062021130806
159;123;29062021130806
160;123;29062021130806
161;121;29062021130806
162;122;29062021130806
163;122;29062021130806
164;120;29062021130806
165;123;29062021130806
166;121;29062021130806
167;121;29062021130806
168;122;29062021130806
169;119;29062021130806
170;122;29062021130806
171;120;29062021130806
172;119;29062021130806
173;121;29062021130806
174;120;29062021130806
175;119;29062021130806
176;120;29062021130806
177;119;29062021130806
178;121;29062021130806
179;120;29062021130806
180;120;29062021130806
181;120;29062021130806
182;120;29062021130806
183;118;29062021130806
184;121;29062021130806
185;118;29062021130806
186;121;29062021130806
187;119;29062021130806
188;118;29062021130806
189;120;29062021130806
190;119;29062021130806
191;118;29062021130806
192;122;29062021130806
193;118;29062021130806
194;118;29062021130806
195;119;29062021130806
196;118;29062021130806
197;120;29062021130806
198;119;29062021130806
199;118;29062021130806
200;0;29062021130806
0;0;29062021130806
1;141;29062021130806
2;125;29062021130806
3;123;29062021130806
4;124;29062021130806
5;125;29062021130806
6;123;29062021130806
7;125;29062021130806
8;127;29062021130806
9;125;29062021130806
10;128;29062021130806
11;127;29062021130806
12;127;29062021130806
13;132;29062021130806
14;131;29062021130806
15;138;29062021130806
16;142;29062021130806
17;151;29062021130806
18;175;29062021130806
19;217;29062021130806
20;318;29062021130806
21;577;29062021130806
22;1023;29062021130806
23;1023;29062021130806
24;1023;29062021130806
25;1023;29062021130806
26;1023;29062021130806
27;1023;29062021130806
28;1023;29062021130806
29;1023;29062021130806
30;1023;29062021130806
31;1023;29062021130806
32;1023;29062021130806
33;1023;29062021130806
34;1023;29062021130806
35;972;29062021130806
36;768;29062021130806
37;602;29062021130806
38;486;29062021130806
39;405;29062021130806
40;352;29062021130806
41;309;29062021130806
42;288;29062021130806
43;264;29062021130806
44;258;29062021130806
45;251;29062021130806
46;242;29062021130806
47;241;29062021130806
48;242;29062021130806
49;242;29062021130806
50;244;29062021130806
51;245;29062021130806
52;246;29062021130806
53;252;29062021130806
54;253;29062021130806
55;257;29062021130806
56;261;29062021130806
57;267;29062021130806
58;271;29062021130806
59;277;29062021130806
60;284;29062021130806
61;289;29062021130806
62;292;29062021130806
63;299;29062021130806
64;300;29062021130806
65;301;29062021130806
66;305;29062021130806
67;303;29062021130806
68;300;29062021130806
69;302;29062021130806
70;291;29062021130806
71;289;29062021130806
72;288;29062021130806
73;281;29062021130806
74;279;29062021130806
75;266;29062021130806
76;264;29062021130806
77;257;29062021130806
78;251;29062021130806
79;243;29062021130806
80;240;29062021130806
81;230;29062021130806
82;230;29062021130806
83;223;29062021130806
84;221;29062021130806
85;219;29062021130806
86;215;29062021130806
87;215;29062021130806
88;214;29062021130806
89;209;29062021130806
90;210;29062021130806
91;206;29062021130806
92;201;29062021130806
93;199;29062021130806
94;196;29062021130806
95;190;29062021130806
96;189;29062021130806
97;185;29062021130806
98;182;29062021130806
99;181;29062021130806
100;180;29062021130806
101;177;29062021130806
102;171;29062021130806
103;172;29062021130806
104;169;29062021130806
105;165;29062021130806
106;167;29062021130806
107;164;29062021130806
108;160;29062021130806
109;160;29062021130806
110;156;29062021130806
111;157;29062021130806
112;157;29062021130806
113;151;29062021130806
114;151;29062021130806
115;152;29062021130806
116;149;29062021130806
117;151;29062021130806
118;147;29062021130806
119;147;29062021130806
120;145;29062021130806
121;142;29062021130806
122;144;29062021130806
123;144;29062021130806
124;140;29062021130806
125;141;29062021130806
126;139;29062021130806
127;138;29062021130806
128;140;29062021130806
129;137;29062021130806
130;137;29062021130806
131;136;29062021130806
132;134;29062021130806
133;136;29062021130806
134;131;29062021130806
135;131;29062021130806
136;133;29062021130806
137;130;29062021130806
138;132;29062021130806
139;129;29062021130806
140;127;29062021130806
141;130;29062021130806
142;127;29062021130806
143;127;29062021130806
144;128;29062021130806
145;124;29062021130806
146;128;29062021130806
147;125;29062021130806
148;125;29062021130806
149;125;29062021130806
150;124;29062021130806
151;124;29062021130806
152;125;29062021130806
153;123;29062021130806
154;126;29062021130806
155;122;29062021130806
156;122;29062021130806
157;122;29062021130806
158;122;29062021130806
159;122;29062021130806
160;124;29062021130806
161;122;29062021130806
162;124;29062021130806
163;123;29062021130806
164;120;29062021130806
165;124;29062021130806
166;121;29062021130806
167;121;29062021130806
168;123;29062021130806
169;119;29062021130806
170;122;29062021130806
171;121;29062021130806
172;121;29062021130806
173;121;29062021130806
174;120;29062021130806
175;119;29062021130806
176;121;29062021130806
177;119;29062021130806
178;122;29062021130806
179;120;29062021130806
180;119;29062021130806
181;121;29062021130806
182;120;29062021130806
183;119;29062021130806
184;121;29062021130806
185;117;29062021130806
186;120;29062021130806
187;119;29062021130806
188;117;29062021130806
189;119;29062021130806
190;119;29062021130806
191;118;29062021130806
192;122;29062021130806
193;119;29062021130806
194;119;29062021130806
195;118;29062021130806
196;118;29062021130806
197;119;29062021130806
198;119;29062021130806
199;119;29062021130806
200;0;29062021130806
0;0;29062021130806
1;140;29062021130806
2;125;29062021130806
3;123;29062021130806
4;124;29062021130806
5;126;29062021130806
6;124;29062021130806
7;124;29062021130806
8;126;29062021130806
9;125;29062021130806
10;128;29062021130806
11;127;29062021130806
12;127;29062021130806
13;132;29062021130806
14;132;29062021130806
15;137;29062021130806
16;142;29062021130806
17;150;29062021130806
18;174;29062021130806
19;217;29062021130806
20;314;29062021130806
21;575;29062021130806
22;1023;29062021130806
23;1023;29062021130806
24;1023;29062021130806
25;1023;29062021130806
26;1023;29062021130806
27;1023;29062021130806
28;1023;29062021130806
29;1023;29062021130806
30;1023;29062021130806
31;1023;29062021130806
32;1023;29062021130806
33;1023;29062021130806
34;1023;29062021130806
35;974;29062021130806
36;774;29062021130806
37;610;29062021130806
38;485;29062021130806
39;407;29062021130806
40;349;29062021130806
41;308;29062021130806
42;284;29062021130806
43;269;29062021130806
44;257;29062021130806
45;247;29062021130806
46;242;29062021130806
47;241;29062021130806
48;244;29062021130806
49;242;29062021130806
50;244;29062021130806
51;244;29062021130806
52;245;29062021130806
53;250;29062021130806
54;252;29062021130806
55;257;29062021130806
56;262;29062021130806
57;263;29062021130806
58;274;29062021130806
59;276;29062021130806
60;281;29062021130806
61;289;29062021130806
62;290;29062021130806
63;296;29062021130806
64;300;29062021130806
65;301;29062021130806
66;303;29062021130806
67;303;29062021130806
68;299;29062021130806
69;298;29062021130806
70;294;29062021130806
71;288;29062021130806
72;285;29062021130806
73;277;29062021130806
74;275;29062021130806
75;266;29062021130806
76;262;29062021130806
77;258;29062021130806
78;249;29062021130806
79;243;29062021130806
80;240;29062021130806
81;229;29062021130806
82;228;29062021130806
83;223;29062021130806
84;219;29062021130806
85;218;29062021130806
86;216;29062021130806
87;214;29062021130806
88;214;29062021130806
89;208;29062021130806
90;210;29062021130806
91;203;29062021130806
92;198;29062021130806
93;200;29062021130806
94;194;29062021130806
95;190;29062021130806
96;189;29062021130806
97;185;29062021130806
98;182;29062021130806
99;180;29062021130806
100;175;29062021130806
101;177;29062021130806
102;172;29062021130806
103;170;29062021130806
104;170;29062021130806
105;165;29062021130806
106;166;29062021130806
107;163;29062021130806
108;160;29062021130806
109;161;29062021130806
110;156;29062021130806
111;156;29062021130806
112;156;29062021130806
113;151;29062021130806
114;152;29062021130806
115;151;29062021130806
116;149;29062021130806
117;151;29062021130806
118;146;29062021130806
119;146;29062021130806
120;145;29062021130806
121;143;29062021130806
122;144;29062021130806
123;143;29062021130806
124;140;29062021130806
125;141;29062021130806
126;137;29062021130806
127;137;29062021130806
128;139;29062021130806
129;135;29062021130806
130;136;29062021130806
131;136;29062021130806
132;134;29062021130806
133;135;29062021130806
134;131;29062021130806
135;132;29062021130806
136;133;29062021130806
137;130;29062021130806
138;132;29062021130806
139;130;29062021130806
140;128;29062021130806
141;130;29062021130806
142;127;29062021130806
143;128;29062021130806
144;129;29062021130806
145;126;29062021130806
146;129;29062021130806
147;126;29062021130806
148;125;29062021130806
149;124;29062021130806
150;125;29062021130806
151;125;29062021130806
152;125;29062021130806
153;123;29062021130806
154;125;29062021130806
155;123;29062021130806
156;122;29062021130806
157;122;29062021130806
158;122;29062021130806
159;122;29062021130806
160;122;29062021130806
161;120;29062021130806
162;122;29062021130806
163;122;29062021130806
164;121;29062021130806
165;122;29062021130806
166;122;29062021130806
167;120;29062021130806
168;122;29062021130806
169;119;29062021130806
170;121;29062021130806
171;120;29062021130806
172;120;29062021130806
173;121;29062021130806
174;120;29062021130806
175;119;29062021130806
176;121;29062021130806
177;119;29062021130806
178;120;29062021130806
179;120;29062021130806
180;118;29062021130806
181;120;29062021130806
182;120;29062021130806
183;118;29062021130806
184;121;29062021130806
185;117;29062021130806
186;120;29062021130806
187;119;29062021130806
188;118;29062021130806
189;119;29062021130806
190;118;29062021130806
191;118;29062021130806
192;122;29062021130806
193;118;29062021130806
194;119;29062021130806
195;119;29062021130806
196;118;29062021130806
197;119;29062021130806
198;119;29062021130806
199;119;29062021130806
200;0;29062021130806
0;0;29062021130808
1;140;29062021130808
2;124;29062021130808
3;123;29062021130808
4;123;29062021130808
5;125;29062021130808
6;122;29062021130808
7;125;29062021130808
8;126;29062021130808
9;126;29062021130808
10;128;29062021130808
11;127;29062021130808
12;127;29062021130808
13;133;29062021130808
14;133;29062021130808
15;138;29062021130808
16;144;29062021130808
17;152;29062021130808
18;174;29062021130808
19;218;29062021130808
20;319;29062021130808
21;582;29062021130808
22;1023;29062021130808
23;1023;29062021130808
24;1023;29062021130808
25;1023;29062021130808
26;1023;29062021130808
27;1023;29062021130808
28;1023;29062021130808
29;1023;29062021130808
30;1023;29062021130808
31;1023;29062021130808
32;1023;29062021130808
33;1023;29062021130808
34;1023;29062021130808
35;970;29062021130808
36;763;29062021130808
37;604;29062021130808
38;488;29062021130808
39;406;29062021130808
40;352;29062021130808
41;306;29062021130808
42;284;29062021130808
43;267;29062021130808
44;258;29062021130808
45;251;29062021130808
46;243;29062021130808
47;243;29062021130808
48;244;29062021130808
49;242;29062021130808
50;245;29062021130808
51;243;29062021130808
52;246;29062021130808
53;251;29062021130808
54;256;29062021130808
55;257;29062021130808
56;262;29062021130808
57;267;29062021130808
58;276;29062021130808
59;278;29062021130808
60;283;29062021130808
61;291;29062021130808
62;289;29062021130808
63;300;29062021130808
64;301;29062021130808
65;302;29062021130808
66;303;29062021130808
67;304;29062021130808
68;300;29062021130808
69;299;29062021130808
70;295;29062021130808
71;292;29062021130808
72;289;29062021130808
73;277;29062021130808
74;278;29062021130808
75;266;29062021130808
76;264;29062021130808
77;260;29062021130808
78;251;29062021130808
79;243;29062021130808
80;238;29062021130808
81;232;29062021130808
82;230;29062021130808
83;223;29062021130808
84;220;29062021130808
85;219;29062021130808
86;216;29062021130808
87;213;29062021130808
88;215;29062021130808
89;208;29062021130808
90;209;29062021130808
91;205;29062021130808
92;199;29062021130808
93;199;29062021130808
94;195;29062021130808
95;193;29062021130808
96;188;29062021130808
97;185;29062021130808
98;182;29062021130808
99;182;29062021130808
100;176;29062021130808
101;176;29062021130808
102;173;29062021130808
103;171;29062021130808
104;169;29062021130808
105;167;29062021130808
106;168;29062021130808
107;164;29062021130808
108;161;29062021130808
109;161;29062021130808
110;158;29062021130808
111;155;29062021130808
112;157;29062021130808
113;151;29062021130808
114;153;29062021130808
115;152;29062021130808
116;149;29062021130808
117;151;29062021130808
118;146;29062021130808
119;147;29062021130808
120;145;29062021130808
121;144;29062021130808
122;143;29062021130808
123;142;29062021130808
124;140;29062021130808
125;142;29062021130808
126;140;29062021130808
127;137;29062021130808
128;139;29062021130808
129;136;29062021130808
130;136;29062021130808
131;135;29062021130808
132;132;29062021130808
133;137;29062021130808
134;132;29062021130808
135;131;29062021130808
136;132;29062021130808
137;129;29062021130808
138;130;29062021130808
139;129;29062021130808
140;127;29062021130808
141;129;29062021130808
142;128;29062021130808
143;127;29062021130808
144;128;29062021130808
145;126;29062021130808
146;128;29062021130808
147;126;29062021130808
148;125;29062021130808
149;125;29062021130808
150;123;29062021130808
151;125;29062021130808
152;125;29062021130808
153;122;29062021130808
154;126;29062021130808
155;122;29062021130808
156;122;29062021130808
157;123;29062021130808
158;123;29062021130808
159;122;29062021130808
160;123;29062021130808
161;121;29062021130808
162;123;29062021130808
163;122;29062021130808
164;121;29062021130808
165;123;29062021130808
166;122;29062021130808
167;122;29062021130808
168;123;29062021130808
169;118;29062021130808
170;121;29062021130808
171;121;29062021130808
172;120;29062021130808
173;121;29062021130808
174;120;29062021130808
175;119;29062021130808
176;121;29062021130808
177;119;29062021130808
178;121;29062021130808
179;119;29062021130808
180;119;29062021130808
181;121;29062021130808
182;119;29062021130808
183;119;29062021130808
184;120;29062021130808
185;117;29062021130808
186;121;29062021130808
187;119;29062021130808
188;118;29062021130808
189;120;29062021130808
190;118;29062021130808
191;117;29062021130808
192;122;29062021130808
193;118;29062021130808
194;119;29062021130808
195;119;29062021130808
196;119;29062021130808
197;120;29062021130808
198;119;29062021130808
199;118;29062021130808
200;0;29062021130808
0;0;29062021130808
1;141;29062021130808
2;125;29062021130808
3;123;29062021130808
4;124;29062021130808
5;125;29062021130808
6;124;29062021130808
7;126;29062021130808
8;127;29062021130808
9;125;29062021130808
10;129;29062021130808
11;127;29062021130808
12;127;29062021130808
13;131;29062021130808
14;133;29062021130808
15;138;29062021130808
16;142;29062021130808
17;151;29062021130808
18;175;29062021130808
19;217;29062021130808
20;320;29062021130808
21;580;29062021130808
22;1023;29062021130808
23;1023;29062021130808
24;1023;29062021130808
25;1023;29062021130808
26;1023;29062021130808
27;1023;29062021130808
28;1023;29062021130808
29;1023;29062021130808
30;1023;29062021130808
31;1023;29062021130808
32;1023;29062021130808
33;1023;29062021130808
34;1023;29062021130808
35;973;29062021130808
36;766;29062021130808
37;604;29062021130808
38;488;29062021130808
39;405;29062021130808
40;348;29062021130808
41;309;29062021130808
42;286;29062021130808
43;267;29062021130808
44;257;29062021130808
45;249;29062021130808
46;244;29062021130808
47;245;29062021130808
48;242;29062021130808
49;241;29062021130808
50;244;29062021130808
51;243;29062021130808
52;244;29062021130808
53;252;29062021130808
54;253;29062021130808
55;257;29062021130808
56;265;29062021130808
57;267;29062021130808
58;273;29062021130808
59;279;29062021130808
60;281;29062021130808
61;290;29062021130808
62;289;29062021130808
63;299;29062021130808
64;302;29062021130808
65;300;29062021130808
66;305;29062021130808
67;305;29062021130808
68;303;29062021130808
69;301;29062021130808
70;294;29062021130808
71;290;29062021130808
72;288;29062021130808
73;276;29062021130808
74;276;29062021130808
75;267;29062021130808
76;261;29062021130808
77;258;29062021130808
78;252;29062021130808
79;244;29062021130808
80;238;29062021130808
81;231;29062021130808
82;231;29062021130808
83;226;29062021130808
84;219;29062021130808
85;219;29062021130808
86;217;29062021130808
87;217;29062021130808
88;213;29062021130808
89;210;29062021130808
90;210;29062021130808
91;204;29062021130808
92;199;29062021130808
93;199;29062021130808
94;194;29062021130808
95;191;29062021130808
96;190;29062021130808
97;186;29062021130808
98;182;29062021130808
99;178;29062021130808
100;176;29062021130808
101;176;29062021130808
102;170;29062021130808
103;171;29062021130808
104;170;29062021130808
105;165;29062021130808
106;167;29062021130808
107;163;29062021130808
108;161;29062021130808
109;160;29062021130808
110;156;29062021130808
111;155;29062021130808
112;157;29062021130808
113;151;29062021130808
114;154;29062021130808
115;152;29062021130808
116;150;29062021130808
117;152;29062021130808
118;148;29062021130808
119;147;29062021130808
120;146;29062021130808
121;143;29062021130808
122;144;29062021130808
123;143;29062021130808
124;141;29062021130808
125;142;29062021130808
126;139;29062021130808
127;138;29062021130808
128;139;29062021130808
129;135;29062021130808
130;135;29062021130808
131;136;29062021130808
132;134;29062021130808
133;136;29062021130808
134;132;29062021130808
135;132;29062021130808
136;133;29062021130808
137;130;29062021130808
138;131;29062021130808
139;130;29062021130808
140;127;29062021130808
141;130;29062021130808
142;128;29062021130808
143;127;29062021130808
144;128;29062021130808
145;126;29062021130808
146;128;29062021130808
147;125;29062021130808
148;123;29062021130808
149;125;29062021130808
150;124;29062021130808
151;125;29062021130808
152;125;29062021130808
153;122;29062021130808
154;125;29062021130808
155;123;29062021130808
156;123;29062021130808
157;123;29062021130808
158;122;29062021130808
159;122;29062021130808
160;123;29062021130808
161;122;29062021130808
162;123;29062021130808
163;123;29062021130808
164;122;29062021130808
165;123;29062021130808
166;120;29062021130808
167;121;29062021130808
168;122;29062021130808
169;119;29062021130808
170;122;29062021130808
171;121;29062021130808
172;120;29062021130808
173;120;29062021130808
174;121;29062021130808
175;119;29062021130808
176;122;29062021130808
177;119;29062021130808
178;121;29062021130808
179;120;29062021130808
180;119;29062021130808
181;121;29062021130808
182;120;29062021130808
183;119;29062021130808
184;121;29062021130808
185;118;29062021130808
186;122;29062021130808
187;121;29062021130808
188;118;29062021130808
189;120;29062021130808
190;118;29062021130808
191;119;29062021130808
192;122;29062021130808
193;118;29062021130808
194;119;29062021130808
195;120;29062021130808
196;118;29062021130808
197;120;29062021130808
198;119;29062021130808
199;117;29062021130808
200;0;29062021130808
0;0;29062021130808
1;141;29062021130808
2;124;29062021130808
3;122;29062021130808
4;124;29062021130808
5;125;29062021130808
6;122;29062021130808
7;126;29062021130808
8;127;29062021130808
9;125;29062021130808
10;129;29062021130808
11;127;29062021130808
12;127;29062021130808
13;132;29062021130808
14;131;29062021130808
15;137;29062021130808
16;140;29062021130808
17;150;29062021130808
18;174;29062021130808
19;214;29062021130808
20;316;29062021130808
21;573;29062021130808
22;1023;29062021130808
23;1023;29062021130808
24;1023;29062021130808
25;1023;29062021130808
26;1023;29062021130808
27;1023;29062021130808
28;1023;29062021130808
29;1023;29062021130808
30;1023;29062021130808
31;1023;29062021130808
32;1023;29062021130808
33;1023;29062021130808
34;1023;29062021130808
35;978;29062021130808
36;769;29062021130808
37;604;29062021130808
38;491;29062021130808
39;408;29062021130808
40;353;29062021130808
41;308;29062021130808
42;289;29062021130808
43;265;29062021130808
44;255;29062021130808
45;249;29062021130808
46;240;29062021130808
47;243;29062021130808
48;242;29062021130808
49;241;29062021130808
50;245;29062021130808
51;243;29062021130808
52;243;29062021130808
53;249;29062021130808
54;252;29062021130808
55;254;29062021130808
56;259;29062021130808
57;264;29062021130808
58;272;29062021130808
59;277;29062021130808
60;285;29062021130808
61;288;29062021130808
62;293;29062021130808
63;300;29062021130808
64;299;29062021130808
65;299;29062021130808
66;305;29062021130808
67;305;29062021130808
68;302;29062021130808
69;303;29062021130808
70;292;29062021130808
71;291;29062021130808
72;289;29062021130808
73;279;29062021130808
74;276;29062021130808
75;266;29062021130808
76;260;29062021130808
77;258;29062021130808
78;249;29062021130808
79;241;29062021130808
80;238;29062021130808
81;231;29062021130808
82;229;29062021130808
83;221;29062021130808
84;222;29062021130808
85;218;29062021130808
86;215;29062021130808
87;215;29062021130808
88;215;29062021130808
89;209;29062021130808
90;209;29062021130808
91;203;29062021130808
92;200;29062021130808
93;199;29062021130808
94;194;29062021130808
95;188;29062021130808
96;190;29062021130808
97;184;29062021130808
98;181;29062021130808
99;181;29062021130808
100;175;29062021130808
101;176;29062021130808
102;172;29062021130808
103;170;29062021130808
104;168;29062021130808
105;165;29062021130808
106;168;29062021130808
107;163;29062021130808
108;160;29062021130808
109;161;29062021130808
110;157;29062021130808
111;156;29062021130808
112;158;29062021130808
113;152;29062021130808
114;153;29062021130808
115;151;29062021130808
116;150;29062021130808
117;151;29062021130808
118;148;29062021130808
119;147;29062021130808
120;145;29062021130808
121;142;29062021130808
122;143;29062021130808
123;143;29062021130808
124;140;29062021130808
125;140;29062021130808
126;139;29062021130808
127;138;29062021130808
128;138;29062021130808
129;135;29062021130808
130;137;29062021130808
131;137;29062021130808
132;133;29062021130808
133;136;29062021130808
134;131;29062021130808
135;133;29062021130808
136;133;29062021130808
137;130;29062021130808
138;131;29062021130808
139;130;29062021130808
140;127;29062021130808
141;129;29062021130808
142;128;29062021130808
143;126;29062021130808
144;128;29062021130808
145;125;29062021130808
146;128;29062021130808
147;128;29062021130808
148;124;29062021130808
149;125;29062021130808
150;125;29062021130808
151;125;29062021130808
152;124;29062021130808
153;123;29062021130808
154;125;29062021130808
155;123;29062021130808
156;122;29062021130808
157;123;29062021130808
158;122;29062021130808
159;122;29062021130808
160;122;29062021130808
161;120;29062021130808
162;123;29062021130808
163;123;29062021130808
164;121;29062021130808
165;123;29062021130808
166;121;29062021130808
167;123;29062021130808
168;123;29062021130808
169;118;29062021130808
170;121;29062021130808
171;120;29062021130808
172;119;29062021130808
173;121;29062021130808
174;120;29062021130808
175;119;29062021130808
176;120;29062021130808
177;119;29062021130808
178;121;29062021130808
179;119;29062021130808
180;118;29062021130808
181;121;29062021130808
182;119;29062021130808
183;119;29062021130808
184;121;29062021130808
185;117;29062021130808
186;120;29062021130808
187;120;29062021130808
188;117;29062021130808
189;120;29062021130808
190;118;29062021130808
191;118;29062021130808
192;121;29062021130808
193;118;29062021130808
194;119;29062021130808
195;119;29062021130808
196;118;29062021130808
197;118;29062021130808
198;120;29062021130808
199;119;29062021130808
200;0;29062021130808
