ind;val;datetime
0;0;17062021171513
1;159;17062021171513
2;280;17062021171513
3;248;17062021171513
4;268;17062021171513
5;248;17062021171513
6;270;17062021171513
7;286;17062021171513
8;286;17062021171513
9;260;17062021171513
10;277;17062021171513
11;292;17062021171513
12;275;17062021171513
13;303;17062021171513
14;292;17062021171513
15;314;17062021171513
16;328;17062021171513
17;358;17062021171513
18;455;17062021171513
19;637;17062021171513
20;954;17062021171513
21;1023;17062021171513
22;1023;17062021171513
23;1023;17062021171513
24;1023;17062021171513
25;1023;17062021171513
26;1023;17062021171513
27;1023;17062021171513
28;1023;17062021171513
29;1023;17062021171513
30;1023;17062021171513
31;1023;17062021171513
32;1023;17062021171513
33;1023;17062021171513
34;1023;17062021171513
35;1023;17062021171513
36;1023;17062021171513
37;1008;17062021171513
38;808;17062021171513
39;704;17062021171513
40;598;17062021171513
41;537;17062021171513
42;516;17062021171513
43;511;17062021171513
44;541;17062021171513
45;614;17062021171513
46;611;17062021171513
47;594;17062021171513
48;548;17062021171513
49;525;17062021171513
50;494;17062021171513
51;468;17062021171513
52;439;17062021171513
53;414;17062021171513
54;387;17062021171513
55;387;17062021171513
56;379;17062021171513
57;386;17062021171513
58;386;17062021171513
59;394;17062021171513
60;406;17062021171513
61;406;17062021171513
62;410;17062021171513
63;385;17062021171513
64;415;17062021171513
65;369;17062021171513
66;373;17062021171513
67;371;17062021171513
68;373;17062021171513
69;359;17062021171513
70;376;17062021171513
71;347;17062021171513
72;350;17062021171513
73;358;17062021171513
74;349;17062021171513
75;358;17062021171513
76;346;17062021171513
77;331;17062021171513
78;351;17062021171513
79;382;17062021171513
80;334;17062021171513
81;303;17062021171513
82;308;17062021171513
83;300;17062021171513
84;292;17062021171513
85;293;17062021171513
86;325;17062021171513
87;320;17062021171513
88;277;17062021171513
89;258;17062021171513
90;291;17062021171513
91;254;17062021171513
92;264;17062021171513
93;292;17062021171513
94;277;17062021171513
95;255;17062021171513
96;254;17062021171513
97;249;17062021171513
98;235;17062021171513
99;252;17062021171513
100;229;17062021171513
101;288;17062021171513
102;286;17062021171513
103;241;17062021171513
104;248;17062021171513
105;236;17062021171513
106;229;17062021171513
107;233;17062021171513
108;251;17062021171513
109;238;17062021171513
110;227;17062021171513
111;216;17062021171513
112;216;17062021171513
113;222;17062021171513
114;215;17062021171513
115;231;17062021171513
116;231;17062021171513
117;230;17062021171513
118;223;17062021171513
119;247;17062021171513
120;229;17062021171513
121;220;17062021171513
122;232;17062021171513
123;219;17062021171513
124;251;17062021171513
125;219;17062021171513
126;217;17062021171513
127;244;17062021171513
128;256;17062021171513
129;239;17062021171513
130;227;17062021171513
131;220;17062021171513
132;211;17062021171513
133;274;17062021171513
134;220;17062021171513
135;228;17062021171513
136;221;17062021171513
137;222;17062021171513
138;250;17062021171513
139;221;17062021171513
140;238;17062021171513
141;240;17062021171513
142;232;17062021171513
143;210;17062021171513
144;237;17062021171513
145;233;17062021171513
146;223;17062021171513
147;255;17062021171513
148;227;17062021171513
149;243;17062021171513
150;255;17062021171513
151;250;17062021171513
152;220;17062021171513
153;228;17062021171513
154;232;17062021171513
155;266;17062021171513
156;243;17062021171513
157;224;17062021171513
158;223;17062021171513
159;219;17062021171513
160;211;17062021171513
161;226;17062021171513
162;221;17062021171513
163;235;17062021171513
164;244;17062021171513
165;238;17062021171513
166;219;17062021171513
167;243;17062021171513
168;248;17062021171513
169;210;17062021171513
170;235;17062021171513
171;219;17062021171513
172;218;17062021171513
173;254;17062021171513
174;214;17062021171513
175;224;17062021171513
176;232;17062021171513
177;219;17062021171513
178;249;17062021171513
179;236;17062021171513
180;226;17062021171513
181;219;17062021171513
182;255;17062021171513
183;223;17062021171513
184;224;17062021171513
185;213;17062021171513
186;240;17062021171513
187;225;17062021171513
188;239;17062021171513
189;246;17062021171513
190;221;17062021171513
191;256;17062021171513
192;240;17062021171513
193;221;17062021171513
194;265;17062021171513
195;233;17062021171513
196;233;17062021171513
197;220;17062021171513
198;238;17062021171513
199;230;17062021171513
200;0;17062021171513
0;0;17062021171517
1;159;17062021171517
2;281;17062021171517
3;245;17062021171517
4;268;17062021171517
5;246;17062021171517
6;269;17062021171517
7;284;17062021171517
8;286;17062021171517
9;256;17062021171517
10;275;17062021171517
11;292;17062021171517
12;276;17062021171517
13;296;17062021171517
14;293;17062021171517
15;313;17062021171517
16;330;17062021171517
17;359;17062021171517
18;445;17062021171517
19;631;17062021171517
20;951;17062021171517
21;1023;17062021171517
22;1023;17062021171517
23;1023;17062021171517
24;1023;17062021171517
25;1023;17062021171517
26;1023;17062021171517
27;1023;17062021171517
28;1023;17062021171517
29;1023;17062021171517
30;1023;17062021171517
31;1023;17062021171517
32;1023;17062021171517
33;1023;17062021171517
34;1023;17062021171517
35;1023;17062021171517
36;1023;17062021171517
37;1015;17062021171517
38;818;17062021171517
39;704;17062021171517
40;600;17062021171517
41;541;17062021171517
42;518;17062021171517
43;511;17062021171517
44;539;17062021171517
45;614;17062021171517
46;610;17062021171517
47;590;17062021171517
48;550;17062021171517
49;531;17062021171517
50;494;17062021171517
51;465;17062021171517
52;438;17062021171517
53;412;17062021171517
54;386;17062021171517
55;384;17062021171517
56;376;17062021171517
57;386;17062021171517
58;384;17062021171517
59;393;17062021171517
60;403;17062021171517
61;408;17062021171517
62;408;17062021171517
63;383;17062021171517
64;417;17062021171517
65;370;17062021171517
66;369;17062021171517
67;369;17062021171517
68;369;17062021171517
69;356;17062021171517
70;379;17062021171517
71;348;17062021171517
72;347;17062021171517
73;358;17062021171517
74;348;17062021171517
75;356;17062021171517
76;342;17062021171517
77;330;17062021171517
78;347;17062021171517
79;376;17062021171517
80;332;17062021171517
81;300;17062021171517
82;302;17062021171517
83;296;17062021171517
84;291;17062021171517
85;290;17062021171517
86;325;17062021171517
87;319;17062021171517
88;279;17062021171517
89;254;17062021171517
90;290;17062021171517
91;254;17062021171517
92;264;17062021171517
93;291;17062021171517
94;273;17062021171517
95;253;17062021171517
96;253;17062021171517
97;248;17062021171517
98;232;17062021171517
99;252;17062021171517
100;228;17062021171517
101;285;17062021171517
102;283;17062021171517
103;240;17062021171517
104;247;17062021171517
105;237;17062021171517
106;226;17062021171517
107;228;17062021171517
108;250;17062021171517
109;235;17062021171517
110;227;17062021171517
111;217;17062021171517
112;215;17062021171517
113;219;17062021171517
114;213;17062021171517
115;230;17062021171517
116;231;17062021171517
117;228;17062021171517
118;222;17062021171517
119;245;17062021171517
120;230;17062021171517
121;220;17062021171517
122;228;17062021171517
123;216;17062021171517
124;246;17062021171517
125;218;17062021171517
126;217;17062021171517
127;246;17062021171517
128;252;17062021171517
129;237;17062021171517
130;227;17062021171517
131;220;17062021171517
132;210;17062021171517
133;272;17062021171517
134;218;17062021171517
135;224;17062021171517
136;218;17062021171517
137;219;17062021171517
138;247;17062021171517
139;220;17062021171517
140;236;17062021171517
141;237;17062021171517
142;231;17062021171517
143;208;17062021171517
144;236;17062021171517
145;233;17062021171517
146;228;17062021171517
147;253;17062021171517
148;226;17062021171517
149;242;17062021171517
150;254;17062021171517
151;247;17062021171517
152;219;17062021171517
153;227;17062021171517
154;230;17062021171517
155;263;17062021171517
156;244;17062021171517
157;222;17062021171517
158;221;17062021171517
159;215;17062021171517
160;209;17062021171517
161;227;17062021171517
162;220;17062021171517
163;236;17062021171517
164;245;17062021171517
165;238;17062021171517
166;220;17062021171517
167;239;17062021171517
168;247;17062021171517
169;211;17062021171517
170;232;17062021171517
171;215;17062021171517
172;216;17062021171517
173;249;17062021171517
174;216;17062021171517
175;226;17062021171517
176;231;17062021171517
177;220;17062021171517
178;249;17062021171517
179;235;17062021171517
180;227;17062021171517
181;218;17062021171517
182;253;17062021171517
183;223;17062021171517
184;225;17062021171517
185;212;17062021171517
186;238;17062021171517
187;225;17062021171517
188;239;17062021171517
189;240;17062021171517
190;217;17062021171517
191;251;17062021171517
192;239;17062021171517
193;220;17062021171517
194;263;17062021171517
195;234;17062021171517
196;229;17062021171517
197;217;17062021171517
198;235;17062021171517
199;219;17062021171517
200;0;17062021171517
0;0;17062021171519
1;160;17062021171519
2;281;17062021171519
3;250;17062021171519
4;268;17062021171519
5;247;17062021171519
6;273;17062021171519
7;288;17062021171519
8;287;17062021171519
9;258;17062021171519
10;280;17062021171519
11;290;17062021171519
12;279;17062021171519
13;303;17062021171519
14;292;17062021171519
15;315;17062021171519
16;329;17062021171519
17;358;17062021171519
18;451;17062021171519
19;632;17062021171519
20;944;17062021171519
21;1023;17062021171519
22;1023;17062021171519
23;1023;17062021171519
24;1023;17062021171519
25;1023;17062021171519
26;1023;17062021171519
27;1023;17062021171519
28;1023;17062021171519
29;1023;17062021171519
30;1023;17062021171519
31;1023;17062021171519
32;1023;17062021171519
33;1023;17062021171519
34;1023;17062021171519
35;1023;17062021171519
36;1023;17062021171519
37;1023;17062021171519
38;824;17062021171519
39;713;17062021171519
40;608;17062021171519
41;542;17062021171519
42;519;17062021171519
43;511;17062021171519
44;536;17062021171519
45;615;17062021171519
46;606;17062021171519
47;587;17062021171519
48;547;17062021171519
49;531;17062021171519
50;491;17062021171519
51;470;17062021171519
52;439;17062021171519
53;414;17062021171519
54;388;17062021171519
55;387;17062021171519
56;379;17062021171519
57;387;17062021171519
58;389;17062021171519
59;398;17062021171519
60;403;17062021171519
61;405;17062021171519
62;408;17062021171519
63;384;17062021171519
64;417;17062021171519
65;369;17062021171519
66;369;17062021171519
67;370;17062021171519
68;373;17062021171519
69;362;17062021171519
70;378;17062021171519
71;345;17062021171519
72;348;17062021171519
73;360;17062021171519
74;349;17062021171519
75;356;17062021171519
76;340;17062021171519
77;332;17062021171519
78;347;17062021171519
79;383;17062021171519
80;332;17062021171519
81;303;17062021171519
82;305;17062021171519
83;300;17062021171519
84;296;17062021171519
85;292;17062021171519
86;328;17062021171519
87;319;17062021171519
88;277;17062021171519
89;258;17062021171519
90;291;17062021171519
91;256;17062021171519
92;267;17062021171519
93;292;17062021171519
94;275;17062021171519
95;254;17062021171519
96;254;17062021171519
97;250;17062021171519
98;235;17062021171519
99;253;17062021171519
100;228;17062021171519
101;288;17062021171519
102;286;17062021171519
103;239;17062021171519
104;247;17062021171519
105;241;17062021171519
106;229;17062021171519
107;231;17062021171519
108;249;17062021171519
109;238;17062021171519
110;228;17062021171519
111;220;17062021171519
112;218;17062021171519
113;223;17062021171519
114;215;17062021171519
115;226;17062021171519
116;230;17062021171519
117;228;17062021171519
118;224;17062021171519
119;245;17062021171519
120;231;17062021171519
121;222;17062021171519
122;229;17062021171519
123;217;17062021171519
124;249;17062021171519
125;219;17062021171519
126;218;17062021171519
127;245;17062021171519
128;255;17062021171519
129;240;17062021171519
130;231;17062021171519
131;219;17062021171519
132;213;17062021171519
133;273;17062021171519
134;221;17062021171519
135;227;17062021171519
136;221;17062021171519
137;221;17062021171519
138;246;17062021171519
139;223;17062021171519
140;237;17062021171519
141;239;17062021171519
142;232;17062021171519
143;209;17062021171519
144;238;17062021171519
145;233;17062021171519
146;225;17062021171519
147;257;17062021171519
148;227;17062021171519
149;243;17062021171519
150;255;17062021171519
151;249;17062021171519
152;220;17062021171519
153;228;17062021171519
154;234;17062021171519
155;266;17062021171519
156;241;17062021171519
157;223;17062021171519
158;222;17062021171519
159;218;17062021171519
160;210;17062021171519
161;228;17062021171519
162;221;17062021171519
163;238;17062021171519
164;245;17062021171519
165;241;17062021171519
166;218;17062021171519
167;243;17062021171519
168;248;17062021171519
169;211;17062021171519
170;234;17062021171519
171;219;17062021171519
172;218;17062021171519
173;251;17062021171519
174;216;17062021171519
175;226;17062021171519
176;231;17062021171519
177;220;17062021171519
178;249;17062021171519
179;237;17062021171519
180;228;17062021171519
181;219;17062021171519
182;256;17062021171519
183;225;17062021171519
184;227;17062021171519
185;212;17062021171519
186;238;17062021171519
187;226;17062021171519
188;239;17062021171519
189;243;17062021171519
190;220;17062021171519
191;254;17062021171519
192;239;17062021171519
193;222;17062021171519
194;262;17062021171519
195;234;17062021171519
196;233;17062021171519
197;220;17062021171519
198;235;17062021171519
199;224;17062021171519
200;0;17062021171519
0;0;17062021171521
1;159;17062021171521
2;278;17062021171521
3;245;17062021171521
4;266;17062021171521
5;242;17062021171521
6;267;17062021171521
7;284;17062021171521
8;284;17062021171521
9;257;17062021171521
10;276;17062021171521
11;290;17062021171521
12;273;17062021171521
13;300;17062021171521
14;294;17062021171521
15;313;17062021171521
16;325;17062021171521
17;353;17062021171521
18;445;17062021171521
19;626;17062021171521
20;933;17062021171521
21;1023;17062021171521
22;1023;17062021171521
23;1023;17062021171521
24;1023;17062021171521
25;1023;17062021171521
26;1023;17062021171521
27;1023;17062021171521
28;1023;17062021171521
29;1023;17062021171521
30;1023;17062021171521
31;1023;17062021171521
32;1023;17062021171521
33;1023;17062021171521
34;1023;17062021171521
35;1023;17062021171521
36;1023;17062021171521
37;1023;17062021171521
38;826;17062021171521
39;715;17062021171521
40;601;17062021171521
41;543;17062021171521
42;512;17062021171521
43;503;17062021171521
44;535;17062021171521
45;603;17062021171521
46;598;17062021171521
47;583;17062021171521
48;545;17062021171521
49;521;17062021171521
50;491;17062021171521
51;467;17062021171521
52;435;17062021171521
53;410;17062021171521
54;384;17062021171521
55;386;17062021171521
56;374;17062021171521
57;385;17062021171521
58;384;17062021171521
59;392;17062021171521
60;401;17062021171521
61;403;17062021171521
62;400;17062021171521
63;381;17062021171521
64;411;17062021171521
65;367;17062021171521
66;365;17062021171521
67;367;17062021171521
68;366;17062021171521
69;359;17062021171521
70;376;17062021171521
71;343;17062021171521
72;346;17062021171521
73;355;17062021171521
74;343;17062021171521
75;355;17062021171521
76;337;17062021171521
77;329;17062021171521
78;344;17062021171521
79;380;17062021171521
80;328;17062021171521
81;298;17062021171521
82;303;17062021171521
83;298;17062021171521
84;290;17062021171521
85;289;17062021171521
86;321;17062021171521
87;320;17062021171521
88;274;17062021171521
89;257;17062021171521
90;290;17062021171521
91;255;17062021171521
92;264;17062021171521
93;290;17062021171521
94;271;17062021171521
95;251;17062021171521
96;253;17062021171521
97;250;17062021171521
98;235;17062021171521
99;248;17062021171521
100;227;17062021171521
101;286;17062021171521
102;283;17062021171521
103;238;17062021171521
104;244;17062021171521
105;236;17062021171521
106;228;17062021171521
107;230;17062021171521
108;249;17062021171521
109;235;17062021171521
110;225;17062021171521
111;218;17062021171521
112;215;17062021171521
113;220;17062021171521
114;212;17062021171521
115;226;17062021171521
116;228;17062021171521
117;227;17062021171521
118;222;17062021171521
119;244;17062021171521
120;229;17062021171521
121;219;17062021171521
122;229;17062021171521
123;216;17062021171521
124;249;17062021171521
125;217;17062021171521
126;216;17062021171521
127;243;17062021171521
128;254;17062021171521
129;238;17062021171521
130;226;17062021171521
131;217;17062021171521
132;211;17062021171521
133;272;17062021171521
134;219;17062021171521
135;226;17062021171521
136;218;17062021171521
137;219;17062021171521
138;244;17062021171521
139;219;17062021171521
140;236;17062021171521
141;239;17062021171521
142;232;17062021171521
143;207;17062021171521
144;235;17062021171521
145;232;17062021171521
146;221;17062021171521
147;256;17062021171521
148;224;17062021171521
149;240;17062021171521
150;256;17062021171521
151;247;17062021171521
152;219;17062021171521
153;226;17062021171521
154;230;17062021171521
155;262;17062021171521
156;242;17062021171521
157;221;17062021171521
158;223;17062021171521
159;217;17062021171521
160;209;17062021171521
161;226;17062021171521
162;218;17062021171521
163;233;17062021171521
164;242;17062021171521
165;237;17062021171521
166;217;17062021171521
167;240;17062021171521
168;247;17062021171521
169;210;17062021171521
170;235;17062021171521
171;216;17062021171521
172;216;17062021171521
173;250;17062021171521
174;215;17062021171521
175;227;17062021171521
176;230;17062021171521
177;220;17062021171521
178;250;17062021171521
179;236;17062021171521
180;225;17062021171521
181;217;17062021171521
182;252;17062021171521
183;224;17062021171521
184;223;17062021171521
185;211;17062021171521
186;239;17062021171521
187;223;17062021171521
188;239;17062021171521
189;241;17062021171521
190;217;17062021171521
191;252;17062021171521
192;238;17062021171521
193;219;17062021171521
194;261;17062021171521
195;231;17062021171521
196;230;17062021171521
197;218;17062021171521
198;234;17062021171521
199;221;17062021171521
200;0;17062021171521
0;0;17062021171524
1;159;17062021171524
2;279;17062021171524
3;244;17062021171524
4;264;17062021171524
5;244;17062021171524
6;267;17062021171524
7;283;17062021171524
8;284;17062021171524
9;256;17062021171524
10;276;17062021171524
11;288;17062021171524
12;274;17062021171524
13;298;17062021171524
14;291;17062021171524
15;312;17062021171524
16;325;17062021171524
17;353;17062021171524
18;444;17062021171524
19;630;17062021171524
20;940;17062021171524
21;1023;17062021171524
22;1023;17062021171524
23;1023;17062021171524
24;1023;17062021171524
25;1023;17062021171524
26;1023;17062021171524
27;1023;17062021171524
28;1023;17062021171524
29;1023;17062021171524
30;1023;17062021171524
31;1023;17062021171524
32;1023;17062021171524
33;1023;17062021171524
34;1023;17062021171524
35;1023;17062021171524
36;1023;17062021171524
37;1023;17062021171524
38;828;17062021171524
39;709;17062021171524
40;604;17062021171524
41;538;17062021171524
42;511;17062021171524
43;509;17062021171524
44;532;17062021171524
45;605;17062021171524
46;598;17062021171524
47;586;17062021171524
48;547;17062021171524
49;526;17062021171524
50;489;17062021171524
51;468;17062021171524
52;436;17062021171524
53;414;17062021171524
54;383;17062021171524
55;384;17062021171524
56;372;17062021171524
57;384;17062021171524
58;384;17062021171524
59;395;17062021171524
60;398;17062021171524
61;406;17062021171524
62;406;17062021171524
63;383;17062021171524
64;410;17062021171524
65;369;17062021171524
66;368;17062021171524
67;368;17062021171524
68;366;17062021171524
69;355;17062021171524
70;373;17062021171524
71;345;17062021171524
72;346;17062021171524
73;355;17062021171524
74;345;17062021171524
75;353;17062021171524
76;338;17062021171524
77;330;17062021171524
78;346;17062021171524
79;377;17062021171524
80;330;17062021171524
81;300;17062021171524
82;304;17062021171524
83;299;17062021171524
84;291;17062021171524
85;290;17062021171524
86;323;17062021171524
87;319;17062021171524
88;272;17062021171524
89;253;17062021171524
90;291;17062021171524
91;253;17062021171524
92;261;17062021171524
93;290;17062021171524
94;270;17062021171524
95;252;17062021171524
96;251;17062021171524
97;249;17062021171524
98;231;17062021171524
99;251;17062021171524
100;226;17062021171524
101;283;17062021171524
102;283;17062021171524
103;240;17062021171524
104;248;17062021171524
105;237;17062021171524
106;227;17062021171524
107;227;17062021171524
108;245;17062021171524
109;234;17062021171524
110;225;17062021171524
111;214;17062021171524
112;215;17062021171524
113;220;17062021171524
114;213;17062021171524
115;225;17062021171524
116;227;17062021171524
117;229;17062021171524
118;223;17062021171524
119;248;17062021171524
120;227;17062021171524
121;220;17062021171524
122;226;17062021171524
123;217;17062021171524
124;246;17062021171524
125;217;17062021171524
126;218;17062021171524
127;243;17062021171524
128;250;17062021171524
129;237;17062021171524
130;224;17062021171524
131;220;17062021171524
132;209;17062021171524
133;270;17062021171524
134;218;17062021171524
135;225;17062021171524
136;219;17062021171524
137;220;17062021171524
138;244;17062021171524
139;218;17062021171524
140;235;17062021171524
141;244;17062021171524
142;231;17062021171524
143;210;17062021171524
144;234;17062021171524
145;232;17062021171524
146;224;17062021171524
147;256;17062021171524
148;224;17062021171524
149;240;17062021171524
150;252;17062021171524
151;247;17062021171524
152;217;17062021171524
153;227;17062021171524
154;230;17062021171524
155;264;17062021171524
156;241;17062021171524
157;218;17062021171524
158;223;17062021171524
159;216;17062021171524
160;211;17062021171524
161;225;17062021171524
162;220;17062021171524
163;235;17062021171524
164;244;17062021171524
165;237;17062021171524
166;216;17062021171524
167;239;17062021171524
168;247;17062021171524
169;209;17062021171524
170;232;17062021171524
171;216;17062021171524
172;215;17062021171524
173;247;17062021171524
174;214;17062021171524
175;225;17062021171524
176;230;17062021171524
177;221;17062021171524
178;251;17062021171524
179;236;17062021171524
180;224;17062021171524
181;218;17062021171524
182;255;17062021171524
183;225;17062021171524
184;226;17062021171524
185;212;17062021171524
186;236;17062021171524
187;224;17062021171524
188;239;17062021171524
189;241;17062021171524
190;215;17062021171524
191;253;17062021171524
192;237;17062021171524
193;218;17062021171524
194;263;17062021171524
195;231;17062021171524
196;230;17062021171524
197;217;17062021171524
198;236;17062021171524
199;220;17062021171524
200;0;17062021171524
0;0;17062021171527
1;159;17062021171527
2;277;17062021171527
3;244;17062021171527
4;264;17062021171527
5;247;17062021171527
6;268;17062021171527
7;283;17062021171527
8;286;17062021171527
9;256;17062021171527
10;276;17062021171527
11;288;17062021171527
12;272;17062021171527
13;298;17062021171527
14;290;17062021171527
15;314;17062021171527
16;321;17062021171527
17;353;17062021171527
18;445;17062021171527
19;630;17062021171527
20;936;17062021171527
21;1023;17062021171527
22;1023;17062021171527
23;1023;17062021171527
24;1023;17062021171527
25;1023;17062021171527
26;1023;17062021171527
27;1023;17062021171527
28;1023;17062021171527
29;1023;17062021171527
30;1023;17062021171527
31;1023;17062021171527
32;1023;17062021171527
33;1023;17062021171527
34;1023;17062021171527
35;1023;17062021171527
36;1023;17062021171527
37;1023;17062021171527
38;831;17062021171527
39;711;17062021171527
40;602;17062021171527
41;542;17062021171527
42;515;17062021171527
43;511;17062021171527
44;533;17062021171527
45;604;17062021171527
46;603;17062021171527
47;583;17062021171527
48;544;17062021171527
49;527;17062021171527
50;493;17062021171527
51;470;17062021171527
52;435;17062021171527
53;409;17062021171527
54;382;17062021171527
55;389;17062021171527
56;376;17062021171527
57;383;17062021171527
58;381;17062021171527
59;396;17062021171527
60;401;17062021171527
61;408;17062021171527
62;409;17062021171527
63;384;17062021171527
64;410;17062021171527
65;366;17062021171527
66;367;17062021171527
67;368;17062021171527
68;366;17062021171527
69;359;17062021171527
70;374;17062021171527
71;347;17062021171527
72;348;17062021171527
73;353;17062021171527
74;344;17062021171527
75;356;17062021171527
76;344;17062021171527
77;330;17062021171527
78;346;17062021171527
79;377;17062021171527
80;332;17062021171527
81;299;17062021171527
82;304;17062021171527
83;298;17062021171527
84;291;17062021171527
85;290;17062021171527
86;326;17062021171527
87;320;17062021171527
88;275;17062021171527
89;257;17062021171527
90;288;17062021171527
91;252;17062021171527
92;264;17062021171527
93;289;17062021171527
94;272;17062021171527
95;253;17062021171527
96;253;17062021171527
97;248;17062021171527
98;234;17062021171527
99;250;17062021171527
100;227;17062021171527
101;284;17062021171527
102;287;17062021171527
103;238;17062021171527
104;247;17062021171527
105;236;17062021171527
106;227;17062021171527
107;229;17062021171527
108;247;17062021171527
109;239;17062021171527
110;225;17062021171527
111;215;17062021171527
112;216;17062021171527
113;220;17062021171527
114;215;17062021171527
115;228;17062021171527
116;229;17062021171527
117;227;17062021171527
118;222;17062021171527
119;246;17062021171527
120;230;17062021171527
121;218;17062021171527
122;226;17062021171527
123;216;17062021171527
124;250;17062021171527
125;218;17062021171527
126;215;17062021171527
127;242;17062021171527
128;253;17062021171527
129;237;17062021171527
130;224;17062021171527
131;218;17062021171527
132;211;17062021171527
133;272;17062021171527
134;218;17062021171527
135;227;17062021171527
136;219;17062021171527
137;221;17062021171527
138;246;17062021171527
139;219;17062021171527
140;235;17062021171527
141;239;17062021171527
142;229;17062021171527
143;208;17062021171527
144;235;17062021171527
145;230;17062021171527
146;222;17062021171527
147;255;17062021171527
148;225;17062021171527
149;240;17062021171527
150;254;17062021171527
151;246;17062021171527
152;219;17062021171527
153;228;17062021171527
154;230;17062021171527
155;265;17062021171527
156;243;17062021171527
157;221;17062021171527
158;222;17062021171527
159;216;17062021171527
160;210;17062021171527
161;225;17062021171527
162;219;17062021171527
163;235;17062021171527
164;242;17062021171527
165;237;17062021171527
166;218;17062021171527
167;237;17062021171527
168;245;17062021171527
169;210;17062021171527
170;233;17062021171527
171;215;17062021171527
172;217;17062021171527
173;249;17062021171527
174;215;17062021171527
175;225;17062021171527
176;232;17062021171527
177;217;17062021171527
178;250;17062021171527
179;235;17062021171527
180;226;17062021171527
181;216;17062021171527
182;253;17062021171527
183;222;17062021171527
184;222;17062021171527
185;210;17062021171527
186;235;17062021171527
187;225;17062021171527
188;239;17062021171527
189;240;17062021171527
190;216;17062021171527
191;252;17062021171527
192;241;17062021171527
193;221;17062021171527
194;261;17062021171527
195;232;17062021171527
196;230;17062021171527
197;218;17062021171527
198;237;17062021171527
199;222;17062021171527
200;0;17062021171527
0;0;17062021171529
1;159;17062021171529
2;281;17062021171529
3;246;17062021171529
4;264;17062021171529
5;243;17062021171529
6;270;17062021171529
7;284;17062021171529
8;285;17062021171529
9;256;17062021171529
10;275;17062021171529
11;288;17062021171529
12;274;17062021171529
13;298;17062021171529
14;290;17062021171529
15;314;17062021171529
16;323;17062021171529
17;354;17062021171529
18;445;17062021171529
19;630;17062021171529
20;939;17062021171529
21;1023;17062021171529
22;1023;17062021171529
23;1023;17062021171529
24;1023;17062021171529
25;1023;17062021171529
26;1023;17062021171529
27;1023;17062021171529
28;1023;17062021171529
29;1023;17062021171529
30;1023;17062021171529
31;1023;17062021171529
32;1023;17062021171529
33;1023;17062021171529
34;1023;17062021171529
35;1023;17062021171529
36;1023;17062021171529
37;1023;17062021171529
38;829;17062021171529
39;716;17062021171529
40;606;17062021171529
41;542;17062021171529
42;515;17062021171529
43;503;17062021171529
44;532;17062021171529
45;607;17062021171529
46;602;17062021171529
47;588;17062021171529
48;546;17062021171529
49;524;17062021171529
50;490;17062021171529
51;467;17062021171529
52;434;17062021171529
53;414;17062021171529
54;387;17062021171529
55;383;17062021171529
56;378;17062021171529
57;384;17062021171529
58;382;17062021171529
59;395;17062021171529
60;399;17062021171529
61;403;17062021171529
62;403;17062021171529
63;384;17062021171529
64;413;17062021171529
65;367;17062021171529
66;365;17062021171529
67;368;17062021171529
68;370;17062021171529
69;357;17062021171529
70;374;17062021171529
71;343;17062021171529
72;345;17062021171529
73;352;17062021171529
74;344;17062021171529
75;355;17062021171529
76;339;17062021171529
77;334;17062021171529
78;345;17062021171529
79;381;17062021171529
80;333;17062021171529
81;301;17062021171529
82;305;17062021171529
83;299;17062021171529
84;296;17062021171529
85;290;17062021171529
86;322;17062021171529
87;318;17062021171529
88;275;17062021171529
89;256;17062021171529
90;291;17062021171529
91;256;17062021171529
92;264;17062021171529
93;290;17062021171529
94;272;17062021171529
95;253;17062021171529
96;252;17062021171529
97;249;17062021171529
98;236;17062021171529
99;252;17062021171529
100;226;17062021171529
101;281;17062021171529
102;284;17062021171529
103;239;17062021171529
104;249;17062021171529
105;236;17062021171529
106;228;17062021171529
107;229;17062021171529
108;249;17062021171529
109;238;17062021171529
110;225;17062021171529
111;216;17062021171529
112;217;17062021171529
113;222;17062021171529
114;213;17062021171529
115;226;17062021171529
116;229;17062021171529
117;227;17062021171529
118;222;17062021171529
119;244;17062021171529
120;227;17062021171529
121;221;17062021171529
122;228;17062021171529
123;216;17062021171529
124;251;17062021171529
125;216;17062021171529
126;216;17062021171529
127;242;17062021171529
128;252;17062021171529
129;238;17062021171529
130;224;17062021171529
131;218;17062021171529
132;209;17062021171529
133;272;17062021171529
134;218;17062021171529
135;225;17062021171529
136;219;17062021171529
137;222;17062021171529
138;245;17062021171529
139;221;17062021171529
140;236;17062021171529
141;239;17062021171529
142;229;17062021171529
143;208;17062021171529
144;235;17062021171529
145;232;17062021171529
146;223;17062021171529
147;259;17062021171529
148;224;17062021171529
149;241;17062021171529
150;251;17062021171529
151;250;17062021171529
152;219;17062021171529
153;226;17062021171529
154;232;17062021171529
155;262;17062021171529
156;239;17062021171529
157;220;17062021171529
158;223;17062021171529
159;220;17062021171529
160;210;17062021171529
161;227;17062021171529
162;221;17062021171529
163;233;17062021171529
164;243;17062021171529
165;238;17062021171529
166;217;17062021171529
167;239;17062021171529
168;247;17062021171529
169;210;17062021171529
170;232;17062021171529
171;215;17062021171529
172;215;17062021171529
173;250;17062021171529
174;216;17062021171529
175;223;17062021171529
176;232;17062021171529
177;221;17062021171529
178;247;17062021171529
179;235;17062021171529
180;225;17062021171529
181;218;17062021171529
182;252;17062021171529
183;220;17062021171529
184;224;17062021171529
185;209;17062021171529
186;237;17062021171529
187;224;17062021171529
188;240;17062021171529
189;239;17062021171529
190;214;17062021171529
191;252;17062021171529
192;238;17062021171529
193;219;17062021171529
194;262;17062021171529
195;232;17062021171529
196;230;17062021171529
197;216;17062021171529
198;236;17062021171529
199;222;17062021171529
200;0;17062021171529
0;0;17062021171532
1;159;17062021171532
2;278;17062021171532
3;243;17062021171532
4;265;17062021171532
5;244;17062021171532
6;266;17062021171532
7;285;17062021171532
8;285;17062021171532
9;255;17062021171532
10;277;17062021171532
11;286;17062021171532
12;272;17062021171532
13;295;17062021171532
14;290;17062021171532
15;314;17062021171532
16;324;17062021171532
17;352;17062021171532
18;449;17062021171532
19;627;17062021171532
20;938;17062021171532
21;1023;17062021171532
22;1023;17062021171532
23;1023;17062021171532
24;1023;17062021171532
25;1023;17062021171532
26;1023;17062021171532
27;1023;17062021171532
28;1023;17062021171532
29;1023;17062021171532
30;1023;17062021171532
31;1023;17062021171532
32;1023;17062021171532
33;1023;17062021171532
34;1023;17062021171532
35;1023;17062021171532
36;1023;17062021171532
37;1023;17062021171532
38;830;17062021171532
39;713;17062021171532
40;607;17062021171532
41;545;17062021171532
42;515;17062021171532
43;503;17062021171532
44;538;17062021171532
45;611;17062021171532
46;600;17062021171532
47;588;17062021171532
48;544;17062021171532
49;525;17062021171532
50;492;17062021171532
51;466;17062021171532
52;439;17062021171532
53;410;17062021171532
54;385;17062021171532
55;383;17062021171532
56;377;17062021171532
57;384;17062021171532
58;383;17062021171532
59;390;17062021171532
60;400;17062021171532
61;400;17062021171532
62;406;17062021171532
63;382;17062021171532
64;408;17062021171532
65;368;17062021171532
66;369;17062021171532
67;369;17062021171532
68;369;17062021171532
69;355;17062021171532
70;377;17062021171532
71;342;17062021171532
72;348;17062021171532
73;353;17062021171532
74;344;17062021171532
75;357;17062021171532
76;345;17062021171532
77;332;17062021171532
78;347;17062021171532
79;377;17062021171532
80;329;17062021171532
81;300;17062021171532
82;304;17062021171532
83;300;17062021171532
84;289;17062021171532
85;290;17062021171532
86;319;17062021171532
87;319;17062021171532
88;273;17062021171532
89;256;17062021171532
90;290;17062021171532
91;252;17062021171532
92;263;17062021171532
93;290;17062021171532
94;272;17062021171532
95;251;17062021171532
96;252;17062021171532
97;248;17062021171532
98;234;17062021171532
99;250;17062021171532
100;227;17062021171532
101;286;17062021171532
102;282;17062021171532
103;240;17062021171532
104;245;17062021171532
105;237;17062021171532
106;226;17062021171532
107;229;17062021171532
108;245;17062021171532
109;233;17062021171532
110;225;17062021171532
111;213;17062021171532
112;214;17062021171532
113;222;17062021171532
114;213;17062021171532
115;224;17062021171532
116;228;17062021171532
117;227;17062021171532
118;220;17062021171532
119;247;17062021171532
120;228;17062021171532
121;220;17062021171532
122;227;17062021171532
123;215;17062021171532
124;249;17062021171532
125;217;17062021171532
126;215;17062021171532
127;241;17062021171532
128;252;17062021171532
129;237;17062021171532
130;224;17062021171532
131;219;17062021171532
132;210;17062021171532
133;272;17062021171532
134;218;17062021171532
135;225;17062021171532
136;218;17062021171532
137;219;17062021171532
138;243;17062021171532
139;219;17062021171532
140;236;17062021171532
141;241;17062021171532
142;230;17062021171532
143;207;17062021171532
144;236;17062021171532
145;230;17062021171532
146;224;17062021171532
147;255;17062021171532
148;222;17062021171532
149;241;17062021171532
150;253;17062021171532
151;246;17062021171532
152;219;17062021171532
153;226;17062021171532
154;228;17062021171532
155;263;17062021171532
156;241;17062021171532
157;220;17062021171532
158;220;17062021171532
159;217;17062021171532
160;210;17062021171532
161;227;17062021171532
162;220;17062021171532
163;232;17062021171532
164;241;17062021171532
165;238;17062021171532
166;215;17062021171532
167;238;17062021171532
168;248;17062021171532
169;211;17062021171532
170;231;17062021171532
171;217;17062021171532
172;214;17062021171532
173;249;17062021171532
174;214;17062021171532
175;224;17062021171532
176;229;17062021171532
177;217;17062021171532
178;247;17062021171532
179;235;17062021171532
180;227;17062021171532
181;218;17062021171532
182;254;17062021171532
183;223;17062021171532
184;222;17062021171532
185;209;17062021171532
186;237;17062021171532
187;224;17062021171532
188;241;17062021171532
189;240;17062021171532
190;217;17062021171532
191;251;17062021171532
192;237;17062021171532
193;219;17062021171532
194;264;17062021171532
195;231;17062021171532
196;228;17062021171532
197;218;17062021171532
198;235;17062021171532
199;225;17062021171532
200;0;17062021171532
0;0;17062021171535
1;159;17062021171535
2;281;17062021171535
3;246;17062021171535
4;265;17062021171535
5;246;17062021171535
6;267;17062021171535
7;285;17062021171535
8;282;17062021171535
9;253;17062021171535
10;276;17062021171535
11;287;17062021171535
12;273;17062021171535
13;298;17062021171535
14;289;17062021171535
15;311;17062021171535
16;322;17062021171535
17;355;17062021171535
18;446;17062021171535
19;628;17062021171535
20;941;17062021171535
21;1023;17062021171535
22;1023;17062021171535
23;1023;17062021171535
24;1023;17062021171535
25;1023;17062021171535
26;1023;17062021171535
27;1023;17062021171535
28;1023;17062021171535
29;1023;17062021171535
30;1023;17062021171535
31;1023;17062021171535
32;1023;17062021171535
33;1023;17062021171535
34;1023;17062021171535
35;1023;17062021171535
36;1023;17062021171535
37;1023;17062021171535
38;830;17062021171535
39;711;17062021171535
40;608;17062021171535
41;543;17062021171535
42;514;17062021171535
43;505;17062021171535
44;530;17062021171535
45;602;17062021171535
46;606;17062021171535
47;584;17062021171535
48;544;17062021171535
49;526;17062021171535
50;494;17062021171535
51;468;17062021171535
52;437;17062021171535
53;410;17062021171535
54;381;17062021171535
55;383;17062021171535
56;377;17062021171535
57;381;17062021171535
58;385;17062021171535
59;393;17062021171535
60;401;17062021171535
61;403;17062021171535
62;404;17062021171535
63;380;17062021171535
64;410;17062021171535
65;372;17062021171535
66;369;17062021171535
67;372;17062021171535
68;369;17062021171535
69;358;17062021171535
70;377;17062021171535
71;343;17062021171535
72;349;17062021171535
73;356;17062021171535
74;344;17062021171535
75;356;17062021171535
76;344;17062021171535
77;329;17062021171535
78;345;17062021171535
79;372;17062021171535
80;331;17062021171535
81;298;17062021171535
82;304;17062021171535
83;300;17062021171535
84;292;17062021171535
85;287;17062021171535
86;319;17062021171535
87;320;17062021171535
88;276;17062021171535
89;256;17062021171535
90;285;17062021171535
91;255;17062021171535
92;262;17062021171535
93;291;17062021171535
94;274;17062021171535
95;249;17062021171535
96;251;17062021171535
97;248;17062021171535
98;233;17062021171535
99;249;17062021171535
100;228;17062021171535
101;286;17062021171535
102;280;17062021171535
103;237;17062021171535
104;246;17062021171535
105;236;17062021171535
106;227;17062021171535
107;229;17062021171535
108;248;17062021171535
109;233;17062021171535
110;227;17062021171535
111;215;17062021171535
112;215;17062021171535
113;219;17062021171535
114;212;17062021171535
115;226;17062021171535
116;229;17062021171535
117;227;17062021171535
118;219;17062021171535
119;244;17062021171535
120;227;17062021171535
121;218;17062021171535
122;228;17062021171535
123;217;17062021171535
124;248;17062021171535
125;218;17062021171535
126;215;17062021171535
127;242;17062021171535
128;251;17062021171535
129;237;17062021171535
130;222;17062021171535
131;216;17062021171535
132;209;17062021171535
133;270;17062021171535
134;219;17062021171535
135;223;17062021171535
136;216;17062021171535
137;219;17062021171535
138;246;17062021171535
139;219;17062021171535
140;234;17062021171535
141;237;17062021171535
142;229;17062021171535
143;204;17062021171535
144;236;17062021171535
145;230;17062021171535
146;224;17062021171535
147;255;17062021171535
148;225;17062021171535
149;240;17062021171535
150;251;17062021171535
151;245;17062021171535
152;217;17062021171535
153;225;17062021171535
154;230;17062021171535
155;260;17062021171535
156;239;17062021171535
157;219;17062021171535
158;221;17062021171535
159;216;17062021171535
160;210;17062021171535
161;227;17062021171535
162;217;17062021171535
163;232;17062021171535
164;243;17062021171535
165;237;17062021171535
166;218;17062021171535
167;238;17062021171535
168;247;17062021171535
169;208;17062021171535
170;231;17062021171535
171;214;17062021171535
172;212;17062021171535
173;245;17062021171535
174;214;17062021171535
175;225;17062021171535
176;230;17062021171535
177;219;17062021171535
178;248;17062021171535
179;234;17062021171535
180;223;17062021171535
181;217;17062021171535
182;253;17062021171535
183;221;17062021171535
184;223;17062021171535
185;208;17062021171535
186;239;17062021171535
187;223;17062021171535
188;239;17062021171535
189;241;17062021171535
190;215;17062021171535
191;252;17062021171535
192;237;17062021171535
193;217;17062021171535
194;261;17062021171535
195;232;17062021171535
196;230;17062021171535
197;217;17062021171535
198;237;17062021171535
199;221;17062021171535
200;0;17062021171535
