ind;val;datetime
0;0;02082021175357
1;151;02082021175357
2;143;02082021175357
3;141;02082021175357
4;142;02082021175357
5;143;02082021175357
6;142;02082021175357
7;145;02082021175357
8;147;02082021175357
9;145;02082021175357
10;149;02082021175357
11;149;02082021175357
12;151;02082021175357
13;156;02082021175357
14;159;02082021175357
15;168;02082021175357
16;179;02082021175357
17;196;02082021175357
18;238;02082021175357
19;324;02082021175357
20;509;02082021175357
21;959;02082021175357
22;1023;02082021175357
23;1023;02082021175357
24;1023;02082021175357
25;1023;02082021175357
26;1023;02082021175357
27;1023;02082021175357
28;1023;02082021175357
29;1023;02082021175357
30;1023;02082021175357
31;1023;02082021175357
32;1023;02082021175357
33;1023;02082021175357
34;1023;02082021175357
35;1023;02082021175357
36;1023;02082021175357
37;931;02082021175357
38;797;02082021175357
39;709;02082021175357
40;646;02082021175357
41;606;02082021175357
42;601;02082021175357
43;592;02082021175357
44;592;02082021175357
45;598;02082021175357
46;600;02082021175357
47;611;02082021175357
48;620;02082021175357
49;625;02082021175357
50;640;02082021175357
51;654;02082021175357
52;664;02082021175357
53;687;02082021175357
54;701;02082021175357
55;719;02082021175357
56;741;02082021175357
57;764;02082021175357
58;793;02082021175357
59;810;02082021175357
60;833;02082021175357
61;858;02082021175357
62;866;02082021175357
63;892;02082021175357
64;903;02082021175357
65;907;02082021175357
66;912;02082021175357
67;913;02082021175357
68;911;02082021175357
69;896;02082021175357
70;881;02082021175357
71;869;02082021175357
72;852;02082021175357
73;824;02082021175357
74;811;02082021175357
75;774;02082021175357
76;752;02082021175357
77;730;02082021175357
78;707;02082021175357
79;681;02082021175357
80;656;02082021175357
81;627;02082021175357
82;613;02082021175357
83;595;02082021175357
84;582;02082021175357
85;573;02082021175357
86;564;02082021175357
87;557;02082021175357
88;554;02082021175357
89;539;02082021175357
90;531;02082021175357
91;518;02082021175357
92;498;02082021175357
93;491;02082021175357
94;471;02082021175357
95;452;02082021175357
96;446;02082021175357
97;429;02082021175357
98;419;02082021175357
99;406;02082021175357
100;393;02082021175357
101;387;02082021175357
102;377;02082021175357
103;363;02082021175357
104;357;02082021175357
105;349;02082021175357
106;342;02082021175357
107;327;02082021175357
108;324;02082021175357
109;314;02082021175357
110;307;02082021175357
111;298;02082021175357
112;294;02082021175357
113;285;02082021175357
114;282;02082021175357
115;277;02082021175357
116;272;02082021175357
117;269;02082021175357
118;260;02082021175357
119;256;02082021175357
120;249;02082021175357
121;244;02082021175357
122;243;02082021175357
123;235;02082021175357
124;231;02082021175357
125;228;02082021175357
126;222;02082021175357
127;219;02082021175357
128;217;02082021175357
129;213;02082021175357
130;210;02082021175357
131;205;02082021175357
132;199;02082021175357
133;201;02082021175357
134;195;02082021175357
135;193;02082021175357
136;190;02082021175357
137;185;02082021175357
138;185;02082021175357
139;181;02082021175357
140;177;02082021175357
141;177;02082021175357
142;171;02082021175357
143;170;02082021175357
144;171;02082021175357
145;166;02082021175357
146;167;02082021175357
147;166;02082021175357
148;161;02082021175357
149;161;02082021175357
150;159;02082021175357
151;158;02082021175357
152;156;02082021175357
153;152;02082021175357
154;154;02082021175357
155;152;02082021175357
156;151;02082021175357
157;151;02082021175357
158;149;02082021175357
159;147;02082021175357
160;146;02082021175357
161;145;02082021175357
162;147;02082021175357
163;145;02082021175357
164;144;02082021175357
165;144;02082021175357
166;142;02082021175357
167;142;02082021175357
168;143;02082021175357
169;139;02082021175357
170;142;02082021175357
171;140;02082021175357
172;140;02082021175357
173;140;02082021175357
174;136;02082021175357
175;136;02082021175357
176;138;02082021175357
177;136;02082021175357
178;138;02082021175357
179;136;02082021175357
180;136;02082021175357
181;138;02082021175357
182;136;02082021175357
183;134;02082021175357
184;135;02082021175357
185;133;02082021175357
186;136;02082021175357
187;134;02082021175357
188;132;02082021175357
189;135;02082021175357
190;133;02082021175357
191;133;02082021175357
192;136;02082021175357
193;131;02082021175357
194;134;02082021175357
195;133;02082021175357
196;132;02082021175357
197;133;02082021175357
198;132;02082021175357
199;131;02082021175357
200;0;02082021175357
0;0;02082021175357
1;151;02082021175357
2;142;02082021175357
3;140;02082021175357
4;142;02082021175357
5;144;02082021175357
6;142;02082021175357
7;144;02082021175357
8;146;02082021175357
9;146;02082021175357
10;150;02082021175357
11;150;02082021175357
12;152;02082021175357
13;158;02082021175357
14;159;02082021175357
15;168;02082021175357
16;177;02082021175357
17;194;02082021175357
18;240;02082021175357
19;323;02082021175357
20;514;02082021175357
21;958;02082021175357
22;1023;02082021175357
23;1023;02082021175357
24;1023;02082021175357
25;1023;02082021175357
26;1023;02082021175357
27;1023;02082021175357
28;1023;02082021175357
29;1023;02082021175357
30;1023;02082021175357
31;1023;02082021175357
32;1023;02082021175357
33;1023;02082021175357
34;1023;02082021175357
35;1023;02082021175357
36;1023;02082021175357
37;937;02082021175357
38;805;02082021175357
39;713;02082021175357
40;653;02082021175357
41;617;02082021175357
42;604;02082021175357
43;592;02082021175357
44;596;02082021175357
45;602;02082021175357
46;607;02082021175357
47;613;02082021175357
48;624;02082021175357
49;625;02082021175357
50;645;02082021175357
51;662;02082021175357
52;669;02082021175357
53;686;02082021175357
54;708;02082021175357
55;729;02082021175357
56;747;02082021175357
57;768;02082021175357
58;796;02082021175357
59;814;02082021175357
60;843;02082021175357
61;864;02082021175357
62;876;02082021175357
63;897;02082021175357
64;912;02082021175357
65;911;02082021175357
66;921;02082021175357
67;919;02082021175357
68;909;02082021175357
69;903;02082021175357
70;886;02082021175357
71;874;02082021175357
72;866;02082021175357
73;828;02082021175357
74;807;02082021175357
75;778;02082021175357
76;761;02082021175357
77;736;02082021175357
78;711;02082021175357
79;692;02082021175357
80;659;02082021175357
81;636;02082021175357
82;621;02082021175357
83;600;02082021175357
84;581;02082021175357
85;576;02082021175357
86;565;02082021175357
87;559;02082021175357
88;557;02082021175357
89;540;02082021175357
90;535;02082021175357
91;519;02082021175357
92;502;02082021175357
93;492;02082021175357
94;474;02082021175357
95;454;02082021175357
96;444;02082021175357
97;433;02082021175357
98;419;02082021175357
99;409;02082021175357
100;393;02082021175357
101;392;02082021175357
102;375;02082021175357
103;367;02082021175357
104;361;02082021175357
105;349;02082021175357
106;346;02082021175357
107;335;02082021175357
108;325;02082021175357
109;317;02082021175357
110;306;02082021175357
111;303;02082021175357
112;295;02082021175357
113;282;02082021175357
114;281;02082021175357
115;277;02082021175357
116;273;02082021175357
117;272;02082021175357
118;262;02082021175357
119;257;02082021175357
120;253;02082021175357
121;244;02082021175357
122;241;02082021175357
123;235;02082021175357
124;231;02082021175357
125;231;02082021175357
126;220;02082021175357
127;221;02082021175357
128;219;02082021175357
129;212;02082021175357
130;209;02082021175357
131;205;02082021175357
132;200;02082021175357
133;204;02082021175357
134;194;02082021175357
135;191;02082021175357
136;193;02082021175357
137;187;02082021175357
138;184;02082021175357
139;183;02082021175357
140;179;02082021175357
141;177;02082021175357
142;176;02082021175357
143;172;02082021175357
144;170;02082021175357
145;166;02082021175357
146;167;02082021175357
147;164;02082021175357
148;162;02082021175357
149;160;02082021175357
150;160;02082021175357
151;159;02082021175357
152;157;02082021175357
153;155;02082021175357
154;155;02082021175357
155;153;02082021175357
156;152;02082021175357
157;150;02082021175357
158;149;02082021175357
159;148;02082021175357
160;148;02082021175357
161;147;02082021175357
162;147;02082021175357
163;146;02082021175357
164;146;02082021175357
165;145;02082021175357
166;144;02082021175357
167;144;02082021175357
168;144;02082021175357
169;141;02082021175357
170;142;02082021175357
171;142;02082021175357
172;140;02082021175357
173;140;02082021175357
174;138;02082021175357
175;137;02082021175357
176;139;02082021175357
177;137;02082021175357
178;140;02082021175357
179;137;02082021175357
180;137;02082021175357
181;137;02082021175357
182;137;02082021175357
183;135;02082021175357
184;136;02082021175357
185;133;02082021175357
186;137;02082021175357
187;135;02082021175357
188;133;02082021175357
189;135;02082021175357
190;132;02082021175357
191;134;02082021175357
192;136;02082021175357
193;133;02082021175357
194;133;02082021175357
195;134;02082021175357
196;132;02082021175357
197;133;02082021175357
198;133;02082021175357
199;131;02082021175357
200;0;02082021175357
0;0;02082021175358
1;151;02082021175358
2;142;02082021175358
3;140;02082021175358
4;141;02082021175358
5;143;02082021175358
6;141;02082021175358
7;146;02082021175358
8;146;02082021175358
9;145;02082021175358
10;150;02082021175358
11;149;02082021175358
12;150;02082021175358
13;157;02082021175358
14;157;02082021175358
15;167;02082021175358
16;178;02082021175358
17;195;02082021175358
18;239;02082021175358
19;324;02082021175358
20;512;02082021175358
21;956;02082021175358
22;1023;02082021175358
23;1023;02082021175358
24;1023;02082021175358
25;1023;02082021175358
26;1023;02082021175358
27;1023;02082021175358
28;1023;02082021175358
29;1023;02082021175358
30;1023;02082021175358
31;1023;02082021175358
32;1023;02082021175358
33;1023;02082021175358
34;1023;02082021175358
35;1023;02082021175358
36;1023;02082021175358
37;943;02082021175358
38;815;02082021175358
39;714;02082021175358
40;651;02082021175358
41;618;02082021175358
42;605;02082021175358
43;594;02082021175358
44;597;02082021175358
45;606;02082021175358
46;607;02082021175358
47;610;02082021175358
48;621;02082021175358
49;635;02082021175358
50;641;02082021175358
51;658;02082021175358
52;667;02082021175358
53;692;02082021175358
54;708;02082021175358
55;728;02082021175358
56;743;02082021175358
57;766;02082021175358
58;795;02082021175358
59;813;02082021175358
60;844;02082021175358
61;864;02082021175358
62;876;02082021175358
63;901;02082021175358
64;914;02082021175358
65;915;02082021175358
66;919;02082021175358
67;921;02082021175358
68;917;02082021175358
69;909;02082021175358
70;888;02082021175358
71;874;02082021175358
72;863;02082021175358
73;830;02082021175358
74;816;02082021175358
75;782;02082021175358
76;762;02082021175358
77;735;02082021175358
78;714;02082021175358
79;687;02082021175358
80;658;02082021175358
81;632;02082021175358
82;618;02082021175358
83;599;02082021175358
84;590;02082021175358
85;576;02082021175358
86;569;02082021175358
87;564;02082021175358
88;557;02082021175358
89;544;02082021175358
90;537;02082021175358
91;522;02082021175358
92;506;02082021175358
93;492;02082021175358
94;471;02082021175358
95;455;02082021175358
96;446;02082021175358
97;429;02082021175358
98;419;02082021175358
99;410;02082021175358
100;396;02082021175358
101;390;02082021175358
102;378;02082021175358
103;369;02082021175358
104;358;02082021175358
105;344;02082021175358
106;344;02082021175358
107;331;02082021175358
108;324;02082021175358
109;319;02082021175358
110;306;02082021175358
111;300;02082021175358
112;295;02082021175358
113;285;02082021175358
114;282;02082021175358
115;279;02082021175358
116;272;02082021175358
117;271;02082021175358
118;262;02082021175358
119;257;02082021175358
120;250;02082021175358
121;245;02082021175358
122;242;02082021175358
123;238;02082021175358
124;233;02082021175358
125;230;02082021175358
126;223;02082021175358
127;221;02082021175358
128;219;02082021175358
129;212;02082021175358
130;210;02082021175358
131;207;02082021175358
132;201;02082021175358
133;202;02082021175358
134;195;02082021175358
135;192;02082021175358
136;192;02082021175358
137;187;02082021175358
138;187;02082021175358
139;182;02082021175358
140;178;02082021175358
141;178;02082021175358
142;174;02082021175358
143;171;02082021175358
144;170;02082021175358
145;166;02082021175358
146;169;02082021175358
147;165;02082021175358
148;161;02082021175358
149;160;02082021175358
150;159;02082021175358
151;160;02082021175358
152;157;02082021175358
153;154;02082021175358
154;155;02082021175358
155;152;02082021175358
156;151;02082021175358
157;151;02082021175358
158;149;02082021175358
159;148;02082021175358
160;149;02082021175358
161;147;02082021175358
162;146;02082021175358
163;146;02082021175358
164;143;02082021175358
165;146;02082021175358
166;142;02082021175358
167;142;02082021175358
168;143;02082021175358
169;139;02082021175358
170;141;02082021175358
171;140;02082021175358
172;139;02082021175358
173;140;02082021175358
174;139;02082021175358
175;138;02082021175358
176;139;02082021175358
177;136;02082021175358
178;139;02082021175358
179;138;02082021175358
180;136;02082021175358
181;137;02082021175358
182;136;02082021175358
183;134;02082021175358
184;134;02082021175358
185;132;02082021175358
186;135;02082021175358
187;134;02082021175358
188;132;02082021175358
189;133;02082021175358
190;132;02082021175358
191;132;02082021175358
192;135;02082021175358
193;131;02082021175358
194;132;02082021175358
195;132;02082021175358
196;132;02082021175358
197;132;02082021175358
198;132;02082021175358
199;131;02082021175358
200;0;02082021175358
0;0;02082021175359
1;150;02082021175359
2;142;02082021175359
3;141;02082021175359
4;141;02082021175359
5;142;02082021175359
6;142;02082021175359
7;144;02082021175359
8;146;02082021175359
9;143;02082021175359
10;149;02082021175359
11;147;02082021175359
12;150;02082021175359
13;157;02082021175359
14;159;02082021175359
15;166;02082021175359
16;178;02082021175359
17;196;02082021175359
18;237;02082021175359
19;320;02082021175359
20;506;02082021175359
21;947;02082021175359
22;1023;02082021175359
23;1023;02082021175359
24;1023;02082021175359
25;1023;02082021175359
26;1023;02082021175359
27;1023;02082021175359
28;1023;02082021175359
29;1023;02082021175359
30;1023;02082021175359
31;1023;02082021175359
32;1023;02082021175359
33;1023;02082021175359
34;1023;02082021175359
35;1023;02082021175359
36;1023;02082021175359
37;943;02082021175359
38;808;02082021175359
39;717;02082021175359
40;652;02082021175359
41;618;02082021175359
42;605;02082021175359
43;591;02082021175359
44;595;02082021175359
45;597;02082021175359
46;602;02082021175359
47;611;02082021175359
48;626;02082021175359
49;628;02082021175359
50;644;02082021175359
51;656;02082021175359
52;662;02082021175359
53;688;02082021175359
54;706;02082021175359
55;725;02082021175359
56;749;02082021175359
57;761;02082021175359
58;791;02082021175359
59;812;02082021175359
60;837;02082021175359
61;861;02082021175359
62;871;02082021175359
63;897;02082021175359
64;904;02082021175359
65;909;02082021175359
66;920;02082021175359
67;917;02082021175359
68;908;02082021175359
69;901;02082021175359
70;884;02082021175359
71;874;02082021175359
72;858;02082021175359
73;830;02082021175359
74;810;02082021175359
75;777;02082021175359
76;758;02082021175359
77;736;02082021175359
78;708;02082021175359
79;681;02082021175359
80;658;02082021175359
81;632;02082021175359
82;614;02082021175359
83;593;02082021175359
84;586;02082021175359
85;577;02082021175359
86;570;02082021175359
87;559;02082021175359
88;556;02082021175359
89;537;02082021175359
90;533;02082021175359
91;519;02082021175359
92;504;02082021175359
93;486;02082021175359
94;474;02082021175359
95;458;02082021175359
96;444;02082021175359
97;431;02082021175359
98;420;02082021175359
99;404;02082021175359
100;393;02082021175359
101;389;02082021175359
102;377;02082021175359
103;367;02082021175359
104;356;02082021175359
105;345;02082021175359
106;341;02082021175359
107;330;02082021175359
108;323;02082021175359
109;316;02082021175359
110;305;02082021175359
111;301;02082021175359
112;296;02082021175359
113;285;02082021175359
114;283;02082021175359
115;278;02082021175359
116;272;02082021175359
117;268;02082021175359
118;259;02082021175359
119;259;02082021175359
120;249;02082021175359
121;243;02082021175359
122;243;02082021175359
123;235;02082021175359
124;229;02082021175359
125;225;02082021175359
126;221;02082021175359
127;220;02082021175359
128;216;02082021175359
129;210;02082021175359
130;206;02082021175359
131;204;02082021175359
132;199;02082021175359
133;201;02082021175359
134;190;02082021175359
135;190;02082021175359
136;191;02082021175359
137;185;02082021175359
138;185;02082021175359
139;182;02082021175359
140;177;02082021175359
141;178;02082021175359
142;171;02082021175359
143;169;02082021175359
144;171;02082021175359
145;164;02082021175359
146;167;02082021175359
147;163;02082021175359
148;160;02082021175359
149;161;02082021175359
150;160;02082021175359
151;157;02082021175359
152;156;02082021175359
153;153;02082021175359
154;154;02082021175359
155;153;02082021175359
156;149;02082021175359
157;150;02082021175359
158;147;02082021175359
159;147;02082021175359
160;148;02082021175359
161;144;02082021175359
162;145;02082021175359
163;145;02082021175359
164;144;02082021175359
165;144;02082021175359
166;141;02082021175359
167;141;02082021175359
168;143;02082021175359
169;139;02082021175359
170;141;02082021175359
171;139;02082021175359
172;139;02082021175359
173;139;02082021175359
174;138;02082021175359
175;136;02082021175359
176;137;02082021175359
177;135;02082021175359
178;138;02082021175359
179;136;02082021175359
180;135;02082021175359
181;137;02082021175359
182;136;02082021175359
183;134;02082021175359
184;135;02082021175359
185;132;02082021175359
186;135;02082021175359
187;134;02082021175359
188;131;02082021175359
189;134;02082021175359
190;132;02082021175359
191;133;02082021175359
192;136;02082021175359
193;132;02082021175359
194;132;02082021175359
195;132;02082021175359
196;131;02082021175359
197;132;02082021175359
198;132;02082021175359
199;130;02082021175359
200;0;02082021175359
0;0;02082021175359
1;151;02082021175359
2;142;02082021175359
3;140;02082021175359
4;141;02082021175359
5;142;02082021175359
6;141;02082021175359
7;144;02082021175359
8;145;02082021175359
9;144;02082021175359
10;150;02082021175359
11;148;02082021175359
12;150;02082021175359
13;157;02082021175359
14;159;02082021175359
15;167;02082021175359
16;177;02082021175359
17;195;02082021175359
18;239;02082021175359
19;327;02082021175359
20;512;02082021175359
21;949;02082021175359
22;1023;02082021175359
23;1023;02082021175359
24;1023;02082021175359
25;1023;02082021175359
26;1023;02082021175359
27;1023;02082021175359
28;1023;02082021175359
29;1023;02082021175359
30;1023;02082021175359
31;1023;02082021175359
32;1023;02082021175359
33;1023;02082021175359
34;1023;02082021175359
35;1023;02082021175359
36;1023;02082021175359
37;956;02082021175359
38;820;02082021175359
39;719;02082021175359
40;662;02082021175359
41;623;02082021175359
42;609;02082021175359
43;599;02082021175359
44;601;02082021175359
45;605;02082021175359
46;613;02082021175359
47;619;02082021175359
48;626;02082021175359
49;638;02082021175359
50;646;02082021175359
51;663;02082021175359
52;674;02082021175359
53;697;02082021175359
54;710;02082021175359
55;725;02082021175359
56;750;02082021175359
57;769;02082021175359
58;800;02082021175359
59;820;02082021175359
60;846;02082021175359
61;868;02082021175359
62;878;02082021175359
63;903;02082021175359
64;911;02082021175359
65;917;02082021175359
66;927;02082021175359
67;924;02082021175359
68;920;02082021175359
69;913;02082021175359
70;895;02082021175359
71;883;02082021175359
72;863;02082021175359
73;839;02082021175359
74;816;02082021175359
75;782;02082021175359
76;763;02082021175359
77;743;02082021175359
78;716;02082021175359
79;691;02082021175359
80;658;02082021175359
81;636;02082021175359
82;624;02082021175359
83;602;02082021175359
84;587;02082021175359
85;579;02082021175359
86;572;02082021175359
87;566;02082021175359
88;562;02082021175359
89;542;02082021175359
90;538;02082021175359
91;525;02082021175359
92;508;02082021175359
93;497;02082021175359
94;481;02082021175359
95;461;02082021175359
96;448;02082021175359
97;432;02082021175359
98;420;02082021175359
99;411;02082021175359
100;400;02082021175359
101;394;02082021175359
102;378;02082021175359
103;365;02082021175359
104;362;02082021175359
105;347;02082021175359
106;343;02082021175359
107;333;02082021175359
108;328;02082021175359
109;319;02082021175359
110;310;02082021175359
111;302;02082021175359
112;296;02082021175359
113;289;02082021175359
114;283;02082021175359
115;280;02082021175359
116;274;02082021175359
117;271;02082021175359
118;262;02082021175359
119;260;02082021175359
120;252;02082021175359
121;247;02082021175359
122;243;02082021175359
123;237;02082021175359
124;232;02082021175359
125;229;02082021175359
126;223;02082021175359
127;219;02082021175359
128;222;02082021175359
129;213;02082021175359
130;210;02082021175359
131;207;02082021175359
132;201;02082021175359
133;205;02082021175359
134;196;02082021175359
135;193;02082021175359
136;193;02082021175359
137;184;02082021175359
138;187;02082021175359
139;184;02082021175359
140;179;02082021175359
141;178;02082021175359
142;174;02082021175359
143;171;02082021175359
144;171;02082021175359
145;168;02082021175359
146;168;02082021175359
147;166;02082021175359
148;163;02082021175359
149;163;02082021175359
150;159;02082021175359
151;159;02082021175359
152;157;02082021175359
153;156;02082021175359
154;156;02082021175359
155;154;02082021175359
156;151;02082021175359
157;152;02082021175359
158;149;02082021175359
159;147;02082021175359
160;149;02082021175359
161;146;02082021175359
162;148;02082021175359
163;147;02082021175359
164;145;02082021175359
165;146;02082021175359
166;143;02082021175359
167;144;02082021175359
168;144;02082021175359
169;138;02082021175359
170;142;02082021175359
171;140;02082021175359
172;139;02082021175359
173;141;02082021175359
174;139;02082021175359
175;137;02082021175359
176;139;02082021175359
177;137;02082021175359
178;140;02082021175359
179;138;02082021175359
180;136;02082021175359
181;138;02082021175359
182;137;02082021175359
183;136;02082021175359
184;135;02082021175359
185;133;02082021175359
186;136;02082021175359
187;136;02082021175359
188;133;02082021175359
189;135;02082021175359
190;133;02082021175359
191;134;02082021175359
192;137;02082021175359
193;133;02082021175359
194;135;02082021175359
195;133;02082021175359
196;133;02082021175359
197;133;02082021175359
198;133;02082021175359
199;132;02082021175359
200;0;02082021175359
0;0;02082021175359
1;149;02082021175359
2;140;02082021175359
3;140;02082021175359
4;141;02082021175359
5;142;02082021175359
6;141;02082021175359
7;142;02082021175359
8;145;02082021175359
9;145;02082021175359
10;148;02082021175359
11;148;02082021175359
12;149;02082021175359
13;156;02082021175359
14;157;02082021175359
15;166;02082021175359
16;177;02082021175359
17;194;02082021175359
18;237;02082021175359
19;321;02082021175359
20;502;02082021175359
21;938;02082021175359
22;1023;02082021175359
23;1023;02082021175359
24;1023;02082021175359
25;1023;02082021175359
26;1023;02082021175359
27;1023;02082021175359
28;1023;02082021175359
29;1023;02082021175359
30;1023;02082021175359
31;1023;02082021175359
32;1023;02082021175359
33;1023;02082021175359
34;1023;02082021175359
35;1023;02082021175359
36;1023;02082021175359
37;957;02082021175359
38;823;02082021175359
39;724;02082021175359
40;657;02082021175359
41;625;02082021175359
42;603;02082021175359
43;599;02082021175359
44;596;02082021175359
45;597;02082021175359
46;601;02082021175359
47;610;02082021175359
48;625;02082021175359
49;633;02082021175359
50;642;02082021175359
51;657;02082021175359
52;668;02082021175359
53;685;02082021175359
54;709;02082021175359
55;724;02082021175359
56;750;02082021175359
57;768;02082021175359
58;793;02082021175359
59;817;02082021175359
60;838;02082021175359
61;864;02082021175359
62;876;02082021175359
63;898;02082021175359
64;908;02082021175359
65;916;02082021175359
66;923;02082021175359
67;921;02082021175359
68;914;02082021175359
69;903;02082021175359
70;892;02082021175359
71;876;02082021175359
72;862;02082021175359
73;832;02082021175359
74;815;02082021175359
75;781;02082021175359
76;761;02082021175359
77;737;02082021175359
78;713;02082021175359
79;684;02082021175359
80;663;02082021175359
81;634;02082021175359
82;623;02082021175359
83;603;02082021175359
84;589;02082021175359
85;577;02082021175359
86;569;02082021175359
87;560;02082021175359
88;559;02082021175359
89;542;02082021175359
90;536;02082021175359
91;527;02082021175359
92;505;02082021175359
93;496;02082021175359
94;477;02082021175359
95;456;02082021175359
96;446;02082021175359
97;433;02082021175359
98;421;02082021175359
99;409;02082021175359
100;395;02082021175359
101;392;02082021175359
102;380;02082021175359
103;367;02082021175359
104;359;02082021175359
105;350;02082021175359
106;344;02082021175359
107;334;02082021175359
108;325;02082021175359
109;317;02082021175359
110;308;02082021175359
111;299;02082021175359
112;296;02082021175359
113;288;02082021175359
114;283;02082021175359
115;281;02082021175359
116;274;02082021175359
117;271;02082021175359
118;262;02082021175359
119;259;02082021175359
120;250;02082021175359
121;246;02082021175359
122;241;02082021175359
123;238;02082021175359
124;232;02082021175359
125;229;02082021175359
126;219;02082021175359
127;219;02082021175359
128;218;02082021175359
129;213;02082021175359
130;208;02082021175359
131;208;02082021175359
132;202;02082021175359
133;201;02082021175359
134;196;02082021175359
135;192;02082021175359
136;190;02082021175359
137;187;02082021175359
138;185;02082021175359
139;181;02082021175359
140;177;02082021175359
141;178;02082021175359
142;175;02082021175359
143;169;02082021175359
144;171;02082021175359
145;166;02082021175359
146;168;02082021175359
147;165;02082021175359
148;161;02082021175359
149;160;02082021175359
150;159;02082021175359
151;160;02082021175359
152;156;02082021175359
153;155;02082021175359
154;157;02082021175359
155;152;02082021175359
156;152;02082021175359
157;151;02082021175359
158;148;02082021175359
159;148;02082021175359
160;148;02082021175359
161;146;02082021175359
162;147;02082021175359
163;146;02082021175359
164;144;02082021175359
165;146;02082021175359
166;144;02082021175359
167;143;02082021175359
168;143;02082021175359
169;140;02082021175359
170;142;02082021175359
171;140;02082021175359
172;138;02082021175359
173;139;02082021175359
174;138;02082021175359
175;138;02082021175359
176;138;02082021175359
177;137;02082021175359
178;138;02082021175359
179;137;02082021175359
180;136;02082021175359
181;136;02082021175359
182;136;02082021175359
183;134;02082021175359
184;135;02082021175359
185;132;02082021175359
186;136;02082021175359
187;134;02082021175359
188;132;02082021175359
189;135;02082021175359
190;133;02082021175359
191;134;02082021175359
192;136;02082021175359
193;131;02082021175359
194;133;02082021175359
195;132;02082021175359
196;131;02082021175359
197;132;02082021175359
198;133;02082021175359
199;131;02082021175359
200;0;02082021175359
0;0;02082021175400
1;151;02082021175400
2;141;02082021175400
3;140;02082021175400
4;142;02082021175400
5;141;02082021175400
6;141;02082021175400
7;144;02082021175400
8;147;02082021175400
9;144;02082021175400
10;150;02082021175400
11;148;02082021175400
12;150;02082021175400
13;156;02082021175400
14;158;02082021175400
15;168;02082021175400
16;178;02082021175400
17;195;02082021175400
18;240;02082021175400
19;323;02082021175400
20;510;02082021175400
21;953;02082021175400
22;1023;02082021175400
23;1023;02082021175400
24;1023;02082021175400
25;1023;02082021175400
26;1023;02082021175400
27;1023;02082021175400
28;1023;02082021175400
29;1023;02082021175400
30;1023;02082021175400
31;1023;02082021175400
32;1023;02082021175400
33;1023;02082021175400
34;1023;02082021175400
35;1023;02082021175400
36;1023;02082021175400
37;962;02082021175400
38;825;02082021175400
39;729;02082021175400
40;660;02082021175400
41;625;02082021175400
42;614;02082021175400
43;599;02082021175400
44;601;02082021175400
45;603;02082021175400
46;608;02082021175400
47;613;02082021175400
48;632;02082021175400
49;639;02082021175400
50;651;02082021175400
51;667;02082021175400
52;675;02082021175400
53;697;02082021175400
54;713;02082021175400
55;732;02082021175400
56;752;02082021175400
57;775;02082021175400
58;809;02082021175400
59;826;02082021175400
60;848;02082021175400
61;874;02082021175400
62;882;02082021175400
63;905;02082021175400
64;912;02082021175400
65;919;02082021175400
66;927;02082021175400
67;931;02082021175400
68;922;02082021175400
69;913;02082021175400
70;889;02082021175400
71;885;02082021175400
72;869;02082021175400
73;839;02082021175400
74;822;02082021175400
75;783;02082021175400
76;764;02082021175400
77;745;02082021175400
78;717;02082021175400
79;692;02082021175400
80;664;02082021175400
81;641;02082021175400
82;622;02082021175400
83;604;02082021175400
84;595;02082021175400
85;583;02082021175400
86;575;02082021175400
87;566;02082021175400
88;561;02082021175400
89;551;02082021175400
90;542;02082021175400
91;528;02082021175400
92;512;02082021175400
93;493;02082021175400
94;476;02082021175400
95;459;02082021175400
96;452;02082021175400
97;435;02082021175400
98;419;02082021175400
99;410;02082021175400
100;399;02082021175400
101;389;02082021175400
102;383;02082021175400
103;369;02082021175400
104;362;02082021175400
105;351;02082021175400
106;347;02082021175400
107;336;02082021175400
108;326;02082021175400
109;321;02082021175400
110;310;02082021175400
111;305;02082021175400
112;297;02082021175400
113;286;02082021175400
114;283;02082021175400
115;282;02082021175400
116;275;02082021175400
117;269;02082021175400
118;262;02082021175400
119;259;02082021175400
120;253;02082021175400
121;246;02082021175400
122;244;02082021175400
123;236;02082021175400
124;235;02082021175400
125;230;02082021175400
126;222;02082021175400
127;221;02082021175400
128;220;02082021175400
129;214;02082021175400
130;212;02082021175400
131;207;02082021175400
132;202;02082021175400
133;202;02082021175400
134;197;02082021175400
135;191;02082021175400
136;194;02082021175400
137;186;02082021175400
138;186;02082021175400
139;182;02082021175400
140;179;02082021175400
141;180;02082021175400
142;173;02082021175400
143;171;02082021175400
144;171;02082021175400
145;167;02082021175400
146;168;02082021175400
147;165;02082021175400
148;162;02082021175400
149;161;02082021175400
150;159;02082021175400
151;158;02082021175400
152;158;02082021175400
153;153;02082021175400
154;156;02082021175400
155;154;02082021175400
156;152;02082021175400
157;151;02082021175400
158;148;02082021175400
159;146;02082021175400
160;149;02082021175400
161;145;02082021175400
162;147;02082021175400
163;146;02082021175400
164;144;02082021175400
165;145;02082021175400
166;143;02082021175400
167;143;02082021175400
168;144;02082021175400
169;140;02082021175400
170;141;02082021175400
171;139;02082021175400
172;140;02082021175400
173;140;02082021175400
174;138;02082021175400
175;136;02082021175400
176;139;02082021175400
177;136;02082021175400
178;139;02082021175400
179;137;02082021175400
180;135;02082021175400
181;136;02082021175400
182;136;02082021175400
183;134;02082021175400
184;136;02082021175400
185;132;02082021175400
186;135;02082021175400
187;136;02082021175400
188;133;02082021175400
189;134;02082021175400
190;133;02082021175400
191;133;02082021175400
192;137;02082021175400
193;133;02082021175400
194;133;02082021175400
195;133;02082021175400
196;131;02082021175400
197;134;02082021175400
198;132;02082021175400
199;131;02082021175400
200;0;02082021175400
