ind;val;datetime
0;0;29062021163444
1;144;29062021163444
2;136;29062021163444
3;134;29062021163444
4;136;29062021163444
5;136;29062021163444
6;134;29062021163444
7;137;29062021163444
8;139;29062021163444
9;138;29062021163444
10;142;29062021163444
11;142;29062021163444
12;144;29062021163444
13;151;29062021163444
14;151;29062021163444
15;162;29062021163444
16;173;29062021163444
17;192;29062021163444
18;244;29062021163444
19;341;29062021163444
20;553;29062021163444
21;1008;29062021163444
22;1023;29062021163444
23;1023;29062021163444
24;1023;29062021163444
25;1023;29062021163444
26;1023;29062021163444
27;1023;29062021163444
28;1023;29062021163444
29;1023;29062021163444
30;1023;29062021163444
31;1023;29062021163444
32;1023;29062021163444
33;1023;29062021163444
34;1023;29062021163444
35;1023;29062021163444
36;891;29062021163444
37;707;29062021163444
38;571;29062021163444
39;475;29062021163444
40;410;29062021163444
41;370;29062021163444
42;346;29062021163444
43;331;29062021163444
44;324;29062021163444
45;316;29062021163444
46;315;29062021163444
47;311;29062021163444
48;313;29062021163444
49;307;29062021163444
50;309;29062021163444
51;308;29062021163444
52;311;29062021163444
53;318;29062021163444
54;314;29062021163444
55;320;29062021163444
56;326;29062021163444
57;330;29062021163444
58;343;29062021163444
59;345;29062021163444
60;354;29062021163444
61;361;29062021163444
62;365;29062021163444
63;369;29062021163444
64;371;29062021163444
65;368;29062021163444
66;371;29062021163444
67;367;29062021163444
68;363;29062021163444
69;359;29062021163444
70;353;29062021163444
71;343;29062021163444
72;340;29062021163444
73;328;29062021163444
74;324;29062021163444
75;312;29062021163444
76;302;29062021163444
77;296;29062021163444
78;288;29062021163444
79;278;29062021163444
80;272;29062021163444
81;260;29062021163444
82;260;29062021163444
83;252;29062021163444
84;249;29062021163444
85;244;29062021163444
86;241;29062021163444
87;239;29062021163444
88;237;29062021163444
89;228;29062021163444
90;228;29062021163444
91;224;29062021163444
92;218;29062021163444
93;215;29062021163444
94;210;29062021163444
95;206;29062021163444
96;202;29062021163444
97;199;29062021163444
98;194;29062021163444
99;191;29062021163444
100;187;29062021163444
101;187;29062021163444
102;184;29062021163444
103;180;29062021163444
104;179;29062021163444
105;175;29062021163444
106;176;29062021163444
107;170;29062021163444
108;170;29062021163444
109;168;29062021163444
110;165;29062021163444
111;162;29062021163444
112;163;29062021163444
113;160;29062021163444
114;160;29062021163444
115;158;29062021163444
116;157;29062021163444
117;158;29062021163444
118;154;29062021163444
119;154;29062021163444
120;150;29062021163444
121;147;29062021163444
122;150;29062021163444
123;147;29062021163444
124;146;29062021163444
125;147;29062021163444
126;146;29062021163444
127;144;29062021163444
128;145;29062021163444
129;142;29062021163444
130;142;29062021163444
131;140;29062021163444
132;137;29062021163444
133;142;29062021163444
134;138;29062021163444
135;137;29062021163444
136;139;29062021163444
137;135;29062021163444
138;136;29062021163444
139;134;29062021163444
140;132;29062021163444
141;134;29062021163444
142;132;29062021163444
143;132;29062021163444
144;134;29062021163444
145;131;29062021163444
146;133;29062021163444
147;132;29062021163444
148;130;29062021163444
149;131;29062021163444
150;130;29062021163444
151;130;29062021163444
152;130;29062021163444
153;127;29062021163444
154;129;29062021163444
155;128;29062021163444
156;127;29062021163444
157;128;29062021163444
158;127;29062021163444
159;128;29062021163444
160;127;29062021163444
161;127;29062021163444
162;128;29062021163444
163;127;29062021163444
164;126;29062021163444
165;129;29062021163444
166;125;29062021163444
167;126;29062021163444
168;127;29062021163444
169;124;29062021163444
170;127;29062021163444
171;125;29062021163444
172;125;29062021163444
173;126;29062021163444
174;124;29062021163444
175;124;29062021163444
176;127;29062021163444
177;124;29062021163444
178;127;29062021163444
179;125;29062021163444
180;125;29062021163444
181;126;29062021163444
182;125;29062021163444
183;124;29062021163444
184;125;29062021163444
185;123;29062021163444
186;126;29062021163444
187;125;29062021163444
188;123;29062021163444
189;125;29062021163444
190;123;29062021163444
191;124;29062021163444
192;127;29062021163444
193;124;29062021163444
194;126;29062021163444
195;124;29062021163444
196;123;29062021163444
197;124;29062021163444
198;125;29062021163444
199;124;29062021163444
200;0;29062021163444
0;0;29062021163446
1;144;29062021163446
2;133;29062021163446
3;133;29062021163446
4;133;29062021163446
5;135;29062021163446
6;134;29062021163446
7;136;29062021163446
8;138;29062021163446
9;136;29062021163446
10;141;29062021163446
11;141;29062021163446
12;144;29062021163446
13;148;29062021163446
14;152;29062021163446
15;161;29062021163446
16;172;29062021163446
17;195;29062021163446
18;243;29062021163446
19;340;29062021163446
20;556;29062021163446
21;1011;29062021163446
22;1023;29062021163446
23;1023;29062021163446
24;1023;29062021163446
25;1023;29062021163446
26;1023;29062021163446
27;1023;29062021163446
28;1023;29062021163446
29;1023;29062021163446
30;1023;29062021163446
31;1023;29062021163446
32;1023;29062021163446
33;1023;29062021163446
34;1023;29062021163446
35;1023;29062021163446
36;906;29062021163446
37;716;29062021163446
38;577;29062021163446
39;483;29062021163446
40;417;29062021163446
41;375;29062021163446
42;353;29062021163446
43;333;29062021163446
44;322;29062021163446
45;317;29062021163446
46;314;29062021163446
47;314;29062021163446
48;312;29062021163446
49;312;29062021163446
50;312;29062021163446
51;313;29062021163446
52;311;29062021163446
53;319;29062021163446
54;319;29062021163446
55;323;29062021163446
56;331;29062021163446
57;337;29062021163446
58;345;29062021163446
59;350;29062021163446
60;356;29062021163446
61;361;29062021163446
62;366;29062021163446
63;372;29062021163446
64;378;29062021163446
65;370;29062021163446
66;373;29062021163446
67;370;29062021163446
68;367;29062021163446
69;361;29062021163446
70;354;29062021163446
71;346;29062021163446
72;344;29062021163446
73;329;29062021163446
74;325;29062021163446
75;312;29062021163446
76;304;29062021163446
77;298;29062021163446
78;285;29062021163446
79;282;29062021163446
80;273;29062021163446
81;262;29062021163446
82;261;29062021163446
83;252;29062021163446
84;248;29062021163446
85;243;29062021163446
86;241;29062021163446
87;239;29062021163446
88;235;29062021163446
89;230;29062021163446
90;230;29062021163446
91;224;29062021163446
92;217;29062021163446
93;217;29062021163446
94;212;29062021163446
95;204;29062021163446
96;202;29062021163446
97;198;29062021163446
98;194;29062021163446
99;194;29062021163446
100;187;29062021163446
101;188;29062021163446
102;184;29062021163446
103;181;29062021163446
104;179;29062021163446
105;175;29062021163446
106;176;29062021163446
107;172;29062021163446
108;167;29062021163446
109;168;29062021163446
110;162;29062021163446
111;163;29062021163446
112;163;29062021163446
113;158;29062021163446
114;157;29062021163446
115;158;29062021163446
116;157;29062021163446
117;157;29062021163446
118;153;29062021163446
119;153;29062021163446
120;149;29062021163446
121;146;29062021163446
122;148;29062021163446
123;147;29062021163446
124;146;29062021163446
125;146;29062021163446
126;142;29062021163446
127;144;29062021163446
128;144;29062021163446
129;142;29062021163446
130;141;29062021163446
131;140;29062021163446
132;136;29062021163446
133;142;29062021163446
134;136;29062021163446
135;136;29062021163446
136;137;29062021163446
137;133;29062021163446
138;136;29062021163446
139;132;29062021163446
140;132;29062021163446
141;134;29062021163446
142;131;29062021163446
143;130;29062021163446
144;133;29062021163446
145;128;29062021163446
146;133;29062021163446
147;130;29062021163446
148;129;29062021163446
149;129;29062021163446
150;129;29062021163446
151;129;29062021163446
152;128;29062021163446
153;126;29062021163446
154;129;29062021163446
155;128;29062021163446
156;127;29062021163446
157;127;29062021163446
158;125;29062021163446
159;126;29062021163446
160;127;29062021163446
161;124;29062021163446
162;126;29062021163446
163;126;29062021163446
164;125;29062021163446
165;127;29062021163446
166;124;29062021163446
167;125;29062021163446
168;126;29062021163446
169;123;29062021163446
170;126;29062021163446
171;124;29062021163446
172;124;29062021163446
173;126;29062021163446
174;123;29062021163446
175;123;29062021163446
176;125;29062021163446
177;122;29062021163446
178;125;29062021163446
179;123;29062021163446
180;123;29062021163446
181;124;29062021163446
182;125;29062021163446
183;123;29062021163446
184;123;29062021163446
185;122;29062021163446
186;124;29062021163446
187;123;29062021163446
188;122;29062021163446
189;124;29062021163446
190;122;29062021163446
191;123;29062021163446
192;126;29062021163446
193;122;29062021163446
194;123;29062021163446
195;123;29062021163446
196;123;29062021163446
197;123;29062021163446
198;123;29062021163446
199;122;29062021163446
200;0;29062021163446
0;0;29062021163446
1;144;29062021163446
2;134;29062021163446
3;131;29062021163446
4;133;29062021163446
5;135;29062021163446
6;133;29062021163446
7;136;29062021163446
8;137;29062021163446
9;136;29062021163446
10;141;29062021163446
11;141;29062021163446
12;144;29062021163446
13;149;29062021163446
14;151;29062021163446
15;159;29062021163446
16;172;29062021163446
17;192;29062021163446
18;240;29062021163446
19;340;29062021163446
20;557;29062021163446
21;1007;29062021163446
22;1023;29062021163446
23;1023;29062021163446
24;1023;29062021163446
25;1023;29062021163446
26;1023;29062021163446
27;1023;29062021163446
28;1023;29062021163446
29;1023;29062021163446
30;1023;29062021163446
31;1023;29062021163446
32;1023;29062021163446
33;1023;29062021163446
34;1023;29062021163446
35;1023;29062021163446
36;910;29062021163446
37;721;29062021163446
38;579;29062021163446
39;483;29062021163446
40;419;29062021163446
41;376;29062021163446
42;349;29062021163446
43;333;29062021163446
44;322;29062021163446
45;319;29062021163446
46;314;29062021163446
47;313;29062021163446
48;312;29062021163446
49;310;29062021163446
50;312;29062021163446
51;313;29062021163446
52;309;29062021163446
53;317;29062021163446
54;319;29062021163446
55;324;29062021163446
56;329;29062021163446
57;333;29062021163446
58;342;29062021163446
59;350;29062021163446
60;354;29062021163446
61;361;29062021163446
62;364;29062021163446
63;372;29062021163446
64;374;29062021163446
65;372;29062021163446
66;372;29062021163446
67;372;29062021163446
68;367;29062021163446
69;364;29062021163446
70;352;29062021163446
71;345;29062021163446
72;341;29062021163446
73;328;29062021163446
74;324;29062021163446
75;310;29062021163446
76;306;29062021163446
77;298;29062021163446
78;288;29062021163446
79;282;29062021163446
80;273;29062021163446
81;262;29062021163446
82;260;29062021163446
83;252;29062021163446
84;248;29062021163446
85;245;29062021163446
86;240;29062021163446
87;239;29062021163446
88;236;29062021163446
89;230;29062021163446
90;228;29062021163446
91;225;29062021163446
92;216;29062021163446
93;217;29062021163446
94;210;29062021163446
95;205;29062021163446
96;203;29062021163446
97;197;29062021163446
98;195;29062021163446
99;192;29062021163446
100;186;29062021163446
101;187;29062021163446
102;183;29062021163446
103;179;29062021163446
104;178;29062021163446
105;173;29062021163446
106;175;29062021163446
107;171;29062021163446
108;167;29062021163446
109;168;29062021163446
110;164;29062021163446
111;162;29062021163446
112;163;29062021163446
113;158;29062021163446
114;157;29062021163446
115;157;29062021163446
116;156;29062021163446
117;156;29062021163446
118;152;29062021163446
119;151;29062021163446
120;150;29062021163446
121;148;29062021163446
122;148;29062021163446
123;147;29062021163446
124;145;29062021163446
125;147;29062021163446
126;142;29062021163446
127;144;29062021163446
128;145;29062021163446
129;140;29062021163446
130;140;29062021163446
131;140;29062021163446
132;137;29062021163446
133;140;29062021163446
134;136;29062021163446
135;136;29062021163446
136;136;29062021163446
137;133;29062021163446
138;136;29062021163446
139;133;29062021163446
140;130;29062021163446
141;134;29062021163446
142;130;29062021163446
143;131;29062021163446
144;132;29062021163446
145;128;29062021163446
146;131;29062021163446
147;131;29062021163446
148;128;29062021163446
149;129;29062021163446
150;128;29062021163446
151;128;29062021163446
152;127;29062021163446
153;126;29062021163446
154;129;29062021163446
155;128;29062021163446
156;125;29062021163446
157;127;29062021163446
158;125;29062021163446
159;126;29062021163446
160;126;29062021163446
161;124;29062021163446
162;127;29062021163446
163;126;29062021163446
164;125;29062021163446
165;127;29062021163446
166;125;29062021163446
167;125;29062021163446
168;127;29062021163446
169;124;29062021163446
170;127;29062021163446
171;124;29062021163446
172;123;29062021163446
173;124;29062021163446
174;123;29062021163446
175;123;29062021163446
176;126;29062021163446
177;123;29062021163446
178;126;29062021163446
179;124;29062021163446
180;124;29062021163446
181;124;29062021163446
182;125;29062021163446
183;123;29062021163446
184;124;29062021163446
185;122;29062021163446
186;125;29062021163446
187;123;29062021163446
188;121;29062021163446
189;124;29062021163446
190;123;29062021163446
191;123;29062021163446
192;126;29062021163446
193;122;29062021163446
194;123;29062021163446
195;123;29062021163446
196;121;29062021163446
197;123;29062021163446
198;123;29062021163446
199;123;29062021163446
200;0;29062021163446
0;0;29062021163447
1;144;29062021163447
2;134;29062021163447
3;133;29062021163447
4;134;29062021163447
5;134;29062021163447
6;134;29062021163447
7;138;29062021163447
8;140;29062021163447
9;138;29062021163447
10;143;29062021163447
11;141;29062021163447
12;143;29062021163447
13;149;29062021163447
14;152;29062021163447
15;160;29062021163447
16;172;29062021163447
17;193;29062021163447
18;243;29062021163447
19;338;29062021163447
20;550;29062021163447
21;999;29062021163447
22;1023;29062021163447
23;1023;29062021163447
24;1023;29062021163447
25;1023;29062021163447
26;1023;29062021163447
27;1023;29062021163447
28;1023;29062021163447
29;1023;29062021163447
30;1023;29062021163447
31;1023;29062021163447
32;1023;29062021163447
33;1023;29062021163447
34;1023;29062021163447
35;1023;29062021163447
36;912;29062021163447
37;714;29062021163447
38;577;29062021163447
39;486;29062021163447
40;417;29062021163447
41;369;29062021163447
42;353;29062021163447
43;331;29062021163447
44;322;29062021163447
45;319;29062021163447
46;313;29062021163447
47;311;29062021163447
48;311;29062021163447
49;309;29062021163447
50;310;29062021163447
51;309;29062021163447
52;309;29062021163447
53;317;29062021163447
54;317;29062021163447
55;323;29062021163447
56;329;29062021163447
57;332;29062021163447
58;343;29062021163447
59;347;29062021163447
60;357;29062021163447
61;360;29062021163447
62;365;29062021163447
63;369;29062021163447
64;371;29062021163447
65;369;29062021163447
66;371;29062021163447
67;370;29062021163447
68;365;29062021163447
69;360;29062021163447
70;353;29062021163447
71;344;29062021163447
72;341;29062021163447
73;330;29062021163447
74;327;29062021163447
75;310;29062021163447
76;303;29062021163447
77;296;29062021163447
78;289;29062021163447
79;283;29062021163447
80;272;29062021163447
81;263;29062021163447
82;259;29062021163447
83;251;29062021163447
84;247;29062021163447
85;243;29062021163447
86;239;29062021163447
87;238;29062021163447
88;236;29062021163447
89;229;29062021163447
90;227;29062021163447
91;222;29062021163447
92;216;29062021163447
93;217;29062021163447
94;209;29062021163447
95;203;29062021163447
96;204;29062021163447
97;196;29062021163447
98;193;29062021163447
99;190;29062021163447
100;187;29062021163447
101;186;29062021163447
102;182;29062021163447
103;180;29062021163447
104;176;29062021163447
105;174;29062021163447
106;174;29062021163447
107;170;29062021163447
108;167;29062021163447
109;169;29062021163447
110;163;29062021163447
111;162;29062021163447
112;163;29062021163447
113;158;29062021163447
114;158;29062021163447
115;157;29062021163447
116;155;29062021163447
117;156;29062021163447
118;152;29062021163447
119;151;29062021163447
120;149;29062021163447
121;148;29062021163447
122;149;29062021163447
123;147;29062021163447
124;145;29062021163447
125;146;29062021163447
126;144;29062021163447
127;144;29062021163447
128;143;29062021163447
129;140;29062021163447
130;140;29062021163447
131;139;29062021163447
132;137;29062021163447
133;140;29062021163447
134;136;29062021163447
135;135;29062021163447
136;137;29062021163447
137;133;29062021163447
138;135;29062021163447
139;133;29062021163447
140;131;29062021163447
141;133;29062021163447
142;132;29062021163447
143;130;29062021163447
144;132;29062021163447
145;129;29062021163447
146;132;29062021163447
147;130;29062021163447
148;129;29062021163447
149;129;29062021163447
150;128;29062021163447
151;129;29062021163447
152;129;29062021163447
153;127;29062021163447
154;128;29062021163447
155;127;29062021163447
156;126;29062021163447
157;127;29062021163447
158;125;29062021163447
159;127;29062021163447
160;127;29062021163447
161;125;29062021163447
162;127;29062021163447
163;126;29062021163447
164;126;29062021163447
165;127;29062021163447
166;126;29062021163447
167;127;29062021163447
168;127;29062021163447
169;122;29062021163447
170;126;29062021163447
171;125;29062021163447
172;124;29062021163447
173;125;29062021163447
174;124;29062021163447
175;123;29062021163447
176;125;29062021163447
177;123;29062021163447
178;126;29062021163447
179;125;29062021163447
180;122;29062021163447
181;124;29062021163447
182;124;29062021163447
183;122;29062021163447
184;124;29062021163447
185;122;29062021163447
186;126;29062021163447
187;123;29062021163447
188;121;29062021163447
189;124;29062021163447
190;122;29062021163447
191;122;29062021163447
192;125;29062021163447
193;122;29062021163447
194;123;29062021163447
195;123;29062021163447
196;122;29062021163447
197;124;29062021163447
198;123;29062021163447
199;122;29062021163447
200;0;29062021163447
0;0;29062021163448
1;144;29062021163448
2;134;29062021163448
3;133;29062021163448
4;133;29062021163448
5;135;29062021163448
6;134;29062021163448
7;137;29062021163448
8;139;29062021163448
9;136;29062021163448
10;141;29062021163448
11;141;29062021163448
12;143;29062021163448
13;148;29062021163448
14;152;29062021163448
15;161;29062021163448
16;174;29062021163448
17;192;29062021163448
18;241;29062021163448
19;342;29062021163448
20;553;29062021163448
21;1002;29062021163448
22;1023;29062021163448
23;1023;29062021163448
24;1023;29062021163448
25;1023;29062021163448
26;1023;29062021163448
27;1023;29062021163448
28;1023;29062021163448
29;1023;29062021163448
30;1023;29062021163448
31;1023;29062021163448
32;1023;29062021163448
33;1023;29062021163448
34;1023;29062021163448
35;1023;29062021163448
36;919;29062021163448
37;724;29062021163448
38;582;29062021163448
39;487;29062021163448
40;416;29062021163448
41;370;29062021163448
42;353;29062021163448
43;334;29062021163448
44;322;29062021163448
45;321;29062021163448
46;315;29062021163448
47;310;29062021163448
48;315;29062021163448
49;311;29062021163448
50;313;29062021163448
51;312;29062021163448
52;309;29062021163448
53;317;29062021163448
54;318;29062021163448
55;322;29062021163448
56;326;29062021163448
57;335;29062021163448
58;344;29062021163448
59;351;29062021163448
60;356;29062021163448
61;363;29062021163448
62;361;29062021163448
63;369;29062021163448
64;374;29062021163448
65;370;29062021163448
66;375;29062021163448
67;371;29062021163448
68;366;29062021163448
69;360;29062021163448
70;353;29062021163448
71;348;29062021163448
72;343;29062021163448
73;332;29062021163448
74;327;29062021163448
75;311;29062021163448
76;304;29062021163448
77;301;29062021163448
78;289;29062021163448
79;281;29062021163448
80;273;29062021163448
81;263;29062021163448
82;259;29062021163448
83;252;29062021163448
84;247;29062021163448
85;245;29062021163448
86;241;29062021163448
87;240;29062021163448
88;236;29062021163448
89;228;29062021163448
90;226;29062021163448
91;223;29062021163448
92;218;29062021163448
93;217;29062021163448
94;210;29062021163448
95;205;29062021163448
96;202;29062021163448
97;198;29062021163448
98;194;29062021163448
99;192;29062021163448
100;186;29062021163448
101;188;29062021163448
102;182;29062021163448
103;182;29062021163448
104;179;29062021163448
105;174;29062021163448
106;174;29062021163448
107;170;29062021163448
108;169;29062021163448
109;167;29062021163448
110;163;29062021163448
111;163;29062021163448
112;163;29062021163448
113;157;29062021163448
114;157;29062021163448
115;157;29062021163448
116;156;29062021163448
117;157;29062021163448
118;153;29062021163448
119;153;29062021163448
120;148;29062021163448
121;147;29062021163448
122;148;29062021163448
123;147;29062021163448
124;145;29062021163448
125;146;29062021163448
126;142;29062021163448
127;143;29062021163448
128;144;29062021163448
129;139;29062021163448
130;140;29062021163448
131;141;29062021163448
132;137;29062021163448
133;142;29062021163448
134;136;29062021163448
135;136;29062021163448
136;137;29062021163448
137;133;29062021163448
138;136;29062021163448
139;133;29062021163448
140;131;29062021163448
141;134;29062021163448
142;131;29062021163448
143;130;29062021163448
144;132;29062021163448
145;129;29062021163448
146;131;29062021163448
147;130;29062021163448
148;128;29062021163448
149;129;29062021163448
150;128;29062021163448
151;129;29062021163448
152;129;29062021163448
153;126;29062021163448
154;129;29062021163448
155;128;29062021163448
156;127;29062021163448
157;127;29062021163448
158;125;29062021163448
159;126;29062021163448
160;127;29062021163448
161;125;29062021163448
162;126;29062021163448
163;127;29062021163448
164;125;29062021163448
165;127;29062021163448
166;125;29062021163448
167;126;29062021163448
168;127;29062021163448
169;123;29062021163448
170;126;29062021163448
171;123;29062021163448
172;123;29062021163448
173;124;29062021163448
174;124;29062021163448
175;123;29062021163448
176;125;29062021163448
177;123;29062021163448
178;126;29062021163448
179;123;29062021163448
180;123;29062021163448
181;124;29062021163448
182;123;29062021163448
183;122;29062021163448
184;124;29062021163448
185;121;29062021163448
186;125;29062021163448
187;124;29062021163448
188;122;29062021163448
189;124;29062021163448
190;122;29062021163448
191;122;29062021163448
192;126;29062021163448
193;122;29062021163448
194;123;29062021163448
195;123;29062021163448
196;122;29062021163448
197;124;29062021163448
198;123;29062021163448
199;122;29062021163448
200;0;29062021163448
0;0;29062021163448
1;144;29062021163448
2;134;29062021163448
3;132;29062021163448
4;134;29062021163448
5;134;29062021163448
6;132;29062021163448
7;136;29062021163448
8;139;29062021163448
9;138;29062021163448
10;141;29062021163448
11;141;29062021163448
12;143;29062021163448
13;149;29062021163448
14;151;29062021163448
15;161;29062021163448
16;171;29062021163448
17;192;29062021163448
18;244;29062021163448
19;341;29062021163448
20;554;29062021163448
21;1001;29062021163448
22;1023;29062021163448
23;1023;29062021163448
24;1023;29062021163448
25;1023;29062021163448
26;1023;29062021163448
27;1023;29062021163448
28;1023;29062021163448
29;1023;29062021163448
30;1023;29062021163448
31;1023;29062021163448
32;1023;29062021163448
33;1023;29062021163448
34;1023;29062021163448
35;1023;29062021163448
36;921;29062021163448
37;728;29062021163448
38;582;29062021163448
39;487;29062021163448
40;420;29062021163448
41;374;29062021163448
42;354;29062021163448
43;333;29062021163448
44;325;29062021163448
45;319;29062021163448
46;312;29062021163448
47;313;29062021163448
48;314;29062021163448
49;309;29062021163448
50;311;29062021163448
51;311;29062021163448
52;311;29062021163448
53;315;29062021163448
54;319;29062021163448
55;321;29062021163448
56;329;29062021163448
57;334;29062021163448
58;345;29062021163448
59;346;29062021163448
60;352;29062021163448
61;361;29062021163448
62;364;29062021163448
63;374;29062021163448
64;372;29062021163448
65;369;29062021163448
66;373;29062021163448
67;371;29062021163448
68;368;29062021163448
69;360;29062021163448
70;354;29062021163448
71;346;29062021163448
72;344;29062021163448
73;329;29062021163448
74;322;29062021163448
75;311;29062021163448
76;305;29062021163448
77;295;29062021163448
78;289;29062021163448
79;280;29062021163448
80;275;29062021163448
81;262;29062021163448
82;260;29062021163448
83;256;29062021163448
84;250;29062021163448
85;243;29062021163448
86;241;29062021163448
87;239;29062021163448
88;235;29062021163448
89;228;29062021163448
90;230;29062021163448
91;225;29062021163448
92;217;29062021163448
93;216;29062021163448
94;209;29062021163448
95;203;29062021163448
96;202;29062021163448
97;197;29062021163448
98;195;29062021163448
99;192;29062021163448
100;188;29062021163448
101;187;29062021163448
102;183;29062021163448
103;181;29062021163448
104;178;29062021163448
105;175;29062021163448
106;176;29062021163448
107;172;29062021163448
108;169;29062021163448
109;167;29062021163448
110;164;29062021163448
111;163;29062021163448
112;164;29062021163448
113;159;29062021163448
114;157;29062021163448
115;157;29062021163448
116;154;29062021163448
117;158;29062021163448
118;152;29062021163448
119;153;29062021163448
120;150;29062021163448
121;147;29062021163448
122;149;29062021163448
123;147;29062021163448
124;146;29062021163448
125;146;29062021163448
126;142;29062021163448
127;144;29062021163448
128;144;29062021163448
129;139;29062021163448
130;140;29062021163448
131;140;29062021163448
132;139;29062021163448
133;142;29062021163448
134;136;29062021163448
135;136;29062021163448
136;135;29062021163448
137;133;29062021163448
138;134;29062021163448
139;132;29062021163448
140;131;29062021163448
141;133;29062021163448
142;131;29062021163448
143;131;29062021163448
144;132;29062021163448
145;129;29062021163448
146;132;29062021163448
147;130;29062021163448
148;128;29062021163448
149;130;29062021163448
150;128;29062021163448
151;129;29062021163448
152;129;29062021163448
153;126;29062021163448
154;128;29062021163448
155;127;29062021163448
156;127;29062021163448
157;126;29062021163448
158;126;29062021163448
159;126;29062021163448
160;127;29062021163448
161;125;29062021163448
162;126;29062021163448
163;126;29062021163448
164;125;29062021163448
165;127;29062021163448
166;125;29062021163448
167;125;29062021163448
168;126;29062021163448
169;122;29062021163448
170;125;29062021163448
171;124;29062021163448
172;124;29062021163448
173;125;29062021163448
174;124;29062021163448
175;123;29062021163448
176;125;29062021163448
177;122;29062021163448
178;126;29062021163448
179;123;29062021163448
180;123;29062021163448
181;124;29062021163448
182;125;29062021163448
183;124;29062021163448
184;124;29062021163448
185;122;29062021163448
186;124;29062021163448
187;123;29062021163448
188;121;29062021163448
189;124;29062021163448
190;122;29062021163448
191;122;29062021163448
192;126;29062021163448
193;123;29062021163448
194;124;29062021163448
195;124;29062021163448
196;122;29062021163448
197;123;29062021163448
198;122;29062021163448
199;121;29062021163448
200;0;29062021163448
0;0;29062021163449
1;144;29062021163449
2;135;29062021163449
3;132;29062021163449
4;133;29062021163449
5;135;29062021163449
6;134;29062021163449
7;136;29062021163449
8;139;29062021163449
9;137;29062021163449
10;142;29062021163449
11;140;29062021163449
12;143;29062021163449
13;148;29062021163449
14;152;29062021163449
15;161;29062021163449
16;172;29062021163449
17;192;29062021163449
18;240;29062021163449
19;340;29062021163449
20;550;29062021163449
21;993;29062021163449
22;1023;29062021163449
23;1023;29062021163449
24;1023;29062021163449
25;1023;29062021163449
26;1023;29062021163449
27;1023;29062021163449
28;1023;29062021163449
29;1023;29062021163449
30;1023;29062021163449
31;1023;29062021163449
32;1023;29062021163449
33;1023;29062021163449
34;1023;29062021163449
35;1023;29062021163449
36;922;29062021163449
37;723;29062021163449
38;584;29062021163449
39;487;29062021163449
40;414;29062021163449
41;370;29062021163449
42;351;29062021163449
43;327;29062021163449
44;324;29062021163449
45;316;29062021163449
46;310;29062021163449
47;310;29062021163449
48;312;29062021163449
49;310;29062021163449
50;308;29062021163449
51;308;29062021163449
52;309;29062021163449
53;316;29062021163449
54;316;29062021163449
55;316;29062021163449
56;327;29062021163449
57;332;29062021163449
58;341;29062021163449
59;344;29062021163449
60;352;29062021163449
61;360;29062021163449
62;362;29062021163449
63;368;29062021163449
64;370;29062021163449
65;368;29062021163449
66;368;29062021163449
67;372;29062021163449
68;363;29062021163449
69;360;29062021163449
70;349;29062021163449
71;344;29062021163449
72;341;29062021163449
73;327;29062021163449
74;323;29062021163449
75;310;29062021163449
76;305;29062021163449
77;296;29062021163449
78;286;29062021163449
79;281;29062021163449
80;273;29062021163449
81;260;29062021163449
82;257;29062021163449
83;253;29062021163449
84;250;29062021163449
85;243;29062021163449
86;238;29062021163449
87;238;29062021163449
88;237;29062021163449
89;230;29062021163449
90;227;29062021163449
91;221;29062021163449
92;216;29062021163449
93;213;29062021163449
94;209;29062021163449
95;204;29062021163449
96;203;29062021163449
97;200;29062021163449
98;194;29062021163449
99;193;29062021163449
100;187;29062021163449
101;188;29062021163449
102;182;29062021163449
103;180;29062021163449
104;179;29062021163449
105;175;29062021163449
106;174;29062021163449
107;171;29062021163449
108;168;29062021163449
109;168;29062021163449
110;163;29062021163449
111;161;29062021163449
112;162;29062021163449
113;158;29062021163449
114;158;29062021163449
115;159;29062021163449
116;156;29062021163449
117;158;29062021163449
118;153;29062021163449
119;152;29062021163449
120;150;29062021163449
121;148;29062021163449
122;149;29062021163449
123;148;29062021163449
124;146;29062021163449
125;145;29062021163449
126;143;29062021163449
127;144;29062021163449
128;144;29062021163449
129;141;29062021163449
130;141;29062021163449
131;140;29062021163449
132;137;29062021163449
133;142;29062021163449
134;136;29062021163449
135;134;29062021163449
136;136;29062021163449
137;134;29062021163449
138;135;29062021163449
139;135;29062021163449
140;132;29062021163449
141;134;29062021163449
142;131;29062021163449
143;131;29062021163449
144;133;29062021163449
145;129;29062021163449
146;132;29062021163449
147;131;29062021163449
148;129;29062021163449
149;128;29062021163449
150;129;29062021163449
151;130;29062021163449
152;128;29062021163449
153;125;29062021163449
154;129;29062021163449
155;127;29062021163449
156;126;29062021163449
157;127;29062021163449
158;125;29062021163449
159;127;29062021163449
160;127;29062021163449
161;125;29062021163449
162;127;29062021163449
163;127;29062021163449
164;126;29062021163449
165;128;29062021163449
166;126;29062021163449
167;125;29062021163449
168;127;29062021163449
169;122;29062021163449
170;126;29062021163449
171;124;29062021163449
172;124;29062021163449
173;126;29062021163449
174;123;29062021163449
175;124;29062021163449
176;125;29062021163449
177;123;29062021163449
178;126;29062021163449
179;124;29062021163449
180;123;29062021163449
181;125;29062021163449
182;124;29062021163449
183;123;29062021163449
184;125;29062021163449
185;122;29062021163449
186;126;29062021163449
187;124;29062021163449
188;122;29062021163449
189;125;29062021163449
190;122;29062021163449
191;123;29062021163449
192;126;29062021163449
193;122;29062021163449
194;123;29062021163449
195;123;29062021163449
196;123;29062021163449
197;124;29062021163449
198;123;29062021163449
199;123;29062021163449
200;0;29062021163449
0;0;29062021163450
1;144;29062021163450
2;134;29062021163450
3;133;29062021163450
4;133;29062021163450
5;135;29062021163450
6;134;29062021163450
7;137;29062021163450
8;139;29062021163450
9;135;29062021163450
10;141;29062021163450
11;141;29062021163450
12;143;29062021163450
13;148;29062021163450
14;151;29062021163450
15;161;29062021163450
16;173;29062021163450
17;194;29062021163450
18;239;29062021163450
19;340;29062021163450
20;550;29062021163450
21;996;29062021163450
22;1023;29062021163450
23;1023;29062021163450
24;1023;29062021163450
25;1023;29062021163450
26;1023;29062021163450
27;1023;29062021163450
28;1023;29062021163450
29;1023;29062021163450
30;1023;29062021163450
31;1023;29062021163450
32;1023;29062021163450
33;1023;29062021163450
34;1023;29062021163450
35;1023;29062021163450
36;924;29062021163450
37;725;29062021163450
38;587;29062021163450
39;489;29062021163450
40;424;29062021163450
41;374;29062021163450
42;351;29062021163450
43;332;29062021163450
44;324;29062021163450
45;319;29062021163450
46;315;29062021163450
47;312;29062021163450
48;314;29062021163450
49;309;29062021163450
50;312;29062021163450
51;312;29062021163450
52;313;29062021163450
53;315;29062021163450
54;319;29062021163450
55;324;29062021163450
56;327;29062021163450
57;331;29062021163450
58;341;29062021163450
59;347;29062021163450
60;355;29062021163450
61;361;29062021163450
62;363;29062021163450
63;373;29062021163450
64;375;29062021163450
65;374;29062021163450
66;372;29062021163450
67;368;29062021163450
68;366;29062021163450
69;361;29062021163450
70;350;29062021163450
71;346;29062021163450
72;343;29062021163450
73;331;29062021163450
74;325;29062021163450
75;312;29062021163450
76;305;29062021163450
77;298;29062021163450
78;290;29062021163450
79;281;29062021163450
80;276;29062021163450
81;263;29062021163450
82;261;29062021163450
83;253;29062021163450
84;248;29062021163450
85;244;29062021163450
86;240;29062021163450
87;236;29062021163450
88;235;29062021163450
89;228;29062021163450
90;228;29062021163450
91;224;29062021163450
92;217;29062021163450
93;216;29062021163450
94;210;29062021163450
95;205;29062021163450
96;204;29062021163450
97;199;29062021163450
98;194;29062021163450
99;192;29062021163450
100;187;29062021163450
101;189;29062021163450
102;183;29062021163450
103;181;29062021163450
104;177;29062021163450
105;174;29062021163450
106;175;29062021163450
107;171;29062021163450
108;169;29062021163450
109;169;29062021163450
110;163;29062021163450
111;162;29062021163450
112;163;29062021163450
113;157;29062021163450
114;158;29062021163450
115;158;29062021163450
116;154;29062021163450
117;157;29062021163450
118;152;29062021163450
119;153;29062021163450
120;151;29062021163450
121;147;29062021163450
122;147;29062021163450
123;147;29062021163450
124;144;29062021163450
125;146;29062021163450
126;142;29062021163450
127;144;29062021163450
128;145;29062021163450
129;141;29062021163450
130;141;29062021163450
131;139;29062021163450
132;137;29062021163450
133;141;29062021163450
134;137;29062021163450
135;136;29062021163450
136;138;29062021163450
137;133;29062021163450
138;135;29062021163450
139;133;29062021163450
140;132;29062021163450
141;134;29062021163450
142;131;29062021163450
143;130;29062021163450
144;132;29062021163450
145;128;29062021163450
146;131;29062021163450
147;131;29062021163450
148;128;29062021163450
149;129;29062021163450
150;128;29062021163450
151;129;29062021163450
152;128;29062021163450
153;127;29062021163450
154;129;29062021163450
155;127;29062021163450
156;126;29062021163450
157;127;29062021163450
158;125;29062021163450
159;125;29062021163450
160;127;29062021163450
161;125;29062021163450
162;128;29062021163450
163;125;29062021163450
164;124;29062021163450
165;127;29062021163450
166;125;29062021163450
167;125;29062021163450
168;127;29062021163450
169;122;29062021163450
170;125;29062021163450
171;124;29062021163450
172;123;29062021163450
173;125;29062021163450
174;125;29062021163450
175;123;29062021163450
176;123;29062021163450
177;122;29062021163450
178;126;29062021163450
179;124;29062021163450
180;123;29062021163450
181;124;29062021163450
182;124;29062021163450
183;122;29062021163450
184;124;29062021163450
185;122;29062021163450
186;125;29062021163450
187;123;29062021163450
188;121;29062021163450
189;123;29062021163450
190;122;29062021163450
191;122;29062021163450
192;126;29062021163450
193;122;29062021163450
194;124;29062021163450
195;122;29062021163450
196;122;29062021163450
197;123;29062021163450
198;123;29062021163450
199;122;29062021163450
200;0;29062021163450
0;0;29062021163450
1;144;29062021163450
2;135;29062021163450
3;132;29062021163450
4;133;29062021163450
5;135;29062021163450
6;135;29062021163450
7;137;29062021163450
8;138;29062021163450
9;137;29062021163450
10;141;29062021163450
11;140;29062021163450
12;142;29062021163450
13;147;29062021163450
14;152;29062021163450
15;160;29062021163450
16;172;29062021163450
17;192;29062021163450
18;241;29062021163450
19;338;29062021163450
20;544;29062021163450
21;995;29062021163450
22;1023;29062021163450
23;1023;29062021163450
24;1023;29062021163450
25;1023;29062021163450
26;1023;29062021163450
27;1023;29062021163450
28;1023;29062021163450
29;1023;29062021163450
30;1023;29062021163450
31;1023;29062021163450
32;1023;29062021163450
33;1023;29062021163450
34;1023;29062021163450
35;1023;29062021163450
36;921;29062021163450
37;723;29062021163450
38;584;29062021163450
39;484;29062021163450
40;420;29062021163450
41;374;29062021163450
42;351;29062021163450
43;332;29062021163450
44;322;29062021163450
45;317;29062021163450
46;314;29062021163450
47;311;29062021163450
48;313;29062021163450
49;307;29062021163450
50;307;29062021163450
51;309;29062021163450
52;311;29062021163450
53;315;29062021163450
54;317;29062021163450
55;323;29062021163450
56;328;29062021163450
57;334;29062021163450
58;340;29062021163450
59;346;29062021163450
60;355;29062021163450
61;360;29062021163450
62;364;29062021163450
63;372;29062021163450
64;372;29062021163450
65;371;29062021163450
66;371;29062021163450
67;370;29062021163450
68;365;29062021163450
69;359;29062021163450
70;352;29062021163450
71;344;29062021163450
72;343;29062021163450
73;332;29062021163450
74;325;29062021163450
75;310;29062021163450
76;305;29062021163450
77;298;29062021163450
78;289;29062021163450
79;281;29062021163450
80;271;29062021163450
81;259;29062021163450
82;260;29062021163450
83;249;29062021163450
84;248;29062021163450
85;245;29062021163450
86;240;29062021163450
87;238;29062021163450
88;236;29062021163450
89;230;29062021163450
90;228;29062021163450
91;224;29062021163450
92;217;29062021163450
93;215;29062021163450
94;211;29062021163450
95;206;29062021163450
96;204;29062021163450
97;198;29062021163450
98;195;29062021163450
99;191;29062021163450
100;187;29062021163450
101;186;29062021163450
102;183;29062021163450
103;180;29062021163450
104;177;29062021163450
105;175;29062021163450
106;177;29062021163450
107;172;29062021163450
108;169;29062021163450
109;169;29062021163450
110;165;29062021163450
111;162;29062021163450
112;163;29062021163450
113;159;29062021163450
114;158;29062021163450
115;159;29062021163450
116;157;29062021163450
117;157;29062021163450
118;153;29062021163450
119;153;29062021163450
120;150;29062021163450
121;148;29062021163450
122;148;29062021163450
123;146;29062021163450
124;145;29062021163450
125;147;29062021163450
126;142;29062021163450
127;143;29062021163450
128;143;29062021163450
129;140;29062021163450
130;141;29062021163450
131;140;29062021163450
132;136;29062021163450
133;141;29062021163450
134;136;29062021163450
135;136;29062021163450
136;137;29062021163450
137;134;29062021163450
138;135;29062021163450
139;133;29062021163450
140;131;29062021163450
141;133;29062021163450
142;131;29062021163450
143;130;29062021163450
144;132;29062021163450
145;129;29062021163450
146;131;29062021163450
147;131;29062021163450
148;128;29062021163450
149;130;29062021163450
150;129;29062021163450
151;128;29062021163450
152;128;29062021163450
153;127;29062021163450
154;128;29062021163450
155;128;29062021163450
156;126;29062021163450
157;125;29062021163450
158;126;29062021163450
159;127;29062021163450
160;127;29062021163450
161;125;29062021163450
162;127;29062021163450
163;126;29062021163450
164;125;29062021163450
165;127;29062021163450
166;125;29062021163450
167;126;29062021163450
168;126;29062021163450
169;123;29062021163450
170;126;29062021163450
171;125;29062021163450
172;124;29062021163450
173;126;29062021163450
174;123;29062021163450
175;123;29062021163450
176;125;29062021163450
177;123;29062021163450
178;125;29062021163450
179;125;29062021163450
180;124;29062021163450
181;126;29062021163450
182;124;29062021163450
183;123;29062021163450
184;124;29062021163450
185;121;29062021163450
186;125;29062021163450
187;124;29062021163450
188;122;29062021163450
189;124;29062021163450
190;123;29062021163450
191;123;29062021163450
192;126;29062021163450
193;122;29062021163450
194;123;29062021163450
195;123;29062021163450
196;122;29062021163450
197;123;29062021163450
198;123;29062021163450
199;121;29062021163450
200;0;29062021163450
0;0;29062021163451
1;144;29062021163451
2;133;29062021163451
3;133;29062021163451
4;134;29062021163451
5;135;29062021163451
6;134;29062021163451
7;136;29062021163451
8;138;29062021163451
9;138;29062021163451
10;142;29062021163451
11;141;29062021163451
12;143;29062021163451
13;150;29062021163451
14;151;29062021163451
15;161;29062021163451
16;173;29062021163451
17;193;29062021163451
18;244;29062021163451
19;342;29062021163451
20;548;29062021163451
21;994;29062021163451
22;1023;29062021163451
23;1023;29062021163451
24;1023;29062021163451
25;1023;29062021163451
26;1023;29062021163451
27;1023;29062021163451
28;1023;29062021163451
29;1023;29062021163451
30;1023;29062021163451
31;1023;29062021163451
32;1023;29062021163451
33;1023;29062021163451
34;1023;29062021163451
35;1023;29062021163451
36;920;29062021163451
37;728;29062021163451
38;586;29062021163451
39;489;29062021163451
40;421;29062021163451
41;373;29062021163451
42;351;29062021163451
43;330;29062021163451
44;322;29062021163451
45;317;29062021163451
46;315;29062021163451
47;313;29062021163451
48;312;29062021163451
49;309;29062021163451
50;313;29062021163451
51;308;29062021163451
52;308;29062021163451
53;317;29062021163451
54;316;29062021163451
55;323;29062021163451
56;329;29062021163451
57;336;29062021163451
58;345;29062021163451
59;349;29062021163451
60;355;29062021163451
61;364;29062021163451
62;365;29062021163451
63;371;29062021163451
64;375;29062021163451
65;372;29062021163451
66;374;29062021163451
67;369;29062021163451
68;368;29062021163451
69;362;29062021163451
70;353;29062021163451
71;348;29062021163451
72;343;29062021163451
73;331;29062021163451
74;322;29062021163451
75;312;29062021163451
76;304;29062021163451
77;297;29062021163451
78;289;29062021163451
79;279;29062021163451
80;274;29062021163451
81;259;29062021163451
82;261;29062021163451
83;253;29062021163451
84;249;29062021163451
85;243;29062021163451
86;241;29062021163451
87;240;29062021163451
88;237;29062021163451
89;228;29062021163451
90;227;29062021163451
91;225;29062021163451
92;216;29062021163451
93;216;29062021163451
94;211;29062021163451
95;206;29062021163451
96;203;29062021163451
97;196;29062021163451
98;196;29062021163451
99;190;29062021163451
100;186;29062021163451
101;188;29062021163451
102;185;29062021163451
103;181;29062021163451
104;179;29062021163451
105;174;29062021163451
106;175;29062021163451
107;169;29062021163451
108;167;29062021163451
109;168;29062021163451
110;163;29062021163451
111;162;29062021163451
112;162;29062021163451
113;157;29062021163451
114;158;29062021163451
115;159;29062021163451
116;155;29062021163451
117;157;29062021163451
118;152;29062021163451
119;153;29062021163451
120;151;29062021163451
121;148;29062021163451
122;148;29062021163451
123;147;29062021163451
124;147;29062021163451
125;146;29062021163451
126;143;29062021163451
127;143;29062021163451
128;145;29062021163451
129;139;29062021163451
130;139;29062021163451
131;139;29062021163451
132;137;29062021163451
133;140;29062021163451
134;135;29062021163451
135;136;29062021163451
136;136;29062021163451
137;133;29062021163451
138;134;29062021163451
139;133;29062021163451
140;132;29062021163451
141;135;29062021163451
142;131;29062021163451
143;131;29062021163451
144;133;29062021163451
145;129;29062021163451
146;132;29062021163451
147;131;29062021163451
148;128;29062021163451
149;129;29062021163451
150;128;29062021163451
151;129;29062021163451
152;128;29062021163451
153;126;29062021163451
154;128;29062021163451
155;127;29062021163451
156;126;29062021163451
157;125;29062021163451
158;125;29062021163451
159;125;29062021163451
160;127;29062021163451
161;125;29062021163451
162;127;29062021163451
163;126;29062021163451
164;124;29062021163451
165;127;29062021163451
166;125;29062021163451
167;125;29062021163451
168;126;29062021163451
169;122;29062021163451
170;125;29062021163451
171;125;29062021163451
172;123;29062021163451
173;126;29062021163451
174;122;29062021163451
175;123;29062021163451
176;125;29062021163451
177;122;29062021163451
178;126;29062021163451
179;123;29062021163451
180;124;29062021163451
181;124;29062021163451
182;124;29062021163451
183;124;29062021163451
184;124;29062021163451
185;121;29062021163451
186;125;29062021163451
187;124;29062021163451
188;121;29062021163451
189;123;29062021163451
190;122;29062021163451
191;123;29062021163451
192;125;29062021163451
193;122;29062021163451
194;124;29062021163451
195;123;29062021163451
196;122;29062021163451
197;123;29062021163451
198;123;29062021163451
199;122;29062021163451
200;0;29062021163451
