ind;val;datetime
0;0;02082021173116
1;161;02082021173116
2;1023;02082021173116
3;1023;02082021173116
4;1023;02082021173116
5;1023;02082021173116
6;1023;02082021173116
7;1023;02082021173116
8;1023;02082021173116
9;1023;02082021173116
10;1023;02082021173116
11;1023;02082021173116
12;1023;02082021173116
13;1023;02082021173116
14;1023;02082021173116
15;1023;02082021173116
16;1023;02082021173116
17;1023;02082021173116
18;1023;02082021173116
19;1023;02082021173116
20;196;02082021173116
21;158;02082021173116
22;158;02082021173116
23;157;02082021173116
24;157;02082021173116
25;158;02082021173116
26;157;02082021173116
27;157;02082021173116
28;157;02082021173116
29;157;02082021173116
30;157;02082021173116
31;157;02082021173116
32;157;02082021173116
33;157;02082021173116
34;157;02082021173116
35;157;02082021173116
36;157;02082021173116
37;157;02082021173116
38;157;02082021173116
39;157;02082021173116
40;163;02082021173116
41;556;02082021173116
42;1023;02082021173116
43;1023;02082021173116
44;1023;02082021173116
45;1023;02082021173116
46;1023;02082021173116
47;1023;02082021173116
48;1023;02082021173116
49;1023;02082021173116
50;1023;02082021173116
51;1023;02082021173116
52;1023;02082021173116
53;1023;02082021173116
54;1023;02082021173116
55;1023;02082021173116
56;1023;02082021173116
57;1023;02082021173116
58;1023;02082021173116
59;1023;02082021173116
60;1023;02082021173116
61;1023;02082021173116
62;1023;02082021173116
63;1023;02082021173116
64;1023;02082021173116
65;1023;02082021173116
66;1023;02082021173116
67;1023;02082021173116
68;1023;02082021173116
69;1023;02082021173116
70;1023;02082021173116
71;1023;02082021173116
72;1023;02082021173116
73;1023;02082021173116
74;1023;02082021173116
75;1023;02082021173116
76;1023;02082021173116
77;1023;02082021173116
78;1023;02082021173116
79;1023;02082021173116
80;1023;02082021173116
81;1023;02082021173116
82;1023;02082021173116
83;1023;02082021173116
84;1023;02082021173116
85;1023;02082021173116
86;990;02082021173116
87;922;02082021173116
88;858;02082021173116
89;787;02082021173116
90;716;02082021173116
91;637;02082021173116
92;586;02082021173116
93;566;02082021173116
94;554;02082021173116
95;541;02082021173116
96;531;02082021173116
97;513;02082021173116
98;498;02082021173116
99;496;02082021173116
100;487;02082021173116
101;477;02082021173116
102;460;02082021173116
103;447;02082021173116
104;440;02082021173116
105;428;02082021173116
106;425;02082021173116
107;409;02082021173116
108;406;02082021173116
109;399;02082021173116
110;388;02082021173116
111;386;02082021173116
112;379;02082021173116
113;372;02082021173116
114;372;02082021173116
115;369;02082021173116
116;367;02082021173116
117;370;02082021173116
118;369;02082021173116
119;385;02082021173116
120;399;02082021173116
121;423;02082021173116
122;445;02082021173116
123;448;02082021173116
124;432;02082021173116
125;402;02082021173116
126;367;02082021173116
127;334;02082021173116
128;311;02082021173116
129;289;02082021173116
130;275;02082021173116
131;270;02082021173116
132;260;02082021173116
133;257;02082021173116
134;248;02082021173116
135;243;02082021173116
136;243;02082021173116
137;235;02082021173116
138;233;02082021173116
139;227;02082021173116
140;223;02082021173116
141;221;02082021173116
142;214;02082021173116
143;213;02082021173116
144;213;02082021173116
145;209;02082021173116
146;207;02082021173116
147;204;02082021173116
148;200;02082021173116
149;198;02082021173116
150;196;02082021173116
151;196;02082021173116
152;196;02082021173116
153;195;02082021173116
154;197;02082021173116
155;192;02082021173116
156;191;02082021173116
157;188;02082021173116
158;187;02082021173116
159;185;02082021173116
160;190;02082021173116
161;191;02082021173116
162;203;02082021173116
163;232;02082021173116
164;295;02082021173116
165;324;02082021173116
166;326;02082021173116
167;313;02082021173116
168;274;02082021173116
169;214;02082021173116
170;184;02082021173116
171;181;02082021173116
172;179;02082021173116
173;182;02082021173116
174;179;02082021173116
175;179;02082021173116
176;180;02082021173116
177;176;02082021173116
178;178;02082021173116
179;177;02082021173116
180;170;02082021173116
181;170;02082021173116
182;167;02082021173116
183;165;02082021173116
184;165;02082021173116
185;162;02082021173116
186;167;02082021173116
187;166;02082021173116
188;165;02082021173116
189;170;02082021173116
190;175;02082021173116
191;180;02082021173116
192;189;02082021173116
193;192;02082021173116
194;198;02082021173116
195;205;02082021173116
196;210;02082021173116
197;214;02082021173116
198;213;02082021173116
199;210;02082021173116
200;0;02082021173116
0;0;02082021173117
1;160;02082021173117
2;1023;02082021173117
3;1023;02082021173117
4;1023;02082021173117
5;1023;02082021173117
6;1023;02082021173117
7;1023;02082021173117
8;1023;02082021173117
9;1023;02082021173117
10;1023;02082021173117
11;1023;02082021173117
12;1023;02082021173117
13;1023;02082021173117
14;1023;02082021173117
15;1023;02082021173117
16;1023;02082021173117
17;1023;02082021173117
18;1023;02082021173117
19;1023;02082021173117
20;176;02082021173117
21;156;02082021173117
22;156;02082021173117
23;156;02082021173117
24;156;02082021173117
25;156;02082021173117
26;156;02082021173117
27;155;02082021173117
28;156;02082021173117
29;155;02082021173117
30;155;02082021173117
31;155;02082021173117
32;155;02082021173117
33;155;02082021173117
34;155;02082021173117
35;155;02082021173117
36;155;02082021173117
37;155;02082021173117
38;156;02082021173117
39;156;02082021173117
40;156;02082021173117
41;428;02082021173117
42;1023;02082021173117
43;1023;02082021173117
44;1023;02082021173117
45;1023;02082021173117
46;1023;02082021173117
47;1023;02082021173117
48;1023;02082021173117
49;1023;02082021173117
50;1023;02082021173117
51;1023;02082021173117
52;1023;02082021173117
53;1023;02082021173117
54;1023;02082021173117
55;1023;02082021173117
56;1023;02082021173117
57;1023;02082021173117
58;1023;02082021173117
59;1023;02082021173117
60;1023;02082021173117
61;1023;02082021173117
62;1023;02082021173117
63;1023;02082021173117
64;1023;02082021173117
65;1023;02082021173117
66;1023;02082021173117
67;1023;02082021173117
68;1023;02082021173117
69;1023;02082021173117
70;1023;02082021173117
71;1023;02082021173117
72;1023;02082021173117
73;1023;02082021173117
74;1023;02082021173117
75;1023;02082021173117
76;1023;02082021173117
77;1023;02082021173117
78;1023;02082021173117
79;1023;02082021173117
80;1023;02082021173117
81;1023;02082021173117
82;1023;02082021173117
83;1023;02082021173117
84;1023;02082021173117
85;1023;02082021173117
86;1012;02082021173117
87;950;02082021173117
88;886;02082021173117
89;809;02082021173117
90;733;02082021173117
91;652;02082021173117
92;603;02082021173117
93;583;02082021173117
94;563;02082021173117
95;543;02082021173117
96;537;02082021173117
97;524;02082021173117
98;516;02082021173117
99;502;02082021173117
100;492;02082021173117
101;484;02082021173117
102;468;02082021173117
103;458;02082021173117
104;449;02082021173117
105;433;02082021173117
106;431;02082021173117
107;417;02082021173117
108;406;02082021173117
109;405;02082021173117
110;395;02082021173117
111;388;02082021173117
112;384;02082021173117
113;377;02082021173117
114;373;02082021173117
115;371;02082021173117
116;368;02082021173117
117;375;02082021173117
118;371;02082021173117
119;389;02082021173117
120;406;02082021173117
121;432;02082021173117
122;456;02082021173117
123;457;02082021173117
124;440;02082021173117
125;412;02082021173117
126;374;02082021173117
127;340;02082021173117
128;314;02082021173117
129;291;02082021173117
130;282;02082021173117
131;271;02082021173117
132;261;02082021173117
133;258;02082021173117
134;250;02082021173117
135;245;02082021173117
136;242;02082021173117
137;238;02082021173117
138;235;02082021173117
139;230;02082021173117
140;224;02082021173117
141;223;02082021173117
142;217;02082021173117
143;215;02082021173117
144;213;02082021173117
145;207;02082021173117
146;208;02082021173117
147;204;02082021173117
148;199;02082021173117
149;199;02082021173117
150;197;02082021173117
151;198;02082021173117
152;196;02082021173117
153;195;02082021173117
154;198;02082021173117
155;193;02082021173117
156;191;02082021173117
157;188;02082021173117
158;187;02082021173117
159;186;02082021173117
160;189;02082021173117
161;190;02082021173117
162;201;02082021173117
163;234;02082021173117
164;302;02082021173117
165;329;02082021173117
166;334;02082021173117
167;319;02082021173117
168;281;02082021173117
169;214;02082021173117
170;185;02082021173117
171;182;02082021173117
172;179;02082021173117
173;180;02082021173117
174;180;02082021173117
175;179;02082021173117
176;180;02082021173117
177;177;02082021173117
178;180;02082021173117
179;175;02082021173117
180;171;02082021173117
181;169;02082021173117
182;166;02082021173117
183;164;02082021173117
184;165;02082021173117
185;161;02082021173117
186;165;02082021173117
187;165;02082021173117
188;164;02082021173117
189;170;02082021173117
190;174;02082021173117
191;178;02082021173117
192;189;02082021173117
193;194;02082021173117
194;201;02082021173117
195;209;02082021173117
196;213;02082021173117
197;217;02082021173117
198;213;02082021173117
199;212;02082021173117
200;0;02082021173117
0;0;02082021173117
1;158;02082021173117
2;1023;02082021173117
3;1023;02082021173117
4;1023;02082021173117
5;1023;02082021173117
6;1023;02082021173117
7;1023;02082021173117
8;1023;02082021173117
9;1023;02082021173117
10;1023;02082021173117
11;1023;02082021173117
12;1023;02082021173117
13;1023;02082021173117
14;1023;02082021173117
15;1023;02082021173117
16;1023;02082021173117
17;1023;02082021173117
18;1023;02082021173117
19;1023;02082021173117
20;171;02082021173117
21;155;02082021173117
22;155;02082021173117
23;155;02082021173117
24;154;02082021173117
25;154;02082021173117
26;154;02082021173117
27;154;02082021173117
28;154;02082021173117
29;154;02082021173117
30;154;02082021173117
31;154;02082021173117
32;154;02082021173117
33;154;02082021173117
34;154;02082021173117
35;154;02082021173117
36;154;02082021173117
37;154;02082021173117
38;154;02082021173117
39;154;02082021173117
40;154;02082021173117
41;358;02082021173117
42;1023;02082021173117
43;1023;02082021173117
44;1023;02082021173117
45;1023;02082021173117
46;1023;02082021173117
47;1023;02082021173117
48;1023;02082021173117
49;1023;02082021173117
50;1023;02082021173117
51;1023;02082021173117
52;1023;02082021173117
53;1023;02082021173117
54;1023;02082021173117
55;1023;02082021173117
56;1023;02082021173117
57;1023;02082021173117
58;1023;02082021173117
59;1023;02082021173117
60;1023;02082021173117
61;1023;02082021173117
62;1023;02082021173117
63;1023;02082021173117
64;1023;02082021173117
65;1023;02082021173117
66;1023;02082021173117
67;1023;02082021173117
68;1023;02082021173117
69;1023;02082021173117
70;1023;02082021173117
71;1023;02082021173117
72;1023;02082021173117
73;1023;02082021173117
74;1023;02082021173117
75;1023;02082021173117
76;1023;02082021173117
77;1023;02082021173117
78;1023;02082021173117
79;1023;02082021173117
80;1023;02082021173117
81;1023;02082021173117
82;1023;02082021173117
83;1023;02082021173117
84;1023;02082021173117
85;1023;02082021173117
86;1022;02082021173117
87;956;02082021173117
88;896;02082021173117
89;815;02082021173117
90;745;02082021173117
91;660;02082021173117
92;601;02082021173117
93;589;02082021173117
94;574;02082021173117
95;555;02082021173117
96;543;02082021173117
97;530;02082021173117
98;520;02082021173117
99;511;02082021173117
100;494;02082021173117
101;491;02082021173117
102;472;02082021173117
103;457;02082021173117
104;448;02082021173117
105;436;02082021173117
106;433;02082021173117
107;423;02082021173117
108;417;02082021173117
109;406;02082021173117
110;400;02082021173117
111;393;02082021173117
112;388;02082021173117
113;379;02082021173117
114;374;02082021173117
115;374;02082021173117
116;371;02082021173117
117;371;02082021173117
118;375;02082021173117
119;390;02082021173117
120;410;02082021173117
121;435;02082021173117
122;455;02082021173117
123;460;02082021173117
124;445;02082021173117
125;416;02082021173117
126;377;02082021173117
127;340;02082021173117
128;318;02082021173117
129;294;02082021173117
130;284;02082021173117
131;270;02082021173117
132;260;02082021173117
133;259;02082021173117
134;250;02082021173117
135;246;02082021173117
136;244;02082021173117
137;236;02082021173117
138;234;02082021173117
139;231;02082021173117
140;225;02082021173117
141;224;02082021173117
142;219;02082021173117
143;213;02082021173117
144;213;02082021173117
145;207;02082021173117
146;209;02082021173117
147;204;02082021173117
148;201;02082021173117
149;199;02082021173117
150;196;02082021173117
151;196;02082021173117
152;196;02082021173117
153;194;02082021173117
154;196;02082021173117
155;194;02082021173117
156;191;02082021173117
157;189;02082021173117
158;187;02082021173117
159;184;02082021173117
160;189;02082021173117
161;190;02082021173117
162;201;02082021173117
163;236;02082021173117
164;305;02082021173117
165;333;02082021173117
166;333;02082021173117
167;321;02082021173117
168;284;02082021173117
169;215;02082021173117
170;185;02082021173117
171;182;02082021173117
172;179;02082021173117
173;181;02082021173117
174;178;02082021173117
175;178;02082021173117
176;180;02082021173117
177;177;02082021173117
178;178;02082021173117
179;174;02082021173117
180;171;02082021173117
181;170;02082021173117
182;167;02082021173117
183;163;02082021173117
184;164;02082021173117
185;162;02082021173117
186;165;02082021173117
187;163;02082021173117
188;165;02082021173117
189;168;02082021173117
190;172;02082021173117
191;179;02082021173117
192;189;02082021173117
193;192;02082021173117
194;200;02082021173117
195;207;02082021173117
196;212;02082021173117
197;214;02082021173117
198;215;02082021173117
199;212;02082021173117
200;0;02082021173117
0;0;02082021173118
1;159;02082021173118
2;1023;02082021173118
3;1023;02082021173118
4;1023;02082021173118
5;1023;02082021173118
6;1023;02082021173118
7;1023;02082021173118
8;1023;02082021173118
9;1023;02082021173118
10;1023;02082021173118
11;1023;02082021173118
12;1023;02082021173118
13;1023;02082021173118
14;1023;02082021173118
15;1023;02082021173118
16;1023;02082021173118
17;1023;02082021173118
18;1023;02082021173118
19;1023;02082021173118
20;171;02082021173118
21;156;02082021173118
22;156;02082021173118
23;156;02082021173118
24;155;02082021173118
25;155;02082021173118
26;155;02082021173118
27;155;02082021173118
28;155;02082021173118
29;155;02082021173118
30;155;02082021173118
31;155;02082021173118
32;155;02082021173118
33;155;02082021173118
34;155;02082021173118
35;155;02082021173118
36;155;02082021173118
37;155;02082021173118
38;155;02082021173118
39;155;02082021173118
40;155;02082021173118
41;381;02082021173118
42;1023;02082021173118
43;1023;02082021173118
44;1023;02082021173118
45;1023;02082021173118
46;1023;02082021173118
47;1023;02082021173118
48;1023;02082021173118
49;1023;02082021173118
50;1023;02082021173118
51;1023;02082021173118
52;1023;02082021173118
53;1023;02082021173118
54;1023;02082021173118
55;1023;02082021173118
56;1023;02082021173118
57;1023;02082021173118
58;1023;02082021173118
59;1023;02082021173118
60;1023;02082021173118
61;1023;02082021173118
62;1023;02082021173118
63;1023;02082021173118
64;1023;02082021173118
65;1023;02082021173118
66;1023;02082021173118
67;1023;02082021173118
68;1023;02082021173118
69;1023;02082021173118
70;1023;02082021173118
71;1023;02082021173118
72;1023;02082021173118
73;1023;02082021173118
74;1023;02082021173118
75;1023;02082021173118
76;1023;02082021173118
77;1023;02082021173118
78;1023;02082021173118
79;1023;02082021173118
80;1023;02082021173118
81;1023;02082021173118
82;1023;02082021173118
83;1023;02082021173118
84;1023;02082021173118
85;1023;02082021173118
86;1013;02082021173118
87;954;02082021173118
88;889;02082021173118
89;813;02082021173118
90;740;02082021173118
91;659;02082021173118
92;596;02082021173118
93;584;02082021173118
94;565;02082021173118
95;553;02082021173118
96;541;02082021173118
97;526;02082021173118
98;516;02082021173118
99;509;02082021173118
100;499;02082021173118
101;485;02082021173118
102;473;02082021173118
103;462;02082021173118
104;451;02082021173118
105;437;02082021173118
106;436;02082021173118
107;417;02082021173118
108;414;02082021173118
109;409;02082021173118
110;400;02082021173118
111;391;02082021173118
112;385;02082021173118
113;374;02082021173118
114;375;02082021173118
115;373;02082021173118
116;371;02082021173118
117;375;02082021173118
118;378;02082021173118
119;393;02082021173118
120;407;02082021173118
121;430;02082021173118
122;454;02082021173118
123;456;02082021173118
124;447;02082021173118
125;415;02082021173118
126;374;02082021173118
127;344;02082021173118
128;318;02082021173118
129;293;02082021173118
130;283;02082021173118
131;274;02082021173118
132;261;02082021173118
133;258;02082021173118
134;251;02082021173118
135;244;02082021173118
136;244;02082021173118
137;237;02082021173118
138;235;02082021173118
139;230;02082021173118
140;226;02082021173118
141;224;02082021173118
142;216;02082021173118
143;215;02082021173118
144;211;02082021173118
145;209;02082021173118
146;208;02082021173118
147;204;02082021173118
148;198;02082021173118
149;197;02082021173118
150;196;02082021173118
151;199;02082021173118
152;198;02082021173118
153;193;02082021173118
154;196;02082021173118
155;192;02082021173118
156;191;02082021173118
157;191;02082021173118
158;187;02082021173118
159;185;02082021173118
160;189;02082021173118
161;190;02082021173118
162;201;02082021173118
163;237;02082021173118
164;304;02082021173118
165;331;02082021173118
166;335;02082021173118
167;320;02082021173118
168;280;02082021173118
169;214;02082021173118
170;186;02082021173118
171;184;02082021173118
172;180;02082021173118
173;180;02082021173118
174;181;02082021173118
175;180;02082021173118
176;181;02082021173118
177;176;02082021173118
178;179;02082021173118
179;175;02082021173118
180;171;02082021173118
181;171;02082021173118
182;166;02082021173118
183;164;02082021173118
184;166;02082021173118
185;162;02082021173118
186;165;02082021173118
187;166;02082021173118
188;165;02082021173118
189;170;02082021173118
190;173;02082021173118
191;179;02082021173118
192;190;02082021173118
193;194;02082021173118
194;201;02082021173118
195;209;02082021173118
196;211;02082021173118
197;217;02082021173118
198;218;02082021173118
199;212;02082021173118
200;0;02082021173118
0;0;02082021173118
1;158;02082021173118
2;1023;02082021173118
3;1023;02082021173118
4;1023;02082021173118
5;1023;02082021173118
6;1023;02082021173118
7;1023;02082021173118
8;1023;02082021173118
9;1023;02082021173118
10;1023;02082021173118
11;1023;02082021173118
12;1023;02082021173118
13;1023;02082021173118
14;1023;02082021173118
15;1023;02082021173118
16;1023;02082021173118
17;1023;02082021173118
18;1023;02082021173118
19;1023;02082021173118
20;171;02082021173118
21;155;02082021173118
22;154;02082021173118
23;154;02082021173118
24;154;02082021173118
25;155;02082021173118
26;154;02082021173118
27;154;02082021173118
28;154;02082021173118
29;154;02082021173118
30;154;02082021173118
31;154;02082021173118
32;154;02082021173118
33;154;02082021173118
34;154;02082021173118
35;154;02082021173118
36;154;02082021173118
37;154;02082021173118
38;154;02082021173118
39;154;02082021173118
40;154;02082021173118
41;365;02082021173118
42;1023;02082021173118
43;1023;02082021173118
44;1023;02082021173118
45;1023;02082021173118
46;1023;02082021173118
47;1023;02082021173118
48;1023;02082021173118
49;1023;02082021173118
50;1023;02082021173118
51;1023;02082021173118
52;1023;02082021173118
53;1023;02082021173118
54;1023;02082021173118
55;1023;02082021173118
56;1023;02082021173118
57;1023;02082021173118
58;1023;02082021173118
59;1023;02082021173118
60;1023;02082021173118
61;1023;02082021173118
62;1023;02082021173118
63;1023;02082021173118
64;1023;02082021173118
65;1023;02082021173118
66;1023;02082021173118
67;1023;02082021173118
68;1023;02082021173118
69;1023;02082021173118
70;1023;02082021173118
71;1023;02082021173118
72;1023;02082021173118
73;1023;02082021173118
74;1023;02082021173118
75;1023;02082021173118
76;1023;02082021173118
77;1023;02082021173118
78;1023;02082021173118
79;1023;02082021173118
80;1023;02082021173118
81;1023;02082021173118
82;1023;02082021173118
83;1023;02082021173118
84;1023;02082021173118
85;1023;02082021173118
86;1023;02082021173118
87;961;02082021173118
88;894;02082021173118
89;818;02082021173118
90;743;02082021173118
91;662;02082021173118
92;603;02082021173118
93;588;02082021173118
94;571;02082021173118
95;553;02082021173118
96;544;02082021173118
97;527;02082021173118
98;519;02082021173118
99;512;02082021173118
100;496;02082021173118
101;489;02082021173118
102;476;02082021173118
103;463;02082021173118
104;451;02082021173118
105;441;02082021173118
106;433;02082021173118
107;428;02082021173118
108;416;02082021173118
109;411;02082021173118
110;400;02082021173118
111;394;02082021173118
112;389;02082021173118
113;378;02082021173118
114;376;02082021173118
115;375;02082021173118
116;373;02082021173118
117;374;02082021173118
118;376;02082021173118
119;393;02082021173118
120;409;02082021173118
121;436;02082021173118
122;456;02082021173118
123;461;02082021173118
124;447;02082021173118
125;420;02082021173118
126;375;02082021173118
127;343;02082021173118
128;321;02082021173118
129;297;02082021173118
130;283;02082021173118
131;273;02082021173118
132;264;02082021173118
133;260;02082021173118
134;249;02082021173118
135;246;02082021173118
136;243;02082021173118
137;236;02082021173118
138;236;02082021173118
139;233;02082021173118
140;226;02082021173118
141;224;02082021173118
142;218;02082021173118
143;217;02082021173118
144;213;02082021173118
145;209;02082021173118
146;211;02082021173118
147;204;02082021173118
148;203;02082021173118
149;198;02082021173118
150;197;02082021173118
151;199;02082021173118
152;196;02082021173118
153;194;02082021173118
154;196;02082021173118
155;193;02082021173118
156;191;02082021173118
157;190;02082021173118
158;187;02082021173118
159;187;02082021173118
160;188;02082021173118
161;192;02082021173118
162;203;02082021173118
163;236;02082021173118
164;303;02082021173118
165;331;02082021173118
166;333;02082021173118
167;323;02082021173118
168;282;02082021173118
169;215;02082021173118
170;185;02082021173118
171;181;02082021173118
172;177;02082021173118
173;180;02082021173118
174;179;02082021173118
175;179;02082021173118
176;180;02082021173118
177;176;02082021173118
178;178;02082021173118
179;176;02082021173118
180;172;02082021173118
181;172;02082021173118
182;167;02082021173118
183;165;02082021173118
184;164;02082021173118
185;162;02082021173118
186;166;02082021173118
187;166;02082021173118
188;166;02082021173118
189;170;02082021173118
190;172;02082021173118
191;178;02082021173118
192;189;02082021173118
193;192;02082021173118
194;201;02082021173118
195;207;02082021173118
196;212;02082021173118
197;217;02082021173118
198;217;02082021173118
199;212;02082021173118
200;0;02082021173118
0;0;02082021173119
1;159;02082021173119
2;1023;02082021173119
3;1023;02082021173119
4;1023;02082021173119
5;1023;02082021173119
6;1023;02082021173119
7;1023;02082021173119
8;1023;02082021173119
9;1023;02082021173119
10;1023;02082021173119
11;1023;02082021173119
12;1023;02082021173119
13;1023;02082021173119
14;1023;02082021173119
15;1023;02082021173119
16;1023;02082021173119
17;1023;02082021173119
18;1023;02082021173119
19;1023;02082021173119
20;175;02082021173119
21;156;02082021173119
22;155;02082021173119
23;155;02082021173119
24;155;02082021173119
25;155;02082021173119
26;155;02082021173119
27;154;02082021173119
28;155;02082021173119
29;155;02082021173119
30;155;02082021173119
31;155;02082021173119
32;155;02082021173119
33;155;02082021173119
34;155;02082021173119
35;155;02082021173119
36;155;02082021173119
37;155;02082021173119
38;154;02082021173119
39;155;02082021173119
40;155;02082021173119
41;395;02082021173119
42;1023;02082021173119
43;1023;02082021173119
44;1023;02082021173119
45;1023;02082021173119
46;1023;02082021173119
47;1023;02082021173119
48;1023;02082021173119
49;1023;02082021173119
50;1023;02082021173119
51;1023;02082021173119
52;1023;02082021173119
53;1023;02082021173119
54;1023;02082021173119
55;1023;02082021173119
56;1023;02082021173119
57;1023;02082021173119
58;1023;02082021173119
59;1023;02082021173119
60;1023;02082021173119
61;1023;02082021173119
62;1023;02082021173119
63;1023;02082021173119
64;1023;02082021173119
65;1023;02082021173119
66;1023;02082021173119
67;1023;02082021173119
68;1023;02082021173119
69;1023;02082021173119
70;1023;02082021173119
71;1023;02082021173119
72;1023;02082021173119
73;1023;02082021173119
74;1023;02082021173119
75;1023;02082021173119
76;1023;02082021173119
77;1023;02082021173119
78;1023;02082021173119
79;1023;02082021173119
80;1023;02082021173119
81;1023;02082021173119
82;1023;02082021173119
83;1023;02082021173119
84;1023;02082021173119
85;1023;02082021173119
86;1012;02082021173119
87;948;02082021173119
88;887;02082021173119
89;809;02082021173119
90;735;02082021173119
91;650;02082021173119
92;601;02082021173119
93;581;02082021173119
94;570;02082021173119
95;548;02082021173119
96;542;02082021173119
97;528;02082021173119
98;517;02082021173119
99;506;02082021173119
100;495;02082021173119
101;483;02082021173119
102;472;02082021173119
103;459;02082021173119
104;447;02082021173119
105;437;02082021173119
106;433;02082021173119
107;421;02082021173119
108;414;02082021173119
109;405;02082021173119
110;396;02082021173119
111;387;02082021173119
112;385;02082021173119
113;377;02082021173119
114;376;02082021173119
115;373;02082021173119
116;369;02082021173119
117;371;02082021173119
118;376;02082021173119
119;388;02082021173119
120;409;02082021173119
121;432;02082021173119
122;453;02082021173119
123;456;02082021173119
124;443;02082021173119
125;415;02082021173119
126;374;02082021173119
127;337;02082021173119
128;314;02082021173119
129;293;02082021173119
130;281;02082021173119
131;272;02082021173119
132;262;02082021173119
133;260;02082021173119
134;249;02082021173119
135;244;02082021173119
136;241;02082021173119
137;236;02082021173119
138;233;02082021173119
139;230;02082021173119
140;226;02082021173119
141;224;02082021173119
142;217;02082021173119
143;213;02082021173119
144;213;02082021173119
145;208;02082021173119
146;207;02082021173119
147;203;02082021173119
148;200;02082021173119
149;199;02082021173119
150;196;02082021173119
151;198;02082021173119
152;196;02082021173119
153;196;02082021173119
154;196;02082021173119
155;193;02082021173119
156;189;02082021173119
157;190;02082021173119
158;186;02082021173119
159;187;02082021173119
160;189;02082021173119
161;192;02082021173119
162;202;02082021173119
163;234;02082021173119
164;302;02082021173119
165;330;02082021173119
166;332;02082021173119
167;322;02082021173119
168;284;02082021173119
169;214;02082021173119
170;185;02082021173119
171;182;02082021173119
172;179;02082021173119
173;180;02082021173119
174;179;02082021173119
175;179;02082021173119
176;181;02082021173119
177;178;02082021173119
178;179;02082021173119
179;175;02082021173119
180;172;02082021173119
181;170;02082021173119
182;167;02082021173119
183;164;02082021173119
184;164;02082021173119
185;162;02082021173119
186;165;02082021173119
187;166;02082021173119
188;165;02082021173119
189;170;02082021173119
190;173;02082021173119
191;179;02082021173119
192;188;02082021173119
193;193;02082021173119
194;199;02082021173119
195;206;02082021173119
196;213;02082021173119
197;216;02082021173119
198;215;02082021173119
199;212;02082021173119
200;0;02082021173119
0;0;02082021173119
1;158;02082021173119
2;1023;02082021173119
3;1023;02082021173119
4;1023;02082021173119
5;1023;02082021173119
6;1023;02082021173119
7;1023;02082021173119
8;1023;02082021173119
9;1023;02082021173119
10;1023;02082021173119
11;1023;02082021173119
12;1023;02082021173119
13;1023;02082021173119
14;1023;02082021173119
15;1023;02082021173119
16;1023;02082021173119
17;1023;02082021173119
18;1023;02082021173119
19;1023;02082021173119
20;169;02082021173119
21;154;02082021173119
22;154;02082021173119
23;154;02082021173119
24;154;02082021173119
25;154;02082021173119
26;154;02082021173119
27;154;02082021173119
28;154;02082021173119
29;154;02082021173119
30;154;02082021173119
31;154;02082021173119
32;154;02082021173119
33;153;02082021173119
34;153;02082021173119
35;153;02082021173119
36;153;02082021173119
37;154;02082021173119
38;154;02082021173119
39;154;02082021173119
40;154;02082021173119
41;346;02082021173119
42;1012;02082021173119
43;1023;02082021173119
44;1023;02082021173119
45;1023;02082021173119
46;1023;02082021173119
47;1023;02082021173119
48;1023;02082021173119
49;1023;02082021173119
50;1023;02082021173119
51;1023;02082021173119
52;1023;02082021173119
53;1023;02082021173119
54;1023;02082021173119
55;1023;02082021173119
56;1023;02082021173119
57;1023;02082021173119
58;1023;02082021173119
59;1023;02082021173119
60;1023;02082021173119
61;1023;02082021173119
62;1023;02082021173119
63;1023;02082021173119
64;1023;02082021173119
65;1023;02082021173119
66;1023;02082021173119
67;1023;02082021173119
68;1023;02082021173119
69;1023;02082021173119
70;1023;02082021173119
71;1023;02082021173119
72;1023;02082021173119
73;1023;02082021173119
74;1023;02082021173119
75;1023;02082021173119
76;1023;02082021173119
77;1023;02082021173119
78;1023;02082021173119
79;1023;02082021173119
80;1023;02082021173119
81;1023;02082021173119
82;1023;02082021173119
83;1023;02082021173119
84;1023;02082021173119
85;1023;02082021173119
86;1023;02082021173119
87;968;02082021173119
88;902;02082021173119
89;822;02082021173119
90;746;02082021173119
91;662;02082021173119
92;607;02082021173119
93;589;02082021173119
94;578;02082021173119
95;549;02082021173119
96;544;02082021173119
97;527;02082021173119
98;516;02082021173119
99;513;02082021173119
100;494;02082021173119
101;488;02082021173119
102;474;02082021173119
103;463;02082021173119
104;450;02082021173119
105;441;02082021173119
106;436;02082021173119
107;421;02082021173119
108;412;02082021173119
109;408;02082021173119
110;399;02082021173119
111;392;02082021173119
112;389;02082021173119
113;378;02082021173119
114;379;02082021173119
115;375;02082021173119
116;372;02082021173119
117;376;02082021173119
118;379;02082021173119
119;389;02082021173119
120;410;02082021173119
121;437;02082021173119
122;457;02082021173119
123;456;02082021173119
124;445;02082021173119
125;420;02082021173119
126;380;02082021173119
127;346;02082021173119
128;320;02082021173119
129;294;02082021173119
130;280;02082021173119
131;272;02082021173119
132;264;02082021173119
133;260;02082021173119
134;249;02082021173119
135;245;02082021173119
136;243;02082021173119
137;235;02082021173119
138;236;02082021173119
139;232;02082021173119
140;226;02082021173119
141;225;02082021173119
142;217;02082021173119
143;214;02082021173119
144;213;02082021173119
145;208;02082021173119
146;208;02082021173119
147;205;02082021173119
148;201;02082021173119
149;199;02082021173119
150;196;02082021173119
151;197;02082021173119
152;197;02082021173119
153;194;02082021173119
154;196;02082021173119
155;193;02082021173119
156;191;02082021173119
157;188;02082021173119
158;187;02082021173119
159;187;02082021173119
160;189;02082021173119
161;191;02082021173119
162;203;02082021173119
163;237;02082021173119
164;304;02082021173119
165;334;02082021173119
166;338;02082021173119
167;322;02082021173119
168;283;02082021173119
169;216;02082021173119
170;186;02082021173119
171;181;02082021173119
172;182;02082021173119
173;181;02082021173119
174;179;02082021173119
175;177;02082021173119
176;181;02082021173119
177;177;02082021173119
178;177;02082021173119
179;174;02082021173119
180;172;02082021173119
181;170;02082021173119
182;166;02082021173119
183;163;02082021173119
184;165;02082021173119
185;160;02082021173119
186;165;02082021173119
187;165;02082021173119
188;164;02082021173119
189;170;02082021173119
190;171;02082021173119
191;178;02082021173119
192;187;02082021173119
193;192;02082021173119
194;200;02082021173119
195;207;02082021173119
196;212;02082021173119
197;215;02082021173119
198;216;02082021173119
199;212;02082021173119
200;0;02082021173119
0;0;02082021173120
1;159;02082021173120
2;1023;02082021173120
3;1023;02082021173120
4;1023;02082021173120
5;1023;02082021173120
6;1023;02082021173120
7;1023;02082021173120
8;1023;02082021173120
9;1023;02082021173120
10;1023;02082021173120
11;1023;02082021173120
12;1023;02082021173120
13;1023;02082021173120
14;1023;02082021173120
15;1023;02082021173120
16;1023;02082021173120
17;1023;02082021173120
18;1023;02082021173120
19;1023;02082021173120
20;171;02082021173120
21;155;02082021173120
22;155;02082021173120
23;155;02082021173120
24;154;02082021173120
25;155;02082021173120
26;155;02082021173120
27;155;02082021173120
28;155;02082021173120
29;155;02082021173120
30;155;02082021173120
31;155;02082021173120
32;155;02082021173120
33;154;02082021173120
34;154;02082021173120
35;154;02082021173120
36;154;02082021173120
37;155;02082021173120
38;154;02082021173120
39;155;02082021173120
40;155;02082021173120
41;368;02082021173120
42;1023;02082021173120
43;1023;02082021173120
44;1023;02082021173120
45;1023;02082021173120
46;1023;02082021173120
47;1023;02082021173120
48;1023;02082021173120
49;1023;02082021173120
50;1023;02082021173120
51;1023;02082021173120
52;1023;02082021173120
53;1023;02082021173120
54;1023;02082021173120
55;1023;02082021173120
56;1023;02082021173120
57;1023;02082021173120
58;1023;02082021173120
59;1023;02082021173120
60;1023;02082021173120
61;1023;02082021173120
62;1023;02082021173120
63;1023;02082021173120
64;1023;02082021173120
65;1023;02082021173120
66;1023;02082021173120
67;1023;02082021173120
68;1023;02082021173120
69;1023;02082021173120
70;1023;02082021173120
71;1023;02082021173120
72;1023;02082021173120
73;1023;02082021173120
74;1023;02082021173120
75;1023;02082021173120
76;1023;02082021173120
77;1023;02082021173120
78;1023;02082021173120
79;1023;02082021173120
80;1023;02082021173120
81;1023;02082021173120
82;1023;02082021173120
83;1023;02082021173120
84;1023;02082021173120
85;1023;02082021173120
86;1017;02082021173120
87;958;02082021173120
88;897;02082021173120
89;814;02082021173120
90;743;02082021173120
91;658;02082021173120
92;600;02082021173120
93;586;02082021173120
94;571;02082021173120
95;553;02082021173120
96;543;02082021173120
97;530;02082021173120
98;517;02082021173120
99;504;02082021173120
100;495;02082021173120
101;486;02082021173120
102;469;02082021173120
103;459;02082021173120
104;450;02082021173120
105;436;02082021173120
106;435;02082021173120
107;421;02082021173120
108;408;02082021173120
109;407;02082021173120
110;404;02082021173120
111;390;02082021173120
112;387;02082021173120
113;376;02082021173120
114;378;02082021173120
115;369;02082021173120
116;374;02082021173120
117;377;02082021173120
118;376;02082021173120
119;389;02082021173120
120;407;02082021173120
121;429;02082021173120
122;454;02082021173120
123;454;02082021173120
124;446;02082021173120
125;415;02082021173120
126;378;02082021173120
127;343;02082021173120
128;314;02082021173120
129;297;02082021173120
130;284;02082021173120
131;275;02082021173120
132;264;02082021173120
133;257;02082021173120
134;250;02082021173120
135;246;02082021173120
136;245;02082021173120
137;235;02082021173120
138;234;02082021173120
139;230;02082021173120
140;226;02082021173120
141;225;02082021173120
142;218;02082021173120
143;214;02082021173120
144;215;02082021173120
145;207;02082021173120
146;208;02082021173120
147;202;02082021173120
148;200;02082021173120
149;199;02082021173120
150;198;02082021173120
151;198;02082021173120
152;197;02082021173120
153;195;02082021173120
154;197;02082021173120
155;195;02082021173120
156;192;02082021173120
157;190;02082021173120
158;188;02082021173120
159;186;02082021173120
160;191;02082021173120
161;191;02082021173120
162;202;02082021173120
163;238;02082021173120
164;302;02082021173120
165;330;02082021173120
166;335;02082021173120
167;323;02082021173120
168;282;02082021173120
169;215;02082021173120
170;186;02082021173120
171;181;02082021173120
172;182;02082021173120
173;182;02082021173120
174;179;02082021173120
175;180;02082021173120
176;182;02082021173120
177;177;02082021173120
178;180;02082021173120
179;175;02082021173120
180;171;02082021173120
181;170;02082021173120
182;166;02082021173120
183;164;02082021173120
184;163;02082021173120
185;162;02082021173120
186;164;02082021173120
187;164;02082021173120
188;165;02082021173120
189;171;02082021173120
190;173;02082021173120
191;177;02082021173120
192;187;02082021173120
193;192;02082021173120
194;200;02082021173120
195;208;02082021173120
196;211;02082021173120
197;215;02082021173120
198;217;02082021173120
199;210;02082021173120
200;0;02082021173120
0;0;02082021173120
1;158;02082021173120
2;1023;02082021173120
3;1023;02082021173120
4;1023;02082021173120
5;1023;02082021173120
6;1023;02082021173120
7;1023;02082021173120
8;1023;02082021173120
9;1023;02082021173120
10;1023;02082021173120
11;1023;02082021173120
12;1023;02082021173120
13;1023;02082021173120
14;1023;02082021173120
15;1023;02082021173120
16;1023;02082021173120
17;1023;02082021173120
18;1023;02082021173120
19;1023;02082021173120
20;168;02082021173120
21;154;02082021173120
22;153;02082021173120
23;153;02082021173120
24;153;02082021173120
25;154;02082021173120
26;154;02082021173120
27;153;02082021173120
28;154;02082021173120
29;154;02082021173120
30;154;02082021173120
31;154;02082021173120
32;153;02082021173120
33;153;02082021173120
34;153;02082021173120
35;153;02082021173120
36;153;02082021173120
37;153;02082021173120
38;153;02082021173120
39;153;02082021173120
40;154;02082021173120
41;318;02082021173120
42;964;02082021173120
43;1023;02082021173120
44;1023;02082021173120
45;1023;02082021173120
46;1023;02082021173120
47;1023;02082021173120
48;1023;02082021173120
49;1023;02082021173120
50;1023;02082021173120
51;1023;02082021173120
52;1023;02082021173120
53;1023;02082021173120
54;1023;02082021173120
55;1023;02082021173120
56;1023;02082021173120
57;1023;02082021173120
58;1023;02082021173120
59;1023;02082021173120
60;1023;02082021173120
61;1023;02082021173120
62;1023;02082021173120
63;1023;02082021173120
64;1023;02082021173120
65;1023;02082021173120
66;1023;02082021173120
67;1023;02082021173120
68;1023;02082021173120
69;1023;02082021173120
70;1023;02082021173120
71;1023;02082021173120
72;1023;02082021173120
73;1023;02082021173120
74;1023;02082021173120
75;1023;02082021173120
76;1023;02082021173120
77;1023;02082021173120
78;1023;02082021173120
79;1023;02082021173120
80;1023;02082021173120
81;1023;02082021173120
82;1023;02082021173120
83;1023;02082021173120
84;1023;02082021173120
85;1023;02082021173120
86;1023;02082021173120
87;968;02082021173120
88;909;02082021173120
89;826;02082021173120
90;745;02082021173120
91;669;02082021173120
92;605;02082021173120
93;590;02082021173120
94;573;02082021173120
95;557;02082021173120
96;548;02082021173120
97;534;02082021173120
98;522;02082021173120
99;511;02082021173120
100;499;02082021173120
101;490;02082021173120
102;478;02082021173120
103;465;02082021173120
104;454;02082021173120
105;441;02082021173120
106;435;02082021173120
107;422;02082021173120
108;416;02082021173120
109;407;02082021173120
110;397;02082021173120
111;396;02082021173120
112;391;02082021173120
113;384;02082021173120
114;380;02082021173120
115;381;02082021173120
116;374;02082021173120
117;376;02082021173120
118;384;02082021173120
119;391;02082021173120
120;412;02082021173120
121;435;02082021173120
122;462;02082021173120
123;463;02082021173120
124;450;02082021173120
125;423;02082021173120
126;378;02082021173120
127;343;02082021173120
128;323;02082021173120
129;297;02082021173120
130;286;02082021173120
131;274;02082021173120
132;266;02082021173120
133;261;02082021173120
134;249;02082021173120
135;245;02082021173120
136;242;02082021173120
137;237;02082021173120
138;233;02082021173120
139;231;02082021173120
140;225;02082021173120
141;224;02082021173120
142;218;02082021173120
143;213;02082021173120
144;213;02082021173120
145;208;02082021173120
146;207;02082021173120
147;203;02082021173120
148;200;02082021173120
149;197;02082021173120
150;198;02082021173120
151;197;02082021173120
152;198;02082021173120
153;194;02082021173120
154;195;02082021173120
155;194;02082021173120
156;192;02082021173120
157;190;02082021173120
158;187;02082021173120
159;186;02082021173120
160;187;02082021173120
161;192;02082021173120
162;202;02082021173120
163;235;02082021173120
164;304;02082021173120
165;337;02082021173120
166;336;02082021173120
167;325;02082021173120
168;283;02082021173120
169;217;02082021173120
170;185;02082021173120
171;183;02082021173120
172;179;02082021173120
173;179;02082021173120
174;179;02082021173120
175;178;02082021173120
176;180;02082021173120
177;176;02082021173120
178;179;02082021173120
179;176;02082021173120
180;172;02082021173120
181;170;02082021173120
182;166;02082021173120
183;163;02082021173120
184;165;02082021173120
185;160;02082021173120
186;164;02082021173120
187;164;02082021173120
188;163;02082021173120
189;170;02082021173120
190;171;02082021173120
191;177;02082021173120
192;189;02082021173120
193;192;02082021173120
194;202;02082021173120
195;210;02082021173120
196;212;02082021173120
197;217;02082021173120
198;216;02082021173120
199;213;02082021173120
200;0;02082021173120
0;0;02082021173121
1;157;02082021173121
2;1023;02082021173121
3;1023;02082021173121
4;1023;02082021173121
5;1023;02082021173121
6;1023;02082021173121
7;1023;02082021173121
8;1023;02082021173121
9;1023;02082021173121
10;1023;02082021173121
11;1023;02082021173121
12;1023;02082021173121
13;1023;02082021173121
14;1023;02082021173121
15;1023;02082021173121
16;1023;02082021173121
17;1023;02082021173121
18;1023;02082021173121
19;1023;02082021173121
20;166;02082021173121
21;154;02082021173121
22;154;02082021173121
23;154;02082021173121
24;153;02082021173121
25;154;02082021173121
26;154;02082021173121
27;153;02082021173121
28;153;02082021173121
29;153;02082021173121
30;153;02082021173121
31;153;02082021173121
32;153;02082021173121
33;153;02082021173121
34;153;02082021173121
35;153;02082021173121
36;153;02082021173121
37;153;02082021173121
38;154;02082021173121
39;153;02082021173121
40;153;02082021173121
41;322;02082021173121
42;975;02082021173121
43;1023;02082021173121
44;1023;02082021173121
45;1023;02082021173121
46;1023;02082021173121
47;1023;02082021173121
48;1023;02082021173121
49;1023;02082021173121
50;1023;02082021173121
51;1023;02082021173121
52;1023;02082021173121
53;1023;02082021173121
54;1023;02082021173121
55;1023;02082021173121
56;1023;02082021173121
57;1023;02082021173121
58;1023;02082021173121
59;1023;02082021173121
60;1023;02082021173121
61;1023;02082021173121
62;1023;02082021173121
63;1023;02082021173121
64;1023;02082021173121
65;1023;02082021173121
66;1023;02082021173121
67;1023;02082021173121
68;1023;02082021173121
69;1023;02082021173121
70;1023;02082021173121
71;1023;02082021173121
72;1023;02082021173121
73;1023;02082021173121
74;1023;02082021173121
75;1023;02082021173121
76;1023;02082021173121
77;1023;02082021173121
78;1023;02082021173121
79;1023;02082021173121
80;1023;02082021173121
81;1023;02082021173121
82;1023;02082021173121
83;1023;02082021173121
84;1023;02082021173121
85;1023;02082021173121
86;1023;02082021173121
87;969;02082021173121
88;905;02082021173121
89;827;02082021173121
90;745;02082021173121
91;667;02082021173121
92;609;02082021173121
93;594;02082021173121
94;574;02082021173121
95;560;02082021173121
96;545;02082021173121
97;533;02082021173121
98;524;02082021173121
99;512;02082021173121
100;505;02082021173121
101;490;02082021173121
102;475;02082021173121
103;461;02082021173121
104;460;02082021173121
105;446;02082021173121
106;439;02082021173121
107;420;02082021173121
108;414;02082021173121
109;410;02082021173121
110;403;02082021173121
111;394;02082021173121
112;393;02082021173121
113;382;02082021173121
114;378;02082021173121
115;376;02082021173121
116;377;02082021173121
117;375;02082021173121
118;380;02082021173121
119;394;02082021173121
120;417;02082021173121
121;439;02082021173121
122;459;02082021173121
123;461;02082021173121
124;448;02082021173121
125;420;02082021173121
126;384;02082021173121
127;344;02082021173121
128;318;02082021173121
129;298;02082021173121
130;283;02082021173121
131;275;02082021173121
132;265;02082021173121
133;257;02082021173121
134;253;02082021173121
135;245;02082021173121
136;243;02082021173121
137;236;02082021173121
138;235;02082021173121
139;229;02082021173121
140;227;02082021173121
141;224;02082021173121
142;217;02082021173121
143;212;02082021173121
144;216;02082021173121
145;208;02082021173121
146;208;02082021173121
147;205;02082021173121
148;200;02082021173121
149;199;02082021173121
150;196;02082021173121
151;198;02082021173121
152;196;02082021173121
153;194;02082021173121
154;195;02082021173121
155;193;02082021173121
156;191;02082021173121
157;189;02082021173121
158;188;02082021173121
159;186;02082021173121
160;189;02082021173121
161;189;02082021173121
162;203;02082021173121
163;235;02082021173121
164;306;02082021173121
165;337;02082021173121
166;337;02082021173121
167;327;02082021173121
168;287;02082021173121
169;216;02082021173121
170;185;02082021173121
171;182;02082021173121
172;180;02082021173121
173;180;02082021173121
174;181;02082021173121
175;178;02082021173121
176;180;02082021173121
177;177;02082021173121
178;179;02082021173121
179;175;02082021173121
180;171;02082021173121
181;169;02082021173121
182;166;02082021173121
183;164;02082021173121
184;165;02082021173121
185;161;02082021173121
186;164;02082021173121
187;164;02082021173121
188;164;02082021173121
189;169;02082021173121
190;173;02082021173121
191;179;02082021173121
192;190;02082021173121
193;192;02082021173121
194;202;02082021173121
195;208;02082021173121
196;213;02082021173121
197;219;02082021173121
198;217;02082021173121
199;214;02082021173121
200;0;02082021173121
0;0;02082021173121
1;157;02082021173121
2;1023;02082021173121
3;1023;02082021173121
4;1023;02082021173121
5;1023;02082021173121
6;1023;02082021173121
7;1023;02082021173121
8;1023;02082021173121
9;1023;02082021173121
10;1023;02082021173121
11;1023;02082021173121
12;1023;02082021173121
13;1023;02082021173121
14;1023;02082021173121
15;1023;02082021173121
16;1023;02082021173121
17;1023;02082021173121
18;1023;02082021173121
19;1023;02082021173121
20;167;02082021173121
21;154;02082021173121
22;153;02082021173121
23;154;02082021173121
24;153;02082021173121
25;153;02082021173121
26;154;02082021173121
27;153;02082021173121
28;153;02082021173121
29;153;02082021173121
30;153;02082021173121
31;154;02082021173121
32;153;02082021173121
33;153;02082021173121
34;153;02082021173121
35;153;02082021173121
36;153;02082021173121
37;153;02082021173121
38;153;02082021173121
39;153;02082021173121
40;153;02082021173121
41;321;02082021173121
42;978;02082021173121
43;1023;02082021173121
44;1023;02082021173121
45;1023;02082021173121
46;1023;02082021173121
47;1023;02082021173121
48;1023;02082021173121
49;1023;02082021173121
50;1023;02082021173121
51;1023;02082021173121
52;1023;02082021173121
53;1023;02082021173121
54;1023;02082021173121
55;1023;02082021173121
56;1023;02082021173121
57;1023;02082021173121
58;1023;02082021173121
59;1023;02082021173121
60;1023;02082021173121
61;1023;02082021173121
62;1023;02082021173121
63;1023;02082021173121
64;1023;02082021173121
65;1023;02082021173121
66;1023;02082021173121
67;1023;02082021173121
68;1023;02082021173121
69;1023;02082021173121
70;1023;02082021173121
71;1023;02082021173121
72;1023;02082021173121
73;1023;02082021173121
74;1023;02082021173121
75;1023;02082021173121
76;1023;02082021173121
77;1023;02082021173121
78;1023;02082021173121
79;1023;02082021173121
80;1023;02082021173121
81;1023;02082021173121
82;1023;02082021173121
83;1023;02082021173121
84;1023;02082021173121
85;1023;02082021173121
86;1023;02082021173121
87;972;02082021173121
88;910;02082021173121
89;828;02082021173121
90;755;02082021173121
91;667;02082021173121
92;608;02082021173121
93;594;02082021173121
94;574;02082021173121
95;557;02082021173121
96;549;02082021173121
97;532;02082021173121
98;523;02082021173121
99;509;02082021173121
100;498;02082021173121
101;491;02082021173121
102;478;02082021173121
103;464;02082021173121
104;455;02082021173121
105;440;02082021173121
106;439;02082021173121
107;423;02082021173121
108;414;02082021173121
109;409;02082021173121
110;400;02082021173121
111;394;02082021173121
112;390;02082021173121
113;383;02082021173121
114;380;02082021173121
115;377;02082021173121
116;377;02082021173121
117;376;02082021173121
118;375;02082021173121
119;392;02082021173121
120;410;02082021173121
121;440;02082021173121
122;462;02082021173121
123;463;02082021173121
124;448;02082021173121
125;418;02082021173121
126;382;02082021173121
127;347;02082021173121
128;318;02082021173121
129;296;02082021173121
130;284;02082021173121
131;273;02082021173121
132;261;02082021173121
133;261;02082021173121
134;251;02082021173121
135;244;02082021173121
136;243;02082021173121
137;234;02082021173121
138;234;02082021173121
139;231;02082021173121
140;225;02082021173121
141;224;02082021173121
142;217;02082021173121
143;213;02082021173121
144;213;02082021173121
145;207;02082021173121
146;208;02082021173121
147;205;02082021173121
148;201;02082021173121
149;199;02082021173121
150;197;02082021173121
151;198;02082021173121
152;198;02082021173121
153;193;02082021173121
154;197;02082021173121
155;192;02082021173121
156;191;02082021173121
157;190;02082021173121
158;187;02082021173121
159;185;02082021173121
160;190;02082021173121
161;189;02082021173121
162;202;02082021173121
163;233;02082021173121
164;305;02082021173121
165;336;02082021173121
166;338;02082021173121
167;327;02082021173121
168;284;02082021173121
169;214;02082021173121
170;184;02082021173121
171;180;02082021173121
172;179;02082021173121
173;180;02082021173121
174;179;02082021173121
175;178;02082021173121
176;179;02082021173121
177;178;02082021173121
178;178;02082021173121
179;175;02082021173121
180;170;02082021173121
181;167;02082021173121
182;166;02082021173121
183;163;02082021173121
184;164;02082021173121
185;161;02082021173121
186;164;02082021173121
187;165;02082021173121
188;165;02082021173121
189;169;02082021173121
190;172;02082021173121
191;179;02082021173121
192;189;02082021173121
193;192;02082021173121
194;203;02082021173121
195;210;02082021173121
196;215;02082021173121
197;218;02082021173121
198;216;02082021173121
199;212;02082021173121
200;0;02082021173121
0;0;02082021173122
1;159;02082021173122
2;1023;02082021173122
3;1023;02082021173122
4;1023;02082021173122
5;1023;02082021173122
6;1023;02082021173122
7;1023;02082021173122
8;1023;02082021173122
9;1023;02082021173122
10;1023;02082021173122
11;1023;02082021173122
12;1023;02082021173122
13;1023;02082021173122
14;1023;02082021173122
15;1023;02082021173122
16;1023;02082021173122
17;1023;02082021173122
18;1023;02082021173122
19;1023;02082021173122
20;168;02082021173122
21;155;02082021173122
22;155;02082021173122
23;155;02082021173122
24;155;02082021173122
25;155;02082021173122
26;155;02082021173122
27;155;02082021173122
28;155;02082021173122
29;155;02082021173122
30;154;02082021173122
31;154;02082021173122
32;154;02082021173122
33;154;02082021173122
34;154;02082021173122
35;155;02082021173122
36;155;02082021173122
37;154;02082021173122
38;155;02082021173122
39;155;02082021173122
40;155;02082021173122
41;335;02082021173122
42;1023;02082021173122
43;1023;02082021173122
44;1023;02082021173122
45;1023;02082021173122
46;1023;02082021173122
47;1023;02082021173122
48;1023;02082021173122
49;1023;02082021173122
50;1023;02082021173122
51;1023;02082021173122
52;1023;02082021173122
53;1023;02082021173122
54;1023;02082021173122
55;1023;02082021173122
56;1023;02082021173122
57;1023;02082021173122
58;1023;02082021173122
59;1023;02082021173122
60;1023;02082021173122
61;1023;02082021173122
62;1023;02082021173122
63;1023;02082021173122
64;1023;02082021173122
65;1023;02082021173122
66;1023;02082021173122
67;1023;02082021173122
68;1023;02082021173122
69;1023;02082021173122
70;1023;02082021173122
71;1023;02082021173122
72;1023;02082021173122
73;1023;02082021173122
74;1023;02082021173122
75;1023;02082021173122
76;1023;02082021173122
77;1023;02082021173122
78;1023;02082021173122
79;1023;02082021173122
80;1023;02082021173122
81;1023;02082021173122
82;1023;02082021173122
83;1023;02082021173122
84;1023;02082021173122
85;1023;02082021173122
86;1023;02082021173122
87;961;02082021173122
88;895;02082021173122
89;816;02082021173122
90;746;02082021173122
91;662;02082021173122
92;606;02082021173122
93;587;02082021173122
94;568;02082021173122
95;557;02082021173122
96;547;02082021173122
97;533;02082021173122
98;521;02082021173122
99;510;02082021173122
100;496;02082021173122
101;489;02082021173122
102;475;02082021173122
103;461;02082021173122
104;449;02082021173122
105;445;02082021173122
106;432;02082021173122
107;422;02082021173122
108;417;02082021173122
109;406;02082021173122
110;397;02082021173122
111;394;02082021173122
112;389;02082021173122
113;378;02082021173122
114;378;02082021173122
115;376;02082021173122
116;371;02082021173122
117;377;02082021173122
118;376;02082021173122
119;390;02082021173122
120;410;02082021173122
121;435;02082021173122
122;456;02082021173122
123;462;02082021173122
124;443;02082021173122
125;415;02082021173122
126;379;02082021173122
127;341;02082021173122
128;318;02082021173122
129;296;02082021173122
130;285;02082021173122
131;276;02082021173122
132;263;02082021173122
133;261;02082021173122
134;253;02082021173122
135;246;02082021173122
136;243;02082021173122
137;237;02082021173122
138;234;02082021173122
139;231;02082021173122
140;227;02082021173122
141;225;02082021173122
142;219;02082021173122
143;214;02082021173122
144;216;02082021173122
145;208;02082021173122
146;208;02082021173122
147;204;02082021173122
148;201;02082021173122
149;201;02082021173122
150;197;02082021173122
151;198;02082021173122
152;197;02082021173122
153;196;02082021173122
154;197;02082021173122
155;194;02082021173122
156;193;02082021173122
157;190;02082021173122
158;185;02082021173122
159;186;02082021173122
160;187;02082021173122
161;193;02082021173122
162;203;02082021173122
163;236;02082021173122
164;304;02082021173122
165;332;02082021173122
166;335;02082021173122
167;324;02082021173122
168;283;02082021173122
169;214;02082021173122
170;187;02082021173122
171;183;02082021173122
172;180;02082021173122
173;181;02082021173122
174;180;02082021173122
175;178;02082021173122
176;182;02082021173122
177;178;02082021173122
178;179;02082021173122
179;175;02082021173122
180;171;02082021173122
181;169;02082021173122
182;167;02082021173122
183;164;02082021173122
184;165;02082021173122
185;162;02082021173122
186;165;02082021173122
187;165;02082021173122
188;164;02082021173122
189;169;02082021173122
190;173;02082021173122
191;179;02082021173122
192;189;02082021173122
193;193;02082021173122
194;200;02082021173122
195;208;02082021173122
196;212;02082021173122
197;219;02082021173122
198;216;02082021173122
199;212;02082021173122
200;0;02082021173122
0;0;02082021173122
1;158;02082021173122
2;1023;02082021173122
3;1023;02082021173122
4;1023;02082021173122
5;1023;02082021173122
6;1023;02082021173122
7;1023;02082021173122
8;1023;02082021173122
9;1023;02082021173122
10;1023;02082021173122
11;1023;02082021173122
12;1023;02082021173122
13;1023;02082021173122
14;1023;02082021173122
15;1023;02082021173122
16;1023;02082021173122
17;1023;02082021173122
18;1023;02082021173122
19;1023;02082021173122
20;166;02082021173122
21;154;02082021173122
22;154;02082021173122
23;153;02082021173122
24;153;02082021173122
25;153;02082021173122
26;154;02082021173122
27;153;02082021173122
28;153;02082021173122
29;153;02082021173122
30;154;02082021173122
31;154;02082021173122
32;154;02082021173122
33;153;02082021173122
34;154;02082021173122
35;153;02082021173122
36;153;02082021173122
37;153;02082021173122
38;153;02082021173122
39;153;02082021173122
40;153;02082021173122
41;311;02082021173122
42;967;02082021173122
43;1023;02082021173122
44;1023;02082021173122
45;1023;02082021173122
46;1023;02082021173122
47;1023;02082021173122
48;1023;02082021173122
49;1023;02082021173122
50;1023;02082021173122
51;1023;02082021173122
52;1023;02082021173122
53;1023;02082021173122
54;1023;02082021173122
55;1023;02082021173122
56;1023;02082021173122
57;1023;02082021173122
58;1023;02082021173122
59;1023;02082021173122
60;1023;02082021173122
61;1023;02082021173122
62;1023;02082021173122
63;1023;02082021173122
64;1023;02082021173122
65;1023;02082021173122
66;1023;02082021173122
67;1023;02082021173122
68;1023;02082021173122
69;1023;02082021173122
70;1023;02082021173122
71;1023;02082021173122
72;1023;02082021173122
73;1023;02082021173122
74;1023;02082021173122
75;1023;02082021173122
76;1023;02082021173122
77;1023;02082021173122
78;1023;02082021173122
79;1023;02082021173122
80;1023;02082021173122
81;1023;02082021173122
82;1023;02082021173122
83;1023;02082021173122
84;1023;02082021173122
85;1023;02082021173122
86;1023;02082021173122
87;969;02082021173122
88;903;02082021173122
89;827;02082021173122
90;749;02082021173122
91;666;02082021173122
92;612;02082021173122
93;591;02082021173122
94;573;02082021173122
95;556;02082021173122
96;543;02082021173122
97;531;02082021173122
98;523;02082021173122
99;507;02082021173122
100;497;02082021173122
101;491;02082021173122
102;477;02082021173122
103;465;02082021173122
104;453;02082021173122
105;440;02082021173122
106;435;02082021173122
107;422;02082021173122
108;416;02082021173122
109;404;02082021173122
110;399;02082021173122
111;394;02082021173122
112;388;02082021173122
113;380;02082021173122
114;376;02082021173122
115;378;02082021173122
116;373;02082021173122
117;378;02082021173122
118;377;02082021173122
119;389;02082021173122
120;411;02082021173122
121;436;02082021173122
122;457;02082021173122
123;461;02082021173122
124;447;02082021173122
125;418;02082021173122
126;380;02082021173122
127;345;02082021173122
128;321;02082021173122
129;296;02082021173122
130;283;02082021173122
131;274;02082021173122
132;262;02082021173122
133;260;02082021173122
134;251;02082021173122
135;245;02082021173122
136;245;02082021173122
137;237;02082021173122
138;233;02082021173122
139;232;02082021173122
140;226;02082021173122
141;224;02082021173122
142;217;02082021173122
143;214;02082021173122
144;214;02082021173122
145;206;02082021173122
146;209;02082021173122
147;205;02082021173122
148;199;02082021173122
149;200;02082021173122
150;196;02082021173122
151;196;02082021173122
152;195;02082021173122
153;195;02082021173122
154;199;02082021173122
155;194;02082021173122
156;190;02082021173122
157;191;02082021173122
158;187;02082021173122
159;187;02082021173122
160;190;02082021173122
161;190;02082021173122
162;202;02082021173122
163;236;02082021173122
164;307;02082021173122
165;334;02082021173122
166;338;02082021173122
167;323;02082021173122
168;283;02082021173122
169;217;02082021173122
170;185;02082021173122
171;180;02082021173122
172;180;02082021173122
173;182;02082021173122
174;181;02082021173122
175;181;02082021173122
176;181;02082021173122
177;178;02082021173122
178;178;02082021173122
179;175;02082021173122
180;170;02082021173122
181;169;02082021173122
182;166;02082021173122
183;164;02082021173122
184;165;02082021173122
185;161;02082021173122
186;165;02082021173122
187;164;02082021173122
188;165;02082021173122
189;169;02082021173122
190;172;02082021173122
191;177;02082021173122
192;189;02082021173122
193;194;02082021173122
194;199;02082021173122
195;208;02082021173122
196;212;02082021173122
197;217;02082021173122
198;217;02082021173122
199;213;02082021173122
200;0;02082021173122
0;0;02082021173123
1;158;02082021173123
2;1023;02082021173123
3;1023;02082021173123
4;1023;02082021173123
5;1023;02082021173123
6;1023;02082021173123
7;1023;02082021173123
8;1023;02082021173123
9;1023;02082021173123
10;1023;02082021173123
11;1023;02082021173123
12;1023;02082021173123
13;1023;02082021173123
14;1023;02082021173123
15;1023;02082021173123
16;1023;02082021173123
17;1023;02082021173123
18;1023;02082021173123
19;1023;02082021173123
20;168;02082021173123
21;154;02082021173123
22;154;02082021173123
23;154;02082021173123
24;154;02082021173123
25;154;02082021173123
26;154;02082021173123
27;153;02082021173123
28;153;02082021173123
29;153;02082021173123
30;153;02082021173123
31;153;02082021173123
32;153;02082021173123
33;153;02082021173123
34;153;02082021173123
35;153;02082021173123
36;153;02082021173123
37;153;02082021173123
38;153;02082021173123
39;154;02082021173123
40;154;02082021173123
41;328;02082021173123
42;981;02082021173123
43;1023;02082021173123
44;1023;02082021173123
45;1023;02082021173123
46;1023;02082021173123
47;1023;02082021173123
48;1023;02082021173123
49;1023;02082021173123
50;1023;02082021173123
51;1023;02082021173123
52;1023;02082021173123
53;1023;02082021173123
54;1023;02082021173123
55;1023;02082021173123
56;1023;02082021173123
57;1023;02082021173123
58;1023;02082021173123
59;1023;02082021173123
60;1023;02082021173123
61;1023;02082021173123
62;1023;02082021173123
63;1023;02082021173123
64;1023;02082021173123
65;1023;02082021173123
66;1023;02082021173123
67;1023;02082021173123
68;1023;02082021173123
69;1023;02082021173123
70;1023;02082021173123
71;1023;02082021173123
72;1023;02082021173123
73;1023;02082021173123
74;1023;02082021173123
75;1023;02082021173123
76;1023;02082021173123
77;1023;02082021173123
78;1023;02082021173123
79;1023;02082021173123
80;1023;02082021173123
81;1023;02082021173123
82;1023;02082021173123
83;1023;02082021173123
84;1023;02082021173123
85;1023;02082021173123
86;1023;02082021173123
87;968;02082021173123
88;903;02082021173123
89;827;02082021173123
90;745;02082021173123
91;663;02082021173123
92;607;02082021173123
93;591;02082021173123
94;572;02082021173123
95;555;02082021173123
96;551;02082021173123
97;535;02082021173123
98;518;02082021173123
99;512;02082021173123
100;496;02082021173123
101;489;02082021173123
102;476;02082021173123
103;462;02082021173123
104;451;02082021173123
105;442;02082021173123
106;435;02082021173123
107;425;02082021173123
108;414;02082021173123
109;410;02082021173123
110;402;02082021173123
111;392;02082021173123
112;390;02082021173123
113;379;02082021173123
114;381;02082021173123
115;379;02082021173123
116;373;02082021173123
117;378;02082021173123
118;378;02082021173123
119;392;02082021173123
120;412;02082021173123
121;441;02082021173123
122;461;02082021173123
123;465;02082021173123
124;447;02082021173123
125;423;02082021173123
126;381;02082021173123
127;345;02082021173123
128;320;02082021173123
129;295;02082021173123
130;284;02082021173123
131;274;02082021173123
132;262;02082021173123
133;260;02082021173123
134;250;02082021173123
135;244;02082021173123
136;243;02082021173123
137;235;02082021173123
138;234;02082021173123
139;230;02082021173123
140;227;02082021173123
141;224;02082021173123
142;217;02082021173123
143;216;02082021173123
144;213;02082021173123
145;207;02082021173123
146;208;02082021173123
147;204;02082021173123
148;198;02082021173123
149;200;02082021173123
150;198;02082021173123
151;197;02082021173123
152;197;02082021173123
153;194;02082021173123
154;197;02082021173123
155;193;02082021173123
156;190;02082021173123
157;189;02082021173123
158;187;02082021173123
159;186;02082021173123
160;189;02082021173123
161;190;02082021173123
162;202;02082021173123
163;236;02082021173123
164;307;02082021173123
165;337;02082021173123
166;336;02082021173123
167;325;02082021173123
168;285;02082021173123
169;217;02082021173123
170;187;02082021173123
171;180;02082021173123
172;178;02082021173123
173;181;02082021173123
174;177;02082021173123
175;179;02082021173123
176;181;02082021173123
177;176;02082021173123
178;178;02082021173123
179;174;02082021173123
180;170;02082021173123
181;171;02082021173123
182;167;02082021173123
183;164;02082021173123
184;163;02082021173123
185;159;02082021173123
186;165;02082021173123
187;166;02082021173123
188;164;02082021173123
189;170;02082021173123
190;173;02082021173123
191;179;02082021173123
192;190;02082021173123
193;192;02082021173123
194;200;02082021173123
195;210;02082021173123
196;212;02082021173123
197;218;02082021173123
198;216;02082021173123
199;215;02082021173123
200;0;02082021173123
0;0;02082021173123
1;157;02082021173123
2;1023;02082021173123
3;1023;02082021173123
4;1023;02082021173123
5;1023;02082021173123
6;1023;02082021173123
7;1023;02082021173123
8;1023;02082021173123
9;1023;02082021173123
10;1023;02082021173123
11;1023;02082021173123
12;1023;02082021173123
13;1023;02082021173123
14;1023;02082021173123
15;1023;02082021173123
16;1023;02082021173123
17;1023;02082021173123
18;1023;02082021173123
19;1023;02082021173123
20;167;02082021173123
21;154;02082021173123
22;154;02082021173123
23;153;02082021173123
24;153;02082021173123
25;154;02082021173123
26;154;02082021173123
27;153;02082021173123
28;153;02082021173123
29;153;02082021173123
30;153;02082021173123
31;153;02082021173123
32;153;02082021173123
33;153;02082021173123
34;153;02082021173123
35;153;02082021173123
36;153;02082021173123
37;153;02082021173123
38;153;02082021173123
39;153;02082021173123
40;153;02082021173123
41;322;02082021173123
42;967;02082021173123
43;1023;02082021173123
44;1023;02082021173123
45;1023;02082021173123
46;1023;02082021173123
47;1023;02082021173123
48;1023;02082021173123
49;1023;02082021173123
50;1023;02082021173123
51;1023;02082021173123
52;1023;02082021173123
53;1023;02082021173123
54;1023;02082021173123
55;1023;02082021173123
56;1023;02082021173123
57;1023;02082021173123
58;1023;02082021173123
59;1023;02082021173123
60;1023;02082021173123
61;1023;02082021173123
62;1023;02082021173123
63;1023;02082021173123
64;1023;02082021173123
65;1023;02082021173123
66;1023;02082021173123
67;1023;02082021173123
68;1023;02082021173123
69;1023;02082021173123
70;1023;02082021173123
71;1023;02082021173123
72;1023;02082021173123
73;1023;02082021173123
74;1023;02082021173123
75;1023;02082021173123
76;1023;02082021173123
77;1023;02082021173123
78;1023;02082021173123
79;1023;02082021173123
80;1023;02082021173123
81;1023;02082021173123
82;1023;02082021173123
83;1023;02082021173123
84;1023;02082021173123
85;1023;02082021173123
86;1023;02082021173123
87;971;02082021173123
88;908;02082021173123
89;824;02082021173123
90;754;02082021173123
91;666;02082021173123
92;608;02082021173123
93;590;02082021173123
94;573;02082021173123
95;558;02082021173123
96;546;02082021173123
97;532;02082021173123
98;520;02082021173123
99;510;02082021173123
100;500;02082021173123
101;490;02082021173123
102;479;02082021173123
103;464;02082021173123
104;451;02082021173123
105;440;02082021173123
106;434;02082021173123
107;425;02082021173123
108;415;02082021173123
109;410;02082021173123
110;402;02082021173123
111;398;02082021173123
112;389;02082021173123
113;384;02082021173123
114;380;02082021173123
115;376;02082021173123
116;375;02082021173123
117;379;02082021173123
118;380;02082021173123
119;394;02082021173123
120;411;02082021173123
121;439;02082021173123
122;460;02082021173123
123;463;02082021173123
124;446;02082021173123
125;423;02082021173123
126;381;02082021173123
127;347;02082021173123
128;323;02082021173123
129;295;02082021173123
130;283;02082021173123
131;274;02082021173123
132;263;02082021173123
133;258;02082021173123
134;251;02082021173123
135;245;02082021173123
136;245;02082021173123
137;237;02082021173123
138;234;02082021173123
139;229;02082021173123
140;224;02082021173123
141;225;02082021173123
142;218;02082021173123
143;213;02082021173123
144;212;02082021173123
145;207;02082021173123
146;210;02082021173123
147;203;02082021173123
148;201;02082021173123
149;199;02082021173123
150;197;02082021173123
151;197;02082021173123
152;197;02082021173123
153;196;02082021173123
154;197;02082021173123
155;194;02082021173123
156;190;02082021173123
157;190;02082021173123
158;186;02082021173123
159;184;02082021173123
160;188;02082021173123
161;191;02082021173123
162;200;02082021173123
163;236;02082021173123
164;304;02082021173123
165;337;02082021173123
166;336;02082021173123
167;324;02082021173123
168;286;02082021173123
169;214;02082021173123
170;186;02082021173123
171;181;02082021173123
172;178;02082021173123
173;180;02082021173123
174;181;02082021173123
175;178;02082021173123
176;179;02082021173123
177;176;02082021173123
178;176;02082021173123
179;174;02082021173123
180;171;02082021173123
181;172;02082021173123
182;168;02082021173123
183;163;02082021173123
184;164;02082021173123
185;161;02082021173123
186;165;02082021173123
187;163;02082021173123
188;164;02082021173123
189;169;02082021173123
190;172;02082021173123
191;178;02082021173123
192;190;02082021173123
193;191;02082021173123
194;202;02082021173123
195;208;02082021173123
196;213;02082021173123
197;216;02082021173123
198;219;02082021173123
199;212;02082021173123
200;0;02082021173123
