ind;val;datetime
0;0;02082021180032
1;145;02082021180032
2;122;02082021180032
3;120;02082021180032
4;121;02082021180032
5;122;02082021180032
6;120;02082021180032
7;122;02082021180032
8;122;02082021180032
9;120;02082021180032
10;122;02082021180032
11;120;02082021180032
12;119;02082021180032
13;122;02082021180032
14;121;02082021180032
15;122;02082021180032
16;122;02082021180032
17;119;02082021180032
18;122;02082021180032
19;120;02082021180032
20;120;02082021180032
21;120;02082021180032
22;118;02082021180032
23;121;02082021180032
24;122;02082021180032
25;119;02082021180032
26;122;02082021180032
27;120;02082021180032
28;120;02082021180032
29;122;02082021180032
30;121;02082021180032
31;120;02082021180032
32;122;02082021180032
33;118;02082021180032
34;122;02082021180032
35;120;02082021180032
36;119;02082021180032
37;122;02082021180032
38;119;02082021180032
39;120;02082021180032
40;121;02082021180032
41;119;02082021180032
42;121;02082021180032
43;120;02082021180032
44;121;02082021180032
45;121;02082021180032
46;119;02082021180032
47;119;02082021180032
48;122;02082021180032
49;120;02082021180032
50;123;02082021180032
51;120;02082021180032
52;119;02082021180032
53;121;02082021180032
54;119;02082021180032
55;120;02082021180032
56;120;02082021180032
57;119;02082021180032
58;122;02082021180032
59;120;02082021180032
60;120;02082021180032
61;120;02082021180032
62;119;02082021180032
63;121;02082021180032
64;122;02082021180032
65;119;02082021180032
66;122;02082021180032
67;120;02082021180032
68;118;02082021180032
69;122;02082021180032
70;119;02082021180032
71;120;02082021180032
72;122;02082021180032
73;118;02082021180032
74;121;02082021180032
75;119;02082021180032
76;119;02082021180032
77;121;02082021180032
78;119;02082021180032
79;120;02082021180032
80;121;02082021180032
81;119;02082021180032
82;122;02082021180032
83;120;02082021180032
84;120;02082021180032
85;121;02082021180032
86;119;02082021180032
87;121;02082021180032
88;122;02082021180032
89;118;02082021180032
90;121;02082021180032
91;120;02082021180032
92;119;02082021180032
93;122;02082021180032
94;120;02082021180032
95;120;02082021180032
96;122;02082021180032
97;120;02082021180032
98;121;02082021180032
99;122;02082021180032
100;120;02082021180032
101;122;02082021180032
102;120;02082021180032
103;122;02082021180032
104;121;02082021180032
105;119;02082021180032
106;122;02082021180032
107;120;02082021180032
108;119;02082021180032
109;122;02082021180032
110;119;02082021180032
111;120;02082021180032
112;123;02082021180032
113;119;02082021180032
114;122;02082021180032
115;122;02082021180032
116;121;02082021180032
117;123;02082021180032
118;120;02082021180032
119;122;02082021180032
120;121;02082021180032
121;120;02082021180032
122;121;02082021180032
123;121;02082021180032
124;119;02082021180032
125;122;02082021180032
126;119;02082021180032
127;121;02082021180032
128;122;02082021180032
129;121;02082021180032
130;121;02082021180032
131;122;02082021180032
132;120;02082021180032
133;124;02082021180032
134;119;02082021180032
135;121;02082021180032
136;122;02082021180032
137;120;02082021180032
138;122;02082021180032
139;121;02082021180032
140;120;02082021180032
141;122;02082021180032
142;121;02082021180032
143;120;02082021180032
144;122;02082021180032
145;118;02082021180032
146;123;02082021180032
147;121;02082021180032
148;121;02082021180032
149;122;02082021180032
150;120;02082021180032
151;121;02082021180032
152;122;02082021180032
153;119;02082021180032
154;122;02082021180032
155;121;02082021180032
156;120;02082021180032
157;122;02082021180032
158;120;02082021180032
159;120;02082021180032
160;121;02082021180032
161;120;02082021180032
162;122;02082021180032
163;122;02082021180032
164;120;02082021180032
165;123;02082021180032
166;122;02082021180032
167;120;02082021180032
168;122;02082021180032
169;120;02082021180032
170;121;02082021180032
171;122;02082021180032
172;121;02082021180032
173;122;02082021180032
174;121;02082021180032
175;120;02082021180032
176;122;02082021180032
177;121;02082021180032
178;122;02082021180032
179;121;02082021180032
180;120;02082021180032
181;123;02082021180032
182;122;02082021180032
183;121;02082021180032
184;122;02082021180032
185;119;02082021180032
186;122;02082021180032
187;121;02082021180032
188;119;02082021180032
189;121;02082021180032
190;121;02082021180032
191;120;02082021180032
192;124;02082021180032
193;120;02082021180032
194;121;02082021180032
195;122;02082021180032
196;120;02082021180032
197;122;02082021180032
198;122;02082021180032
199;119;02082021180032
200;0;02082021180032
0;0;02082021180032
1;143;02082021180032
2;120;02082021180032
3;118;02082021180032
4;119;02082021180032
5;119;02082021180032
6;117;02082021180032
7;118;02082021180032
8;120;02082021180032
9;118;02082021180032
10;121;02082021180032
11;118;02082021180032
12;117;02082021180032
13;120;02082021180032
14;118;02082021180032
15;119;02082021180032
16;120;02082021180032
17;118;02082021180032
18;121;02082021180032
19;119;02082021180032
20;118;02082021180032
21;119;02082021180032
22;116;02082021180032
23;119;02082021180032
24;121;02082021180032
25;118;02082021180032
26;120;02082021180032
27;119;02082021180032
28;118;02082021180032
29;120;02082021180032
30;119;02082021180032
31;119;02082021180032
32;120;02082021180032
33;117;02082021180032
34;120;02082021180032
35;118;02082021180032
36;117;02082021180032
37;120;02082021180032
38;118;02082021180032
39;120;02082021180032
40;119;02082021180032
41;117;02082021180032
42;120;02082021180032
43;119;02082021180032
44;118;02082021180032
45;119;02082021180032
46;118;02082021180032
47;118;02082021180032
48;120;02082021180032
49;117;02082021180032
50;120;02082021180032
51;118;02082021180032
52;118;02082021180032
53;120;02082021180032
54;118;02082021180032
55;118;02082021180032
56;119;02082021180032
57;117;02082021180032
58;121;02082021180032
59;118;02082021180032
60;118;02082021180032
61;120;02082021180032
62;118;02082021180032
63;119;02082021180032
64;121;02082021180032
65;118;02082021180032
66;121;02082021180032
67;120;02082021180032
68;116;02082021180032
69;120;02082021180032
70;118;02082021180032
71;118;02082021180032
72;120;02082021180032
73;117;02082021180032
74;119;02082021180032
75;119;02082021180032
76;118;02082021180032
77;120;02082021180032
78;118;02082021180032
79;119;02082021180032
80;119;02082021180032
81;118;02082021180032
82;120;02082021180032
83;119;02082021180032
84;119;02082021180032
85;121;02082021180032
86;118;02082021180032
87;119;02082021180032
88;120;02082021180032
89;117;02082021180032
90;120;02082021180032
91;119;02082021180032
92;117;02082021180032
93;120;02082021180032
94;119;02082021180032
95;118;02082021180032
96;122;02082021180032
97;119;02082021180032
98;120;02082021180032
99;119;02082021180032
100;118;02082021180032
101;120;02082021180032
102;118;02082021180032
103;120;02082021180032
104;121;02082021180032
105;117;02082021180032
106;121;02082021180032
107;119;02082021180032
108;119;02082021180032
109;120;02082021180032
110;118;02082021180032
111;119;02082021180032
112;121;02082021180032
113;117;02082021180032
114;119;02082021180032
115;121;02082021180032
116;119;02082021180032
117;122;02082021180032
118;119;02082021180032
119;119;02082021180032
120;119;02082021180032
121;118;02082021180032
122;119;02082021180032
123;119;02082021180032
124;118;02082021180032
125;121;02082021180032
126;119;02082021180032
127;119;02082021180032
128;121;02082021180032
129;119;02082021180032
130;120;02082021180032
131;121;02082021180032
132;118;02082021180032
133;122;02082021180032
134;118;02082021180032
135;120;02082021180032
136;120;02082021180032
137;119;02082021180032
138;120;02082021180032
139;120;02082021180032
140;119;02082021180032
141;121;02082021180032
142;119;02082021180032
143;118;02082021180032
144;120;02082021180032
145;118;02082021180032
146;121;02082021180032
147;120;02082021180032
148;119;02082021180032
149;120;02082021180032
150;119;02082021180032
151;120;02082021180032
152;120;02082021180032
153;119;02082021180032
154;121;02082021180032
155;119;02082021180032
156;119;02082021180032
157;120;02082021180032
158;119;02082021180032
159;119;02082021180032
160;122;02082021180032
161;119;02082021180032
162;121;02082021180032
163;119;02082021180032
164;119;02082021180032
165;122;02082021180032
166;121;02082021180032
167;121;02082021180032
168;121;02082021180032
169;119;02082021180032
170;121;02082021180032
171;120;02082021180032
172;119;02082021180032
173;121;02082021180032
174;120;02082021180032
175;119;02082021180032
176;120;02082021180032
177;119;02082021180032
178;122;02082021180032
179;121;02082021180032
180;120;02082021180032
181;122;02082021180032
182;120;02082021180032
183;120;02082021180032
184;120;02082021180032
185;119;02082021180032
186;122;02082021180032
187;121;02082021180032
188;119;02082021180032
189;120;02082021180032
190;119;02082021180032
191;120;02082021180032
192;123;02082021180032
193;119;02082021180032
194;119;02082021180032
195;121;02082021180032
196;119;02082021180032
197;121;02082021180032
198;121;02082021180032
199;119;02082021180032
200;0;02082021180032
0;0;02082021180033
1;146;02082021180033
2;123;02082021180033
3;121;02082021180033
4;122;02082021180033
5;124;02082021180033
6;122;02082021180033
7;123;02082021180033
8;122;02082021180033
9;120;02082021180033
10;124;02082021180033
11;121;02082021180033
12;121;02082021180033
13;124;02082021180033
14;121;02082021180033
15;123;02082021180033
16;123;02082021180033
17;120;02082021180033
18;123;02082021180033
19;121;02082021180033
20;121;02082021180033
21;122;02082021180033
22;120;02082021180033
23;122;02082021180033
24;122;02082021180033
25;121;02082021180033
26;122;02082021180033
27;120;02082021180033
28;121;02082021180033
29;123;02082021180033
30;121;02082021180033
31;122;02082021180033
32;122;02082021180033
33;120;02082021180033
34;123;02082021180033
35;122;02082021180033
36;120;02082021180033
37;124;02082021180033
38;121;02082021180033
39;122;02082021180033
40;122;02082021180033
41;120;02082021180033
42;122;02082021180033
43;122;02082021180033
44;122;02082021180033
45;123;02082021180033
46;121;02082021180033
47;120;02082021180033
48;123;02082021180033
49;121;02082021180033
50;123;02082021180033
51;122;02082021180033
52;121;02082021180033
53;123;02082021180033
54;120;02082021180033
55;120;02082021180033
56;122;02082021180033
57;120;02082021180033
58;122;02082021180033
59;121;02082021180033
60;120;02082021180033
61;122;02082021180033
62;121;02082021180033
63;122;02082021180033
64;123;02082021180033
65;119;02082021180033
66;122;02082021180033
67;120;02082021180033
68;120;02082021180033
69;124;02082021180033
70;121;02082021180033
71;121;02082021180033
72;123;02082021180033
73;119;02082021180033
74;122;02082021180033
75;120;02082021180033
76;120;02082021180033
77;122;02082021180033
78;121;02082021180033
79;121;02082021180033
80;123;02082021180033
81;121;02082021180033
82;123;02082021180033
83;122;02082021180033
84;121;02082021180033
85;122;02082021180033
86;120;02082021180033
87;120;02082021180033
88;122;02082021180033
89;120;02082021180033
90;122;02082021180033
91;123;02082021180033
92;120;02082021180033
93;123;02082021180033
94;122;02082021180033
95;120;02082021180033
96;124;02082021180033
97;121;02082021180033
98;122;02082021180033
99;121;02082021180033
100;120;02082021180033
101;123;02082021180033
102;121;02082021180033
103;120;02082021180033
104;123;02082021180033
105;120;02082021180033
106;123;02082021180033
107;121;02082021180033
108;120;02082021180033
109;123;02082021180033
110;120;02082021180033
111;121;02082021180033
112;124;02082021180033
113;120;02082021180033
114;122;02082021180033
115;122;02082021180033
116;122;02082021180033
117;124;02082021180033
118;121;02082021180033
119;122;02082021180033
120;121;02082021180033
121;120;02082021180033
122;122;02082021180033
123;122;02082021180033
124;120;02082021180033
125;123;02082021180033
126;121;02082021180033
127;123;02082021180033
128;123;02082021180033
129;120;02082021180033
130;121;02082021180033
131;123;02082021180033
132;120;02082021180033
133;124;02082021180033
134;120;02082021180033
135;120;02082021180033
136;124;02082021180033
137;122;02082021180033
138;123;02082021180033
139;122;02082021180033
140;120;02082021180033
141;123;02082021180033
142;122;02082021180033
143;121;02082021180033
144;123;02082021180033
145;120;02082021180033
146;124;02082021180033
147;122;02082021180033
148;122;02082021180033
149;121;02082021180033
150;122;02082021180033
151;122;02082021180033
152;123;02082021180033
153;121;02082021180033
154;123;02082021180033
155;121;02082021180033
156;121;02082021180033
157;122;02082021180033
158;122;02082021180033
159;121;02082021180033
160;124;02082021180033
161;121;02082021180033
162;123;02082021180033
163;123;02082021180033
164;122;02082021180033
165;124;02082021180033
166;122;02082021180033
167;122;02082021180033
168;123;02082021180033
169;120;02082021180033
170;123;02082021180033
171;122;02082021180033
172;122;02082021180033
173;123;02082021180033
174;122;02082021180033
175;120;02082021180033
176;123;02082021180033
177;121;02082021180033
178;122;02082021180033
179;122;02082021180033
180;122;02082021180033
181;123;02082021180033
182;122;02082021180033
183;122;02082021180033
184;123;02082021180033
185;121;02082021180033
186;123;02082021180033
187;122;02082021180033
188;120;02082021180033
189;122;02082021180033
190;122;02082021180033
191;121;02082021180033
192;124;02082021180033
193;122;02082021180033
194;122;02082021180033
195;123;02082021180033
196;121;02082021180033
197;122;02082021180033
198;122;02082021180033
199;122;02082021180033
200;0;02082021180033
0;0;02082021180033
1;144;02082021180033
2;120;02082021180033
3;120;02082021180033
4;119;02082021180033
5;122;02082021180033
6;119;02082021180033
7;121;02082021180033
8;121;02082021180033
9;118;02082021180033
10;121;02082021180033
11;118;02082021180033
12;119;02082021180033
13;121;02082021180033
14;119;02082021180033
15;121;02082021180033
16;120;02082021180033
17;118;02082021180033
18;122;02082021180033
19;118;02082021180033
20;119;02082021180033
21;119;02082021180033
22;119;02082021180033
23;120;02082021180033
24;121;02082021180033
25;119;02082021180033
26;121;02082021180033
27;119;02082021180033
28;120;02082021180033
29;121;02082021180033
30;120;02082021180033
31;121;02082021180033
32;121;02082021180033
33;118;02082021180033
34;122;02082021180033
35;120;02082021180033
36;118;02082021180033
37;122;02082021180033
38;120;02082021180033
39;121;02082021180033
40;121;02082021180033
41;117;02082021180033
42;120;02082021180033
43;120;02082021180033
44;120;02082021180033
45;122;02082021180033
46;119;02082021180033
47;119;02082021180033
48;121;02082021180033
49;120;02082021180033
50;121;02082021180033
51;119;02082021180033
52;119;02082021180033
53;120;02082021180033
54;119;02082021180033
55;119;02082021180033
56;120;02082021180033
57;119;02082021180033
58;121;02082021180033
59;119;02082021180033
60;119;02082021180033
61;120;02082021180033
62;118;02082021180033
63;120;02082021180033
64;121;02082021180033
65;118;02082021180033
66;121;02082021180033
67;119;02082021180033
68;119;02082021180033
69;121;02082021180033
70;119;02082021180033
71;118;02082021180033
72;121;02082021180033
73;118;02082021180033
74;121;02082021180033
75;118;02082021180033
76;119;02082021180033
77;120;02082021180033
78;119;02082021180033
79;120;02082021180033
80;121;02082021180033
81;119;02082021180033
82;122;02082021180033
83;119;02082021180033
84;119;02082021180033
85;120;02082021180033
86;118;02082021180033
87;120;02082021180033
88;121;02082021180033
89;117;02082021180033
90;121;02082021180033
91;121;02082021180033
92;119;02082021180033
93;121;02082021180033
94;120;02082021180033
95;118;02082021180033
96;120;02082021180033
97;119;02082021180033
98;120;02082021180033
99;119;02082021180033
100;118;02082021180033
101;120;02082021180033
102;120;02082021180033
103;120;02082021180033
104;120;02082021180033
105;119;02082021180033
106;122;02082021180033
107;120;02082021180033
108;118;02082021180033
109;121;02082021180033
110;117;02082021180033
111;119;02082021180033
112;122;02082021180033
113;118;02082021180033
114;120;02082021180033
115;120;02082021180033
116;120;02082021180033
117;123;02082021180033
118;120;02082021180033
119;120;02082021180033
120;119;02082021180033
121;118;02082021180033
122;120;02082021180033
123;121;02082021180033
124;118;02082021180033
125;121;02082021180033
126;118;02082021180033
127;119;02082021180033
128;121;02082021180033
129;119;02082021180033
130;120;02082021180033
131;121;02082021180033
132;119;02082021180033
133;123;02082021180033
134;119;02082021180033
135;120;02082021180033
136;122;02082021180033
137;119;02082021180033
138;121;02082021180033
139;120;02082021180033
140;119;02082021180033
141;121;02082021180033
142;119;02082021180033
143;119;02082021180033
144;121;02082021180033
145;119;02082021180033
146;122;02082021180033
147;120;02082021180033
148;119;02082021180033
149;120;02082021180033
150;119;02082021180033
151;120;02082021180033
152;120;02082021180033
153;118;02082021180033
154;122;02082021180033
155;119;02082021180033
156;119;02082021180033
157;121;02082021180033
158;120;02082021180033
159;120;02082021180033
160;121;02082021180033
161;119;02082021180033
162;121;02082021180033
163;121;02082021180033
164;120;02082021180033
165;122;02082021180033
166;119;02082021180033
167;120;02082021180033
168;122;02082021180033
169;119;02082021180033
170;122;02082021180033
171;121;02082021180033
172;120;02082021180033
173;121;02082021180033
174;120;02082021180033
175;119;02082021180033
176;121;02082021180033
177;120;02082021180033
178;122;02082021180033
179;121;02082021180033
180;120;02082021180033
181;122;02082021180033
182;121;02082021180033
183;120;02082021180033
184;120;02082021180033
185;118;02082021180033
186;120;02082021180033
187;120;02082021180033
188;119;02082021180033
189;121;02082021180033
190;120;02082021180033
191;120;02082021180033
192;123;02082021180033
193;119;02082021180033
194;120;02082021180033
195;121;02082021180033
196;119;02082021180033
197;120;02082021180033
198;120;02082021180033
199;120;02082021180033
200;0;02082021180033
0;0;02082021180034
1;145;02082021180034
2;122;02082021180034
3;121;02082021180034
4;120;02082021180034
5;122;02082021180034
6;120;02082021180034
7;122;02082021180034
8;121;02082021180034
9;119;02082021180034
10;121;02082021180034
11;119;02082021180034
12;120;02082021180034
13;123;02082021180034
14;120;02082021180034
15;121;02082021180034
16;122;02082021180034
17;120;02082021180034
18;122;02082021180034
19;121;02082021180034
20;120;02082021180034
21;121;02082021180034
22;120;02082021180034
23;121;02082021180034
24;122;02082021180034
25;120;02082021180034
26;122;02082021180034
27;120;02082021180034
28;121;02082021180034
29;122;02082021180034
30;121;02082021180034
31;120;02082021180034
32;123;02082021180034
33;120;02082021180034
34;123;02082021180034
35;121;02082021180034
36;120;02082021180034
37;123;02082021180034
38;120;02082021180034
39;121;02082021180034
40;122;02082021180034
41;118;02082021180034
42;121;02082021180034
43;120;02082021180034
44;121;02082021180034
45;122;02082021180034
46;120;02082021180034
47;120;02082021180034
48;122;02082021180034
49;120;02082021180034
50;122;02082021180034
51;120;02082021180034
52;119;02082021180034
53;121;02082021180034
54;120;02082021180034
55;120;02082021180034
56;120;02082021180034
57;120;02082021180034
58;122;02082021180034
59;120;02082021180034
60;119;02082021180034
61;121;02082021180034
62;119;02082021180034
63;121;02082021180034
64;123;02082021180034
65;119;02082021180034
66;122;02082021180034
67;120;02082021180034
68;119;02082021180034
69;123;02082021180034
70;120;02082021180034
71;118;02082021180034
72;122;02082021180034
73;119;02082021180034
74;121;02082021180034
75;119;02082021180034
76;121;02082021180034
77;122;02082021180034
78;120;02082021180034
79;120;02082021180034
80;121;02082021180034
81;119;02082021180034
82;122;02082021180034
83;120;02082021180034
84;121;02082021180034
85;122;02082021180034
86;119;02082021180034
87;121;02082021180034
88;123;02082021180034
89;119;02082021180034
90;122;02082021180034
91;121;02082021180034
92;119;02082021180034
93;121;02082021180034
94;121;02082021180034
95;120;02082021180034
96;123;02082021180034
97;120;02082021180034
98;122;02082021180034
99;121;02082021180034
100;120;02082021180034
101;122;02082021180034
102;120;02082021180034
103;121;02082021180034
104;122;02082021180034
105;120;02082021180034
106;122;02082021180034
107;120;02082021180034
108;121;02082021180034
109;123;02082021180034
110;120;02082021180034
111;121;02082021180034
112;123;02082021180034
113;119;02082021180034
114;121;02082021180034
115;122;02082021180034
116;121;02082021180034
117;124;02082021180034
118;121;02082021180034
119;122;02082021180034
120;122;02082021180034
121;120;02082021180034
122;121;02082021180034
123;121;02082021180034
124;119;02082021180034
125;121;02082021180034
126;121;02082021180034
127;121;02082021180034
128;123;02082021180034
129;121;02082021180034
130;122;02082021180034
131;123;02082021180034
132;120;02082021180034
133;124;02082021180034
134;120;02082021180034
135;121;02082021180034
136;122;02082021180034
137;120;02082021180034
138;121;02082021180034
139;121;02082021180034
140;120;02082021180034
141;124;02082021180034
142;121;02082021180034
143;121;02082021180034
144;122;02082021180034
145;118;02082021180034
146;122;02082021180034
147;121;02082021180034
148;120;02082021180034
149;121;02082021180034
150;120;02082021180034
151;121;02082021180034
152;123;02082021180034
153;120;02082021180034
154;122;02082021180034
155;121;02082021180034
156;120;02082021180034
157;122;02082021180034
158;120;02082021180034
159;121;02082021180034
160;122;02082021180034
161;120;02082021180034
162;122;02082021180034
163;123;02082021180034
164;122;02082021180034
165;123;02082021180034
166;122;02082021180034
167;122;02082021180034
168;122;02082021180034
169;119;02082021180034
170;123;02082021180034
171;122;02082021180034
172;121;02082021180034
173;122;02082021180034
174;122;02082021180034
175;121;02082021180034
176;123;02082021180034
177;121;02082021180034
178;122;02082021180034
179;122;02082021180034
180;121;02082021180034
181;123;02082021180034
182;123;02082021180034
183;121;02082021180034
184;122;02082021180034
185;120;02082021180034
186;124;02082021180034
187;121;02082021180034
188;120;02082021180034
189;122;02082021180034
190;120;02082021180034
191;120;02082021180034
192;123;02082021180034
193;121;02082021180034
194;122;02082021180034
195;122;02082021180034
196;121;02082021180034
197;122;02082021180034
198;122;02082021180034
199;120;02082021180034
200;0;02082021180034
0;0;02082021180034
1;144;02082021180034
2;120;02082021180034
3;119;02082021180034
4;121;02082021180034
5;122;02082021180034
6;119;02082021180034
7;120;02082021180034
8;121;02082021180034
9;119;02082021180034
10;121;02082021180034
11;118;02082021180034
12;118;02082021180034
13;121;02082021180034
14;119;02082021180034
15;121;02082021180034
16;120;02082021180034
17;119;02082021180034
18;121;02082021180034
19;119;02082021180034
20;119;02082021180034
21;119;02082021180034
22;118;02082021180034
23;120;02082021180034
24;121;02082021180034
25;119;02082021180034
26;122;02082021180034
27;118;02082021180034
28;120;02082021180034
29;121;02082021180034
30;118;02082021180034
31;119;02082021180034
32;121;02082021180034
33;118;02082021180034
34;121;02082021180034
35;119;02082021180034
36;118;02082021180034
37;122;02082021180034
38;119;02082021180034
39;121;02082021180034
40;120;02082021180034
41;118;02082021180034
42;121;02082021180034
43;120;02082021180034
44;120;02082021180034
45;120;02082021180034
46;118;02082021180034
47;119;02082021180034
48;120;02082021180034
49;119;02082021180034
50;122;02082021180034
51;119;02082021180034
52;119;02082021180034
53;121;02082021180034
54;118;02082021180034
55;119;02082021180034
56;119;02082021180034
57;117;02082021180034
58;121;02082021180034
59;119;02082021180034
60;119;02082021180034
61;120;02082021180034
62;119;02082021180034
63;120;02082021180034
64;121;02082021180034
65;117;02082021180034
66;121;02082021180034
67;119;02082021180034
68;118;02082021180034
69;121;02082021180034
70;118;02082021180034
71;119;02082021180034
72;121;02082021180034
73;117;02082021180034
74;121;02082021180034
75;118;02082021180034
76;119;02082021180034
77;121;02082021180034
78;119;02082021180034
79;120;02082021180034
80;121;02082021180034
81;118;02082021180034
82;121;02082021180034
83;120;02082021180034
84;118;02082021180034
85;121;02082021180034
86;119;02082021180034
87;120;02082021180034
88;120;02082021180034
89;117;02082021180034
90;120;02082021180034
91;120;02082021180034
92;118;02082021180034
93;120;02082021180034
94;119;02082021180034
95;118;02082021180034
96;121;02082021180034
97;119;02082021180034
98;120;02082021180034
99;120;02082021180034
100;119;02082021180034
101;121;02082021180034
102;119;02082021180034
103;120;02082021180034
104;120;02082021180034
105;118;02082021180034
106;122;02082021180034
107;118;02082021180034
108;118;02082021180034
109;122;02082021180034
110;118;02082021180034
111;119;02082021180034
112;122;02082021180034
113;118;02082021180034
114;120;02082021180034
115;121;02082021180034
116;118;02082021180034
117;122;02082021180034
118;118;02082021180034
119;121;02082021180034
120;119;02082021180034
121;118;02082021180034
122;120;02082021180034
123;119;02082021180034
124;118;02082021180034
125;121;02082021180034
126;119;02082021180034
127;119;02082021180034
128;121;02082021180034
129;119;02082021180034
130;120;02082021180034
131;121;02082021180034
132;119;02082021180034
133;123;02082021180034
134;119;02082021180034
135;118;02082021180034
136;121;02082021180034
137;119;02082021180034
138;121;02082021180034
139;119;02082021180034
140;118;02082021180034
141;121;02082021180034
142;120;02082021180034
143;120;02082021180034
144;121;02082021180034
145;118;02082021180034
146;121;02082021180034
147;120;02082021180034
148;119;02082021180034
149;120;02082021180034
150;120;02082021180034
151;120;02082021180034
152;120;02082021180034
153;119;02082021180034
154;121;02082021180034
155;119;02082021180034
156;119;02082021180034
157;120;02082021180034
158;119;02082021180034
159;119;02082021180034
160;121;02082021180034
161;119;02082021180034
162;121;02082021180034
163;121;02082021180034
164;119;02082021180034
165;121;02082021180034
166;120;02082021180034
167;120;02082021180034
168;121;02082021180034
169;119;02082021180034
170;121;02082021180034
171;121;02082021180034
172;120;02082021180034
173;121;02082021180034
174;119;02082021180034
175;119;02082021180034
176;122;02082021180034
177;119;02082021180034
178;121;02082021180034
179;119;02082021180034
180;120;02082021180034
181;121;02082021180034
182;121;02082021180034
183;120;02082021180034
184;121;02082021180034
185;118;02082021180034
186;121;02082021180034
187;119;02082021180034
188;117;02082021180034
189;120;02082021180034
190;120;02082021180034
191;119;02082021180034
192;122;02082021180034
193;119;02082021180034
194;120;02082021180034
195;121;02082021180034
196;119;02082021180034
197;121;02082021180034
198;120;02082021180034
199;119;02082021180034
200;0;02082021180034
0;0;02082021180034
1;143;02082021180034
2;120;02082021180034
3;118;02082021180034
4;120;02082021180034
5;120;02082021180034
6;117;02082021180034
7;120;02082021180034
8;120;02082021180034
9;118;02082021180034
10;121;02082021180034
11;118;02082021180034
12;117;02082021180034
13;121;02082021180034
14;118;02082021180034
15;122;02082021180034
16;120;02082021180034
17;118;02082021180034
18;120;02082021180034
19;118;02082021180034
20;118;02082021180034
21;119;02082021180034
22;117;02082021180034
23;119;02082021180034
24;120;02082021180034
25;119;02082021180034
26;120;02082021180034
27;118;02082021180034
28;119;02082021180034
29;121;02082021180034
30;119;02082021180034
31;119;02082021180034
32;121;02082021180034
33;117;02082021180034
34;121;02082021180034
35;121;02082021180034
36;118;02082021180034
37;120;02082021180034
38;119;02082021180034
39;119;02082021180034
40;121;02082021180034
41;116;02082021180034
42;120;02082021180034
43;119;02082021180034
44;120;02082021180034
45;119;02082021180034
46;119;02082021180034
47;119;02082021180034
48;121;02082021180034
49;119;02082021180034
50;122;02082021180034
51;118;02082021180034
52;118;02082021180034
53;121;02082021180034
54;117;02082021180034
55;118;02082021180034
56;119;02082021180034
57;117;02082021180034
58;121;02082021180034
59;119;02082021180034
60;119;02082021180034
61;119;02082021180034
62;118;02082021180034
63;120;02082021180034
64;121;02082021180034
65;117;02082021180034
66;121;02082021180034
67;120;02082021180034
68;118;02082021180034
69;121;02082021180034
70;118;02082021180034
71;119;02082021180034
72;121;02082021180034
73;117;02082021180034
74;120;02082021180034
75;118;02082021180034
76;118;02082021180034
77;121;02082021180034
78;117;02082021180034
79;119;02082021180034
80;119;02082021180034
81;118;02082021180034
82;122;02082021180034
83;118;02082021180034
84;119;02082021180034
85;120;02082021180034
86;118;02082021180034
87;119;02082021180034
88;121;02082021180034
89;117;02082021180034
90;121;02082021180034
91;120;02082021180034
92;117;02082021180034
93;120;02082021180034
94;119;02082021180034
95;118;02082021180034
96;121;02082021180034
97;119;02082021180034
98;119;02082021180034
99;120;02082021180034
100;117;02082021180034
101;121;02082021180034
102;118;02082021180034
103;118;02082021180034
104;120;02082021180034
105;118;02082021180034
106;123;02082021180034
107;118;02082021180034
108;119;02082021180034
109;121;02082021180034
110;118;02082021180034
111;119;02082021180034
112;121;02082021180034
113;118;02082021180034
114;119;02082021180034
115;121;02082021180034
116;119;02082021180034
117;122;02082021180034
118;119;02082021180034
119;121;02082021180034
120;119;02082021180034
121;117;02082021180034
122;120;02082021180034
123;118;02082021180034
124;117;02082021180034
125;120;02082021180034
126;119;02082021180034
127;119;02082021180034
128;121;02082021180034
129;119;02082021180034
130;120;02082021180034
131;120;02082021180034
132;118;02082021180034
133;122;02082021180034
134;119;02082021180034
135;119;02082021180034
136;121;02082021180034
137;118;02082021180034
138;121;02082021180034
139;119;02082021180034
140;118;02082021180034
141;120;02082021180034
142;120;02082021180034
143;120;02082021180034
144;120;02082021180034
145;118;02082021180034
146;121;02082021180034
147;120;02082021180034
148;119;02082021180034
149;119;02082021180034
150;120;02082021180034
151;120;02082021180034
152;120;02082021180034
153;118;02082021180034
154;121;02082021180034
155;118;02082021180034
156;119;02082021180034
157;120;02082021180034
158;118;02082021180034
159;118;02082021180034
160;120;02082021180034
161;119;02082021180034
162;120;02082021180034
163;121;02082021180034
164;119;02082021180034
165;121;02082021180034
166;120;02082021180034
167;119;02082021180034
168;121;02082021180034
169;117;02082021180034
170;121;02082021180034
171;120;02082021180034
172;120;02082021180034
173;121;02082021180034
174;120;02082021180034
175;119;02082021180034
176;120;02082021180034
177;119;02082021180034
178;121;02082021180034
179;120;02082021180034
180;120;02082021180034
181;120;02082021180034
182;120;02082021180034
183;120;02082021180034
184;120;02082021180034
185;118;02082021180034
186;120;02082021180034
187;119;02082021180034
188;118;02082021180034
189;119;02082021180034
190;119;02082021180034
191;120;02082021180034
192;122;02082021180034
193;119;02082021180034
194;119;02082021180034
195;120;02082021180034
196;119;02082021180034
197;120;02082021180034
198;120;02082021180034
199;119;02082021180034
200;0;02082021180034
0;0;02082021180035
1;144;02082021180035
2;120;02082021180035
3;118;02082021180035
4;120;02082021180035
5;121;02082021180035
6;119;02082021180035
7;120;02082021180035
8;121;02082021180035
9;119;02082021180035
10;121;02082021180035
11;118;02082021180035
12;119;02082021180035
13;121;02082021180035
14;120;02082021180035
15;121;02082021180035
16;120;02082021180035
17;119;02082021180035
18;122;02082021180035
19;119;02082021180035
20;119;02082021180035
21;118;02082021180035
22;117;02082021180035
23;121;02082021180035
24;120;02082021180035
25;119;02082021180035
26;121;02082021180035
27;118;02082021180035
28;119;02082021180035
29;121;02082021180035
30;119;02082021180035
31;119;02082021180035
32;120;02082021180035
33;118;02082021180035
34;120;02082021180035
35;119;02082021180035
36;118;02082021180035
37;120;02082021180035
38;118;02082021180035
39;120;02082021180035
40;121;02082021180035
41;118;02082021180035
42;120;02082021180035
43;119;02082021180035
44;119;02082021180035
45;120;02082021180035
46;117;02082021180035
47;118;02082021180035
48;121;02082021180035
49;118;02082021180035
50;121;02082021180035
51;118;02082021180035
52;119;02082021180035
53;120;02082021180035
54;118;02082021180035
55;118;02082021180035
56;119;02082021180035
57;118;02082021180035
58;120;02082021180035
59;119;02082021180035
60;118;02082021180035
61;119;02082021180035
62;118;02082021180035
63;120;02082021180035
64;121;02082021180035
65;116;02082021180035
66;120;02082021180035
67;118;02082021180035
68;119;02082021180035
69;121;02082021180035
70;118;02082021180035
71;118;02082021180035
72;120;02082021180035
73;116;02082021180035
74;119;02082021180035
75;118;02082021180035
76;118;02082021180035
77;121;02082021180035
78;118;02082021180035
79;119;02082021180035
80;120;02082021180035
81;117;02082021180035
82;121;02082021180035
83;118;02082021180035
84;118;02082021180035
85;119;02082021180035
86;117;02082021180035
87;119;02082021180035
88;120;02082021180035
89;117;02082021180035
90;120;02082021180035
91;120;02082021180035
92;119;02082021180035
93;121;02082021180035
94;119;02082021180035
95;118;02082021180035
96;121;02082021180035
97;119;02082021180035
98;121;02082021180035
99;121;02082021180035
100;119;02082021180035
101;122;02082021180035
102;119;02082021180035
103;120;02082021180035
104;119;02082021180035
105;119;02082021180035
106;122;02082021180035
107;119;02082021180035
108;119;02082021180035
109;121;02082021180035
110;118;02082021180035
111;120;02082021180035
112;121;02082021180035
113;118;02082021180035
114;119;02082021180035
115;119;02082021180035
116;118;02082021180035
117;122;02082021180035
118;119;02082021180035
119;120;02082021180035
120;120;02082021180035
121;118;02082021180035
122;119;02082021180035
123;120;02082021180035
124;118;02082021180035
125;120;02082021180035
126;118;02082021180035
127;118;02082021180035
128;121;02082021180035
129;118;02082021180035
130;120;02082021180035
131;121;02082021180035
132;119;02082021180035
133;122;02082021180035
134;118;02082021180035
135;120;02082021180035
136;121;02082021180035
137;118;02082021180035
138;120;02082021180035
139;119;02082021180035
140;119;02082021180035
141;121;02082021180035
142;119;02082021180035
143;119;02082021180035
144;121;02082021180035
145;117;02082021180035
146;121;02082021180035
147;120;02082021180035
148;119;02082021180035
149;120;02082021180035
150;119;02082021180035
151;119;02082021180035
152;120;02082021180035
153;119;02082021180035
154;121;02082021180035
155;120;02082021180035
156;119;02082021180035
157;119;02082021180035
158;118;02082021180035
159;118;02082021180035
160;120;02082021180035
161;119;02082021180035
162;121;02082021180035
163;120;02082021180035
164;119;02082021180035
165;121;02082021180035
166;120;02082021180035
167;120;02082021180035
168;121;02082021180035
169;119;02082021180035
170;121;02082021180035
171;120;02082021180035
172;119;02082021180035
173;121;02082021180035
174;120;02082021180035
175;120;02082021180035
176;120;02082021180035
177;119;02082021180035
178;122;02082021180035
179;120;02082021180035
180;119;02082021180035
181;121;02082021180035
182;121;02082021180035
183;119;02082021180035
184;121;02082021180035
185;119;02082021180035
186;121;02082021180035
187;120;02082021180035
188;119;02082021180035
189;120;02082021180035
190;119;02082021180035
191;119;02082021180035
192;122;02082021180035
193;119;02082021180035
194;119;02082021180035
195;121;02082021180035
196;119;02082021180035
197;120;02082021180035
198;120;02082021180035
199;118;02082021180035
200;0;02082021180035
0;0;02082021180035
1;143;02082021180035
2;119;02082021180035
3;119;02082021180035
4;119;02082021180035
5;121;02082021180035
6;118;02082021180035
7;119;02082021180035
8;120;02082021180035
9;117;02082021180035
10;120;02082021180035
11;118;02082021180035
12;117;02082021180035
13;120;02082021180035
14;119;02082021180035
15;121;02082021180035
16;119;02082021180035
17;118;02082021180035
18;120;02082021180035
19;119;02082021180035
20;119;02082021180035
21;118;02082021180035
22;117;02082021180035
23;120;02082021180035
24;120;02082021180035
25;119;02082021180035
26;120;02082021180035
27;118;02082021180035
28;119;02082021180035
29;120;02082021180035
30;119;02082021180035
31;119;02082021180035
32;120;02082021180035
33;118;02082021180035
34;121;02082021180035
35;119;02082021180035
36;119;02082021180035
37;120;02082021180035
38;119;02082021180035
39;120;02082021180035
40;120;02082021180035
41;118;02082021180035
42;121;02082021180035
43;119;02082021180035
44;119;02082021180035
45;121;02082021180035
46;119;02082021180035
47;119;02082021180035
48;121;02082021180035
49;119;02082021180035
50;121;02082021180035
51;119;02082021180035
52;118;02082021180035
53;120;02082021180035
54;118;02082021180035
55;119;02082021180035
56;119;02082021180035
57;118;02082021180035
58;120;02082021180035
59;118;02082021180035
60;118;02082021180035
61;119;02082021180035
62;119;02082021180035
63;119;02082021180035
64;122;02082021180035
65;118;02082021180035
66;121;02082021180035
67;119;02082021180035
68;118;02082021180035
69;120;02082021180035
70;118;02082021180035
71;117;02082021180035
72;121;02082021180035
73;116;02082021180035
74;120;02082021180035
75;118;02082021180035
76;119;02082021180035
77;121;02082021180035
78;118;02082021180035
79;119;02082021180035
80;120;02082021180035
81;118;02082021180035
82;121;02082021180035
83;119;02082021180035
84;119;02082021180035
85;120;02082021180035
86;118;02082021180035
87;118;02082021180035
88;120;02082021180035
89;117;02082021180035
90;121;02082021180035
91;120;02082021180035
92;117;02082021180035
93;120;02082021180035
94;119;02082021180035
95;119;02082021180035
96;121;02082021180035
97;119;02082021180035
98;120;02082021180035
99;120;02082021180035
100;118;02082021180035
101;120;02082021180035
102;118;02082021180035
103;118;02082021180035
104;120;02082021180035
105;118;02082021180035
106;122;02082021180035
107;119;02082021180035
108;118;02082021180035
109;121;02082021180035
110;118;02082021180035
111;119;02082021180035
112;121;02082021180035
113;117;02082021180035
114;120;02082021180035
115;119;02082021180035
116;119;02082021180035
117;122;02082021180035
118;119;02082021180035
119;121;02082021180035
120;119;02082021180035
121;117;02082021180035
122;119;02082021180035
123;119;02082021180035
124;118;02082021180035
125;120;02082021180035
126;118;02082021180035
127;119;02082021180035
128;121;02082021180035
129;119;02082021180035
130;120;02082021180035
131;120;02082021180035
132;119;02082021180035
133;122;02082021180035
134;118;02082021180035
135;119;02082021180035
136;121;02082021180035
137;119;02082021180035
138;121;02082021180035
139;120;02082021180035
140;119;02082021180035
141;121;02082021180035
142;118;02082021180035
143;118;02082021180035
144;121;02082021180035
145;118;02082021180035
146;121;02082021180035
147;119;02082021180035
148;118;02082021180035
149;120;02082021180035
150;119;02082021180035
151;120;02082021180035
152;120;02082021180035
153;118;02082021180035
154;120;02082021180035
155;118;02082021180035
156;119;02082021180035
157;120;02082021180035
158;119;02082021180035
159;119;02082021180035
160;120;02082021180035
161;119;02082021180035
162;121;02082021180035
163;120;02082021180035
164;119;02082021180035
165;121;02082021180035
166;119;02082021180035
167;120;02082021180035
168;121;02082021180035
169;118;02082021180035
170;121;02082021180035
171;119;02082021180035
172;120;02082021180035
173;120;02082021180035
174;120;02082021180035
175;119;02082021180035
176;120;02082021180035
177;118;02082021180035
178;121;02082021180035
179;119;02082021180035
180;119;02082021180035
181;122;02082021180035
182;121;02082021180035
183;118;02082021180035
184;121;02082021180035
185;118;02082021180035
186;122;02082021180035
187;120;02082021180035
188;118;02082021180035
189;120;02082021180035
190;119;02082021180035
191;119;02082021180035
192;123;02082021180035
193;119;02082021180035
194;120;02082021180035
195;120;02082021180035
196;119;02082021180035
197;120;02082021180035
198;120;02082021180035
199;118;02082021180035
200;0;02082021180035
0;0;02082021180036
1;144;02082021180036
2;120;02082021180036
3;119;02082021180036
4;119;02082021180036
5;121;02082021180036
6;118;02082021180036
7;120;02082021180036
8;120;02082021180036
9;118;02082021180036
10;121;02082021180036
11;118;02082021180036
12;118;02082021180036
13;121;02082021180036
14;119;02082021180036
15;121;02082021180036
16;120;02082021180036
17;118;02082021180036
18;121;02082021180036
19;119;02082021180036
20;118;02082021180036
21;118;02082021180036
22;117;02082021180036
23;120;02082021180036
24;120;02082021180036
25;118;02082021180036
26;120;02082021180036
27;119;02082021180036
28;119;02082021180036
29;121;02082021180036
30;119;02082021180036
31;119;02082021180036
32;120;02082021180036
33;118;02082021180036
34;121;02082021180036
35;119;02082021180036
36;118;02082021180036
37;120;02082021180036
38;118;02082021180036
39;119;02082021180036
40;120;02082021180036
41;118;02082021180036
42;120;02082021180036
43;120;02082021180036
44;119;02082021180036
45;119;02082021180036
46;117;02082021180036
47;118;02082021180036
48;121;02082021180036
49;118;02082021180036
50;121;02082021180036
51;119;02082021180036
52;118;02082021180036
53;120;02082021180036
54;118;02082021180036
55;118;02082021180036
56;120;02082021180036
57;118;02082021180036
58;121;02082021180036
59;118;02082021180036
60;119;02082021180036
61;119;02082021180036
62;118;02082021180036
63;120;02082021180036
64;121;02082021180036
65;118;02082021180036
66;121;02082021180036
67;119;02082021180036
68;118;02082021180036
69;120;02082021180036
70;118;02082021180036
71;118;02082021180036
72;120;02082021180036
73;116;02082021180036
74;120;02082021180036
75;118;02082021180036
76;118;02082021180036
77;120;02082021180036
78;118;02082021180036
79;120;02082021180036
80;120;02082021180036
81;118;02082021180036
82;120;02082021180036
83;119;02082021180036
84;119;02082021180036
85;120;02082021180036
86;118;02082021180036
87;120;02082021180036
88;121;02082021180036
89;117;02082021180036
90;121;02082021180036
91;120;02082021180036
92;118;02082021180036
93;120;02082021180036
94;119;02082021180036
95;119;02082021180036
96;121;02082021180036
97;119;02082021180036
98;120;02082021180036
99;119;02082021180036
100;118;02082021180036
101;121;02082021180036
102;119;02082021180036
103;119;02082021180036
104;120;02082021180036
105;117;02082021180036
106;120;02082021180036
107;118;02082021180036
108;119;02082021180036
109;121;02082021180036
110;117;02082021180036
111;119;02082021180036
112;121;02082021180036
113;116;02082021180036
114;119;02082021180036
115;120;02082021180036
116;118;02082021180036
117;123;02082021180036
118;118;02082021180036
119;120;02082021180036
120;118;02082021180036
121;117;02082021180036
122;120;02082021180036
123;120;02082021180036
124;118;02082021180036
125;121;02082021180036
126;118;02082021180036
127;119;02082021180036
128;121;02082021180036
129;119;02082021180036
130;121;02082021180036
131;121;02082021180036
132;119;02082021180036
133;122;02082021180036
134;119;02082021180036
135;119;02082021180036
136;122;02082021180036
137;118;02082021180036
138;121;02082021180036
139;120;02082021180036
140;118;02082021180036
141;122;02082021180036
142;119;02082021180036
143;119;02082021180036
144;121;02082021180036
145;118;02082021180036
146;121;02082021180036
147;120;02082021180036
148;118;02082021180036
149;120;02082021180036
150;120;02082021180036
151;120;02082021180036
152;121;02082021180036
153;118;02082021180036
154;120;02082021180036
155;119;02082021180036
156;119;02082021180036
157;120;02082021180036
158;119;02082021180036
159;119;02082021180036
160;120;02082021180036
161;119;02082021180036
162;120;02082021180036
163;120;02082021180036
164;119;02082021180036
165;121;02082021180036
166;120;02082021180036
167;120;02082021180036
168;120;02082021180036
169;119;02082021180036
170;121;02082021180036
171;121;02082021180036
172;119;02082021180036
173;121;02082021180036
174;119;02082021180036
175;118;02082021180036
176;121;02082021180036
177;119;02082021180036
178;121;02082021180036
179;119;02082021180036
180;119;02082021180036
181;121;02082021180036
182;120;02082021180036
183;119;02082021180036
184;120;02082021180036
185;118;02082021180036
186;121;02082021180036
187;120;02082021180036
188;118;02082021180036
189;120;02082021180036
190;118;02082021180036
191;119;02082021180036
192;122;02082021180036
193;120;02082021180036
194;120;02082021180036
195;120;02082021180036
196;119;02082021180036
197;120;02082021180036
198;120;02082021180036
199;119;02082021180036
200;0;02082021180036
0;0;02082021180036
1;143;02082021180036
2;120;02082021180036
3;119;02082021180036
4;120;02082021180036
5;120;02082021180036
6;117;02082021180036
7;119;02082021180036
8;120;02082021180036
9;118;02082021180036
10;121;02082021180036
11;118;02082021180036
12;118;02082021180036
13;121;02082021180036
14;118;02082021180036
15;120;02082021180036
16;120;02082021180036
17;117;02082021180036
18;121;02082021180036
19;119;02082021180036
20;118;02082021180036
21;119;02082021180036
22;117;02082021180036
23;119;02082021180036
24;120;02082021180036
25;118;02082021180036
26;121;02082021180036
27;119;02082021180036
28;120;02082021180036
29;120;02082021180036
30;119;02082021180036
31;118;02082021180036
32;120;02082021180036
33;117;02082021180036
34;120;02082021180036
35;119;02082021180036
36;118;02082021180036
37;121;02082021180036
38;117;02082021180036
39;119;02082021180036
40;119;02082021180036
41;117;02082021180036
42;120;02082021180036
43;120;02082021180036
44;119;02082021180036
45;120;02082021180036
46;117;02082021180036
47;119;02082021180036
48;120;02082021180036
49;117;02082021180036
50;121;02082021180036
51;119;02082021180036
52;118;02082021180036
53;120;02082021180036
54;118;02082021180036
55;116;02082021180036
56;119;02082021180036
57;117;02082021180036
58;120;02082021180036
59;119;02082021180036
60;119;02082021180036
61;119;02082021180036
62;118;02082021180036
63;119;02082021180036
64;120;02082021180036
65;117;02082021180036
66;120;02082021180036
67;119;02082021180036
68;117;02082021180036
69;121;02082021180036
70;118;02082021180036
71;118;02082021180036
72;120;02082021180036
73;116;02082021180036
74;120;02082021180036
75;117;02082021180036
76;118;02082021180036
77;120;02082021180036
78;118;02082021180036
79;119;02082021180036
80;120;02082021180036
81;118;02082021180036
82;121;02082021180036
83;119;02082021180036
84;119;02082021180036
85;119;02082021180036
86;118;02082021180036
87;119;02082021180036
88;120;02082021180036
89;118;02082021180036
90;120;02082021180036
91;119;02082021180036
92;117;02082021180036
93;120;02082021180036
94;119;02082021180036
95;118;02082021180036
96;121;02082021180036
97;119;02082021180036
98;119;02082021180036
99;119;02082021180036
100;118;02082021180036
101;121;02082021180036
102;119;02082021180036
103;119;02082021180036
104;119;02082021180036
105;117;02082021180036
106;121;02082021180036
107;119;02082021180036
108;118;02082021180036
109;121;02082021180036
110;117;02082021180036
111;118;02082021180036
112;121;02082021180036
113;116;02082021180036
114;119;02082021180036
115;120;02082021180036
116;118;02082021180036
117;122;02082021180036
118;118;02082021180036
119;119;02082021180036
120;119;02082021180036
121;118;02082021180036
122;119;02082021180036
123;119;02082021180036
124;117;02082021180036
125;120;02082021180036
126;119;02082021180036
127;119;02082021180036
128;121;02082021180036
129;118;02082021180036
130;119;02082021180036
131;120;02082021180036
132;118;02082021180036
133;122;02082021180036
134;118;02082021180036
135;119;02082021180036
136;120;02082021180036
137;118;02082021180036
138;120;02082021180036
139;120;02082021180036
140;117;02082021180036
141;121;02082021180036
142;119;02082021180036
143;118;02082021180036
144;120;02082021180036
145;117;02082021180036
146;120;02082021180036
147;120;02082021180036
148;118;02082021180036
149;120;02082021180036
150;119;02082021180036
151;119;02082021180036
152;120;02082021180036
153;119;02082021180036
154;120;02082021180036
155;119;02082021180036
156;118;02082021180036
157;119;02082021180036
158;119;02082021180036
159;119;02082021180036
160;121;02082021180036
161;118;02082021180036
162;120;02082021180036
163;118;02082021180036
164;119;02082021180036
165;121;02082021180036
166;118;02082021180036
167;119;02082021180036
168;121;02082021180036
169;118;02082021180036
170;120;02082021180036
171;120;02082021180036
172;119;02082021180036
173;121;02082021180036
174;119;02082021180036
175;118;02082021180036
176;120;02082021180036
177;118;02082021180036
178;121;02082021180036
179;120;02082021180036
180;120;02082021180036
181;121;02082021180036
182;119;02082021180036
183;119;02082021180036
184;119;02082021180036
185;118;02082021180036
186;121;02082021180036
187;120;02082021180036
188;118;02082021180036
189;120;02082021180036
190;118;02082021180036
191;119;02082021180036
192;122;02082021180036
193;119;02082021180036
194;119;02082021180036
195;119;02082021180036
196;118;02082021180036
197;121;02082021180036
198;120;02082021180036
199;118;02082021180036
200;0;02082021180036
0;0;02082021180037
1;143;02082021180037
2;119;02082021180037
3;120;02082021180037
4;119;02082021180037
5;120;02082021180037
6;118;02082021180037
7;119;02082021180037
8;119;02082021180037
9;117;02082021180037
10;120;02082021180037
11;118;02082021180037
12;117;02082021180037
13;121;02082021180037
14;119;02082021180037
15;121;02082021180037
16;120;02082021180037
17;117;02082021180037
18;120;02082021180037
19;118;02082021180037
20;118;02082021180037
21;120;02082021180037
22;117;02082021180037
23;119;02082021180037
24;120;02082021180037
25;119;02082021180037
26;120;02082021180037
27;118;02082021180037
28;119;02082021180037
29;121;02082021180037
30;119;02082021180037
31;119;02082021180037
32;120;02082021180037
33;118;02082021180037
34;120;02082021180037
35;119;02082021180037
36;118;02082021180037
37;121;02082021180037
38;119;02082021180037
39;119;02082021180037
40;120;02082021180037
41;118;02082021180037
42;120;02082021180037
43;118;02082021180037
44;119;02082021180037
45;119;02082021180037
46;117;02082021180037
47;119;02082021180037
48;120;02082021180037
49;118;02082021180037
50;120;02082021180037
51;118;02082021180037
52;117;02082021180037
53;120;02082021180037
54;118;02082021180037
55;118;02082021180037
56;120;02082021180037
57;118;02082021180037
58;119;02082021180037
59;118;02082021180037
60;118;02082021180037
61;119;02082021180037
62;118;02082021180037
63;120;02082021180037
64;122;02082021180037
65;118;02082021180037
66;121;02082021180037
67;118;02082021180037
68;118;02082021180037
69;121;02082021180037
70;118;02082021180037
71;118;02082021180037
72;120;02082021180037
73;117;02082021180037
74;121;02082021180037
75;118;02082021180037
76;118;02082021180037
77;120;02082021180037
78;118;02082021180037
79;118;02082021180037
80;120;02082021180037
81;117;02082021180037
82;121;02082021180037
83;119;02082021180037
84;119;02082021180037
85;119;02082021180037
86;117;02082021180037
87;119;02082021180037
88;120;02082021180037
89;117;02082021180037
90;120;02082021180037
91;119;02082021180037
92;117;02082021180037
93;120;02082021180037
94;119;02082021180037
95;118;02082021180037
96;121;02082021180037
97;119;02082021180037
98;119;02082021180037
99;118;02082021180037
100;117;02082021180037
101;120;02082021180037
102;119;02082021180037
103;119;02082021180037
104;120;02082021180037
105;117;02082021180037
106;120;02082021180037
107;119;02082021180037
108;119;02082021180037
109;121;02082021180037
110;117;02082021180037
111;118;02082021180037
112;120;02082021180037
113;118;02082021180037
114;119;02082021180037
115;119;02082021180037
116;118;02082021180037
117;122;02082021180037
118;119;02082021180037
119;119;02082021180037
120;119;02082021180037
121;118;02082021180037
122;119;02082021180037
123;119;02082021180037
124;118;02082021180037
125;120;02082021180037
126;119;02082021180037
127;119;02082021180037
128;121;02082021180037
129;118;02082021180037
130;119;02082021180037
131;120;02082021180037
132;118;02082021180037
133;122;02082021180037
134;119;02082021180037
135;119;02082021180037
136;121;02082021180037
137;118;02082021180037
138;120;02082021180037
139;119;02082021180037
140;117;02082021180037
141;120;02082021180037
142;118;02082021180037
143;118;02082021180037
144;121;02082021180037
145;118;02082021180037
146;121;02082021180037
147;119;02082021180037
148;118;02082021180037
149;119;02082021180037
150;119;02082021180037
151;119;02082021180037
152;120;02082021180037
153;118;02082021180037
154;121;02082021180037
155;118;02082021180037
156;118;02082021180037
157;120;02082021180037
158;118;02082021180037
159;119;02082021180037
160;121;02082021180037
161;119;02082021180037
162;120;02082021180037
163;120;02082021180037
164;118;02082021180037
165;121;02082021180037
166;120;02082021180037
167;120;02082021180037
168;121;02082021180037
169;118;02082021180037
170;120;02082021180037
171;119;02082021180037
172;118;02082021180037
173;121;02082021180037
174;120;02082021180037
175;118;02082021180037
176;120;02082021180037
177;118;02082021180037
178;121;02082021180037
179;121;02082021180037
180;119;02082021180037
181;121;02082021180037
182;120;02082021180037
183;119;02082021180037
184;120;02082021180037
185;118;02082021180037
186;121;02082021180037
187;121;02082021180037
188;117;02082021180037
189;120;02082021180037
190;120;02082021180037
191;119;02082021180037
192;122;02082021180037
193;119;02082021180037
194;120;02082021180037
195;120;02082021180037
196;118;02082021180037
197;120;02082021180037
198;120;02082021180037
199;119;02082021180037
200;0;02082021180037
