ind;val;datetime
0;0;17062021165954
1;159;17062021165954
2;205;17062021165954
3;186;17062021165954
4;196;17062021165954
5;187;17062021165954
6;195;17062021165954
7;204;17062021165954
8;205;17062021165954
9;191;17062021165954
10;201;17062021165954
11;206;17062021165954
12;198;17062021165954
13;210;17062021165954
14;208;17062021165954
15;217;17062021165954
16;224;17062021165954
17;235;17062021165954
18;280;17062021165954
19;364;17062021165954
20;528;17062021165954
21;911;17062021165954
22;1023;17062021165954
23;1023;17062021165954
24;1023;17062021165954
25;1023;17062021165954
26;1023;17062021165954
27;1023;17062021165954
28;1023;17062021165954
29;1023;17062021165954
30;1023;17062021165954
31;1023;17062021165954
32;1023;17062021165954
33;1023;17062021165954
34;1023;17062021165954
35;884;17062021165954
36;680;17062021165954
37;552;17062021165954
38;443;17062021165954
39;391;17062021165954
40;338;17062021165954
41;312;17062021165954
42;307;17062021165954
43;305;17062021165954
44;315;17062021165954
45;354;17062021165954
46;350;17062021165954
47;340;17062021165954
48;322;17062021165954
49;310;17062021165954
50;292;17062021165954
51;277;17062021165954
52;263;17062021165954
53;251;17062021165954
54;238;17062021165954
55;235;17062021165954
56;232;17062021165954
57;235;17062021165954
58;235;17062021165954
59;239;17062021165954
60;243;17062021165954
61;244;17062021165954
62;245;17062021165954
63;232;17062021165954
64;251;17062021165954
65;228;17062021165954
66;225;17062021165954
67;228;17062021165954
68;228;17062021165954
69;225;17062021165954
70;232;17062021165954
71;217;17062021165954
72;220;17062021165954
73;224;17062021165954
74;222;17062021165954
75;227;17062021165954
76;218;17062021165954
77;216;17062021165954
78;222;17062021165954
79;241;17062021165954
80;218;17062021165954
81;203;17062021165954
82;206;17062021165954
83;202;17062021165954
84;196;17062021165954
85;200;17062021165954
86;211;17062021165954
87;214;17062021165954
88;193;17062021165954
89;183;17062021165954
90;201;17062021165954
91;183;17062021165954
92;187;17062021165954
93;201;17062021165954
94;193;17062021165954
95;183;17062021165954
96;183;17062021165954
97;182;17062021165954
98;177;17062021165954
99;183;17062021165954
100;174;17062021165954
101;201;17062021165954
102;200;17062021165954
103;179;17062021165954
104;183;17062021165954
105;177;17062021165954
106;175;17062021165954
107;175;17062021165954
108;184;17062021165954
109;179;17062021165954
110;171;17062021165954
111;168;17062021165954
112;172;17062021165954
113;171;17062021165954
114;169;17062021165954
115;176;17062021165954
116;184;17062021165954
117;176;17062021165954
118;172;17062021165954
119;185;17062021165954
120;177;17062021165954
121;172;17062021165954
122;177;17062021165954
123;172;17062021165954
124;185;17062021165954
125;172;17062021165954
126;171;17062021165954
127;184;17062021165954
128;191;17062021165954
129;180;17062021165954
130;176;17062021165954
131;173;17062021165954
132;168;17062021165954
133;199;17062021165954
134;171;17062021165954
135;175;17062021165954
136;173;17062021165954
137;173;17062021165954
138;186;17062021165954
139;175;17062021165954
140;180;17062021165954
141;186;17062021165954
142;179;17062021165954
143;169;17062021165954
144;182;17062021165954
145;178;17062021165954
146;176;17062021165954
147;190;17062021165954
148;175;17062021165954
149;184;17062021165954
150;190;17062021165954
151;188;17062021165954
152;172;17062021165954
153;178;17062021165954
154;179;17062021165954
155;194;17062021165954
156;185;17062021165954
157;173;17062021165954
158;174;17062021165954
159;172;17062021165954
160;169;17062021165954
161;177;17062021165954
162;175;17062021165954
163;183;17062021165954
164;186;17062021165954
165;183;17062021165954
166;174;17062021165954
167;186;17062021165954
168;189;17062021165954
169;169;17062021165954
170;181;17062021165954
171;172;17062021165954
172;172;17062021165954
173;189;17062021165954
174;173;17062021165954
175;177;17062021165954
176;181;17062021165954
177;173;17062021165954
178;189;17062021165954
179;182;17062021165954
180;176;17062021165954
181;175;17062021165954
182;190;17062021165954
183;176;17062021165954
184;177;17062021165954
185;170;17062021165954
186;185;17062021165954
187;177;17062021165954
188;183;17062021165954
189;184;17062021165954
190;173;17062021165954
191;190;17062021165954
192;187;17062021165954
193;175;17062021165954
194;195;17062021165954
195;180;17062021165954
196;179;17062021165954
197;174;17062021165954
198;183;17062021165954
199;176;17062021165954
200;0;17062021165954
0;0;17062021165956
1;159;17062021165956
2;202;17062021165956
3;185;17062021165956
4;195;17062021165956
5;187;17062021165956
6;194;17062021165956
7;204;17062021165956
8;204;17062021165956
9;190;17062021165956
10;199;17062021165956
11;203;17062021165956
12;197;17062021165956
13;211;17062021165956
14;206;17062021165956
15;217;17062021165956
16;222;17062021165956
17;234;17062021165956
18;277;17062021165956
19;364;17062021165956
20;523;17062021165956
21;908;17062021165956
22;1023;17062021165956
23;1023;17062021165956
24;1023;17062021165956
25;1023;17062021165956
26;1023;17062021165956
27;1023;17062021165956
28;1023;17062021165956
29;1023;17062021165956
30;1023;17062021165956
31;1023;17062021165956
32;1023;17062021165956
33;1023;17062021165956
34;1023;17062021165956
35;896;17062021165956
36;685;17062021165956
37;553;17062021165956
38;448;17062021165956
39;395;17062021165956
40;343;17062021165956
41;314;17062021165956
42;306;17062021165956
43;300;17062021165956
44;315;17062021165956
45;356;17062021165956
46;348;17062021165956
47;342;17062021165956
48;322;17062021165956
49;312;17062021165956
50;291;17062021165956
51;280;17062021165956
52;264;17062021165956
53;250;17062021165956
54;238;17062021165956
55;236;17062021165956
56;236;17062021165956
57;234;17062021165956
58;235;17062021165956
59;241;17062021165956
60;242;17062021165956
61;243;17062021165956
62;241;17062021165956
63;233;17062021165956
64;247;17062021165956
65;225;17062021165956
66;227;17062021165956
67;227;17062021165956
68;226;17062021165956
69;224;17062021165956
70;232;17062021165956
71;219;17062021165956
72;221;17062021165956
73;225;17062021165956
74;220;17062021165956
75;225;17062021165956
76;222;17062021165956
77;215;17062021165956
78;223;17062021165956
79;239;17062021165956
80;217;17062021165956
81;200;17062021165956
82;205;17062021165956
83;202;17062021165956
84;198;17062021165956
85;199;17062021165956
86;213;17062021165956
87;212;17062021165956
88;193;17062021165956
89;182;17062021165956
90;200;17062021165956
91;184;17062021165956
92;187;17062021165956
93;201;17062021165956
94;192;17062021165956
95;182;17062021165956
96;185;17062021165956
97;182;17062021165956
98;175;17062021165956
99;182;17062021165956
100;173;17062021165956
101;201;17062021165956
102;199;17062021165956
103;178;17062021165956
104;182;17062021165956
105;179;17062021165956
106;173;17062021165956
107;174;17062021165956
108;185;17062021165956
109;177;17062021165956
110;172;17062021165956
111;168;17062021165956
112;170;17062021165956
113;170;17062021165956
114;168;17062021165956
115;175;17062021165956
116;184;17062021165956
117;177;17062021165956
118;173;17062021165956
119;185;17062021165956
120;177;17062021165956
121;171;17062021165956
122;176;17062021165956
123;170;17062021165956
124;184;17062021165956
125;171;17062021165956
126;169;17062021165956
127;182;17062021165956
128;190;17062021165956
129;182;17062021165956
130;176;17062021165956
131;171;17062021165956
132;168;17062021165956
133;200;17062021165956
134;174;17062021165956
135;174;17062021165956
136;173;17062021165956
137;171;17062021165956
138;185;17062021165956
139;171;17062021165956
140;179;17062021165956
141;185;17062021165956
142;179;17062021165956
143;168;17062021165956
144;181;17062021165956
145;178;17062021165956
146;177;17062021165956
147;190;17062021165956
148;175;17062021165956
149;182;17062021165956
150;188;17062021165956
151;187;17062021165956
152;173;17062021165956
153;177;17062021165956
154;179;17062021165956
155;194;17062021165956
156;181;17062021165956
157;174;17062021165956
158;174;17062021165956
159;171;17062021165956
160;169;17062021165956
161;174;17062021165956
162;175;17062021165956
163;180;17062021165956
164;185;17062021165956
165;183;17062021165956
166;173;17062021165956
167;184;17062021165956
168;188;17062021165956
169;167;17062021165956
170;180;17062021165956
171;172;17062021165956
172;172;17062021165956
173;187;17062021165956
174;173;17062021165956
175;177;17062021165956
176;179;17062021165956
177;173;17062021165956
178;188;17062021165956
179;181;17062021165956
180;176;17062021165956
181;173;17062021165956
182;191;17062021165956
183;174;17062021165956
184;178;17062021165956
185;168;17062021165956
186;183;17062021165956
187;175;17062021165956
188;182;17062021165956
189;184;17062021165956
190;171;17062021165956
191;189;17062021165956
192;185;17062021165956
193;172;17062021165956
194;196;17062021165956
195;179;17062021165956
196;180;17062021165956
197;173;17062021165956
198;182;17062021165956
199;174;17062021165956
200;0;17062021165956
0;0;17062021170000
1;162;17062021170000
2;206;17062021170000
3;189;17062021170000
4;199;17062021170000
5;190;17062021170000
6;199;17062021170000
7;206;17062021170000
8;208;17062021170000
9;191;17062021170000
10;202;17062021170000
11;207;17062021170000
12;200;17062021170000
13;214;17062021170000
14;208;17062021170000
15;218;17062021170000
16;222;17062021170000
17;231;17062021170000
18;274;17062021170000
19;352;17062021170000
20;500;17062021170000
21;867;17062021170000
22;1023;17062021170000
23;1023;17062021170000
24;1023;17062021170000
25;1023;17062021170000
26;1023;17062021170000
27;1023;17062021170000
28;1023;17062021170000
29;1023;17062021170000
30;1023;17062021170000
31;1023;17062021170000
32;1023;17062021170000
33;1023;17062021170000
34;1023;17062021170000
35;832;17062021170000
36;643;17062021170000
37;522;17062021170000
38;422;17062021170000
39;377;17062021170000
40;331;17062021170000
41;305;17062021170000
42;296;17062021170000
43;294;17062021170000
44;309;17062021170000
45;351;17062021170000
46;341;17062021170000
47;330;17062021170000
48;311;17062021170000
49;302;17062021170000
50;286;17062021170000
51;273;17062021170000
52;260;17062021170000
53;249;17062021170000
54;235;17062021170000
55;234;17062021170000
56;233;17062021170000
57;232;17062021170000
58;234;17062021170000
59;240;17062021170000
60;240;17062021170000
61;243;17062021170000
62;243;17062021170000
63;232;17062021170000
64;249;17062021170000
65;227;17062021170000
66;227;17062021170000
67;226;17062021170000
68;228;17062021170000
69;225;17062021170000
70;232;17062021170000
71;215;17062021170000
72;219;17062021170000
73;224;17062021170000
74;221;17062021170000
75;226;17062021170000
76;220;17062021170000
77;217;17062021170000
78;222;17062021170000
79;239;17062021170000
80;218;17062021170000
81;200;17062021170000
82;206;17062021170000
83;201;17062021170000
84;201;17062021170000
85;199;17062021170000
86;214;17062021170000
87;214;17062021170000
88;192;17062021170000
89;183;17062021170000
90;202;17062021170000
91;182;17062021170000
92;189;17062021170000
93;202;17062021170000
94;197;17062021170000
95;186;17062021170000
96;187;17062021170000
97;185;17062021170000
98;177;17062021170000
99;187;17062021170000
100;175;17062021170000
101;204;17062021170000
102;202;17062021170000
103;183;17062021170000
104;187;17062021170000
105;180;17062021170000
106;178;17062021170000
107;178;17062021170000
108;184;17062021170000
109;181;17062021170000
110;175;17062021170000
111;172;17062021170000
112;172;17062021170000
113;174;17062021170000
114;170;17062021170000
115;177;17062021170000
116;187;17062021170000
117;179;17062021170000
118;176;17062021170000
119;187;17062021170000
120;178;17062021170000
121;175;17062021170000
122;179;17062021170000
123;174;17062021170000
124;188;17062021170000
125;174;17062021170000
126;173;17062021170000
127;185;17062021170000
128;191;17062021170000
129;184;17062021170000
130;178;17062021170000
131;175;17062021170000
132;171;17062021170000
133;203;17062021170000
134;173;17062021170000
135;179;17062021170000
136;177;17062021170000
137;175;17062021170000
138;188;17062021170000
139;175;17062021170000
140;183;17062021170000
141;186;17062021170000
142;181;17062021170000
143;170;17062021170000
144;185;17062021170000
145;181;17062021170000
146;178;17062021170000
147;191;17062021170000
148;178;17062021170000
149;187;17062021170000
150;192;17062021170000
151;191;17062021170000
152;176;17062021170000
153;178;17062021170000
154;181;17062021170000
155;200;17062021170000
156;188;17062021170000
157;178;17062021170000
158;177;17062021170000
159;174;17062021170000
160;172;17062021170000
161;178;17062021170000
162;177;17062021170000
163;184;17062021170000
164;188;17062021170000
165;188;17062021170000
166;175;17062021170000
167;185;17062021170000
168;191;17062021170000
169;171;17062021170000
170;185;17062021170000
171;176;17062021170000
172;176;17062021170000
173;190;17062021170000
174;176;17062021170000
175;181;17062021170000
176;182;17062021170000
177;176;17062021170000
178;192;17062021170000
179;184;17062021170000
180;180;17062021170000
181;177;17062021170000
182;194;17062021170000
183;178;17062021170000
184;179;17062021170000
185;172;17062021170000
186;187;17062021170000
187;180;17062021170000
188;186;17062021170000
189;189;17062021170000
190;175;17062021170000
191;192;17062021170000
192;189;17062021170000
193;177;17062021170000
194;199;17062021170000
195;183;17062021170000
196;182;17062021170000
197;176;17062021170000
198;186;17062021170000
199;178;17062021170000
200;0;17062021170000
0;0;17062021170002
1;161;17062021170002
2;203;17062021170002
3;186;17062021170002
4;198;17062021170002
5;188;17062021170002
6;197;17062021170002
7;205;17062021170002
8;206;17062021170002
9;193;17062021170002
10;203;17062021170002
11;207;17062021170002
12;200;17062021170002
13;214;17062021170002
14;207;17062021170002
15;218;17062021170002
16;222;17062021170002
17;231;17062021170002
18;275;17062021170002
19;361;17062021170002
20;510;17062021170002
21;878;17062021170002
22;1023;17062021170002
23;1023;17062021170002
24;1023;17062021170002
25;1023;17062021170002
26;1023;17062021170002
27;1023;17062021170002
28;1023;17062021170002
29;1023;17062021170002
30;1023;17062021170002
31;1023;17062021170002
32;1023;17062021170002
33;1023;17062021170002
34;1023;17062021170002
35;862;17062021170002
36;665;17062021170002
37;530;17062021170002
38;430;17062021170002
39;383;17062021170002
40;334;17062021170002
41;309;17062021170002
42;299;17062021170002
43;296;17062021170002
44;310;17062021170002
45;347;17062021170002
46;341;17062021170002
47;334;17062021170002
48;315;17062021170002
49;303;17062021170002
50;288;17062021170002
51;275;17062021170002
52;262;17062021170002
53;249;17062021170002
54;234;17062021170002
55;234;17062021170002
56;231;17062021170002
57;233;17062021170002
58;232;17062021170002
59;235;17062021170002
60;240;17062021170002
61;242;17062021170002
62;242;17062021170002
63;231;17062021170002
64;247;17062021170002
65;222;17062021170002
66;228;17062021170002
67;225;17062021170002
68;226;17062021170002
69;221;17062021170002
70;232;17062021170002
71;218;17062021170002
72;218;17062021170002
73;225;17062021170002
74;220;17062021170002
75;226;17062021170002
76;220;17062021170002
77;216;17062021170002
78;223;17062021170002
79;237;17062021170002
80;216;17062021170002
81;201;17062021170002
82;208;17062021170002
83;203;17062021170002
84;198;17062021170002
85;201;17062021170002
86;211;17062021170002
87;215;17062021170002
88;194;17062021170002
89;183;17062021170002
90;199;17062021170002
91;184;17062021170002
92;188;17062021170002
93;203;17062021170002
94;193;17062021170002
95;184;17062021170002
96;185;17062021170002
97;182;17062021170002
98;177;17062021170002
99;186;17062021170002
100;174;17062021170002
101;200;17062021170002
102;200;17062021170002
103;180;17062021170002
104;184;17062021170002
105;179;17062021170002
106;176;17062021170002
107;176;17062021170002
108;184;17062021170002
109;180;17062021170002
110;175;17062021170002
111;171;17062021170002
112;171;17062021170002
113;172;17062021170002
114;171;17062021170002
115;177;17062021170002
116;187;17062021170002
117;179;17062021170002
118;173;17062021170002
119;187;17062021170002
120;177;17062021170002
121;173;17062021170002
122;176;17062021170002
123;172;17062021170002
124;186;17062021170002
125;172;17062021170002
126;172;17062021170002
127;186;17062021170002
128;192;17062021170002
129;181;17062021170002
130;178;17062021170002
131;174;17062021170002
132;170;17062021170002
133;200;17062021170002
134;173;17062021170002
135;176;17062021170002
136;176;17062021170002
137;174;17062021170002
138;187;17062021170002
139;174;17062021170002
140;184;17062021170002
141;186;17062021170002
142;179;17062021170002
143;171;17062021170002
144;184;17062021170002
145;179;17062021170002
146;178;17062021170002
147;190;17062021170002
148;177;17062021170002
149;186;17062021170002
150;191;17062021170002
151;189;17062021170002
152;176;17062021170002
153;177;17062021170002
154;182;17062021170002
155;195;17062021170002
156;185;17062021170002
157;176;17062021170002
158;176;17062021170002
159;174;17062021170002
160;171;17062021170002
161;177;17062021170002
162;177;17062021170002
163;183;17062021170002
164;186;17062021170002
165;185;17062021170002
166;175;17062021170002
167;186;17062021170002
168;189;17062021170002
169;169;17062021170002
170;182;17062021170002
171;176;17062021170002
172;174;17062021170002
173;189;17062021170002
174;174;17062021170002
175;178;17062021170002
176;183;17062021170002
177;176;17062021170002
178;191;17062021170002
179;183;17062021170002
180;179;17062021170002
181;176;17062021170002
182;192;17062021170002
183;177;17062021170002
184;178;17062021170002
185;171;17062021170002
186;186;17062021170002
187;178;17062021170002
188;185;17062021170002
189;186;17062021170002
190;174;17062021170002
191;192;17062021170002
192;187;17062021170002
193;175;17062021170002
194;198;17062021170002
195;180;17062021170002
196;182;17062021170002
197;175;17062021170002
198;184;17062021170002
199;179;17062021170002
200;0;17062021170002
0;0;17062021170005
1;161;17062021170005
2;203;17062021170005
3;185;17062021170005
4;196;17062021170005
5;188;17062021170005
6;199;17062021170005
7;206;17062021170005
8;206;17062021170005
9;192;17062021170005
10;201;17062021170005
11;206;17062021170005
12;200;17062021170005
13;211;17062021170005
14;206;17062021170005
15;216;17062021170005
16;222;17062021170005
17;233;17062021170005
18;276;17062021170005
19;359;17062021170005
20;511;17062021170005
21;883;17062021170005
22;1023;17062021170005
23;1023;17062021170005
24;1023;17062021170005
25;1023;17062021170005
26;1023;17062021170005
27;1023;17062021170005
28;1023;17062021170005
29;1023;17062021170005
30;1023;17062021170005
31;1023;17062021170005
32;1023;17062021170005
33;1023;17062021170005
34;1023;17062021170005
35;865;17062021170005
36;666;17062021170005
37;538;17062021170005
38;437;17062021170005
39;384;17062021170005
40;334;17062021170005
41;311;17062021170005
42;299;17062021170005
43;296;17062021170005
44;312;17062021170005
45;352;17062021170005
46;345;17062021170005
47;338;17062021170005
48;315;17062021170005
49;304;17062021170005
50;289;17062021170005
51;279;17062021170005
52;261;17062021170005
53;251;17062021170005
54;236;17062021170005
55;236;17062021170005
56;233;17062021170005
57;235;17062021170005
58;233;17062021170005
59;239;17062021170005
60;243;17062021170005
61;244;17062021170005
62;243;17062021170005
63;236;17062021170005
64;247;17062021170005
65;226;17062021170005
66;228;17062021170005
67;227;17062021170005
68;228;17062021170005
69;223;17062021170005
70;233;17062021170005
71;220;17062021170005
72;221;17062021170005
73;224;17062021170005
74;224;17062021170005
75;227;17062021170005
76;220;17062021170005
77;214;17062021170005
78;222;17062021170005
79;239;17062021170005
80;216;17062021170005
81;201;17062021170005
82;205;17062021170005
83;202;17062021170005
84;200;17062021170005
85;199;17062021170005
86;212;17062021170005
87;214;17062021170005
88;192;17062021170005
89;182;17062021170005
90;200;17062021170005
91;184;17062021170005
92;189;17062021170005
93;204;17062021170005
94;194;17062021170005
95;182;17062021170005
96;186;17062021170005
97;183;17062021170005
98;176;17062021170005
99;185;17062021170005
100;174;17062021170005
101;203;17062021170005
102;200;17062021170005
103;179;17062021170005
104;184;17062021170005
105;178;17062021170005
106;175;17062021170005
107;175;17062021170005
108;184;17062021170005
109;181;17062021170005
110;175;17062021170005
111;170;17062021170005
112;171;17062021170005
113;172;17062021170005
114;167;17062021170005
115;176;17062021170005
116;186;17062021170005
117;177;17062021170005
118;174;17062021170005
119;185;17062021170005
120;175;17062021170005
121;173;17062021170005
122;177;17062021170005
123;171;17062021170005
124;185;17062021170005
125;173;17062021170005
126;172;17062021170005
127;184;17062021170005
128;192;17062021170005
129;181;17062021170005
130;176;17062021170005
131;174;17062021170005
132;170;17062021170005
133;201;17062021170005
134;174;17062021170005
135;178;17062021170005
136;173;17062021170005
137;173;17062021170005
138;187;17062021170005
139;174;17062021170005
140;182;17062021170005
141;183;17062021170005
142;179;17062021170005
143;168;17062021170005
144;183;17062021170005
145;180;17062021170005
146;177;17062021170005
147;190;17062021170005
148;177;17062021170005
149;187;17062021170005
150;190;17062021170005
151;189;17062021170005
152;175;17062021170005
153;179;17062021170005
154;180;17062021170005
155;195;17062021170005
156;185;17062021170005
157;176;17062021170005
158;174;17062021170005
159;173;17062021170005
160;169;17062021170005
161;177;17062021170005
162;175;17062021170005
163;179;17062021170005
164;185;17062021170005
165;187;17062021170005
166;175;17062021170005
167;184;17062021170005
168;189;17062021170005
169;170;17062021170005
170;182;17062021170005
171;175;17062021170005
172;173;17062021170005
173;191;17062021170005
174;172;17062021170005
175;177;17062021170005
176;181;17062021170005
177;176;17062021170005
178;191;17062021170005
179;182;17062021170005
180;179;17062021170005
181;176;17062021170005
182;191;17062021170005
183;177;17062021170005
184;178;17062021170005
185;171;17062021170005
186;186;17062021170005
187;177;17062021170005
188;186;17062021170005
189;186;17062021170005
190;174;17062021170005
191;190;17062021170005
192;187;17062021170005
193;176;17062021170005
194;197;17062021170005
195;182;17062021170005
196;179;17062021170005
197;176;17062021170005
198;184;17062021170005
199;177;17062021170005
200;0;17062021170005
0;0;17062021170007
1;161;17062021170007
2;204;17062021170007
3;186;17062021170007
4;196;17062021170007
5;189;17062021170007
6;199;17062021170007
7;207;17062021170007
8;206;17062021170007
9;191;17062021170007
10;201;17062021170007
11;207;17062021170007
12;200;17062021170007
13;214;17062021170007
14;209;17062021170007
15;217;17062021170007
16;223;17062021170007
17;234;17062021170007
18;277;17062021170007
19;359;17062021170007
20;515;17062021170007
21;890;17062021170007
22;1023;17062021170007
23;1023;17062021170007
24;1023;17062021170007
25;1023;17062021170007
26;1023;17062021170007
27;1023;17062021170007
28;1023;17062021170007
29;1023;17062021170007
30;1023;17062021170007
31;1023;17062021170007
32;1023;17062021170007
33;1023;17062021170007
34;1023;17062021170007
35;878;17062021170007
36;670;17062021170007
37;545;17062021170007
38;436;17062021170007
39;387;17062021170007
40;338;17062021170007
41;309;17062021170007
42;302;17062021170007
43;300;17062021170007
44;314;17062021170007
45;349;17062021170007
46;346;17062021170007
47;338;17062021170007
48;318;17062021170007
49;305;17062021170007
50;290;17062021170007
51;279;17062021170007
52;265;17062021170007
53;249;17062021170007
54;235;17062021170007
55;235;17062021170007
56;233;17062021170007
57;233;17062021170007
58;236;17062021170007
59;237;17062021170007
60;244;17062021170007
61;246;17062021170007
62;244;17062021170007
63;234;17062021170007
64;249;17062021170007
65;227;17062021170007
66;225;17062021170007
67;227;17062021170007
68;228;17062021170007
69;225;17062021170007
70;233;17062021170007
71;218;17062021170007
72;220;17062021170007
73;225;17062021170007
74;220;17062021170007
75;227;17062021170007
76;219;17062021170007
77;216;17062021170007
78;222;17062021170007
79;240;17062021170007
80;218;17062021170007
81;201;17062021170007
82;206;17062021170007
83;202;17062021170007
84;201;17062021170007
85;200;17062021170007
86;212;17062021170007
87;214;17062021170007
88;195;17062021170007
89;182;17062021170007
90;201;17062021170007
91;185;17062021170007
92;188;17062021170007
93;202;17062021170007
94;194;17062021170007
95;182;17062021170007
96;186;17062021170007
97;182;17062021170007
98;177;17062021170007
99;186;17062021170007
100;174;17062021170007
101;204;17062021170007
102;199;17062021170007
103;180;17062021170007
104;183;17062021170007
105;176;17062021170007
106;178;17062021170007
107;176;17062021170007
108;185;17062021170007
109;180;17062021170007
110;173;17062021170007
111;170;17062021170007
112;170;17062021170007
113;170;17062021170007
114;169;17062021170007
115;176;17062021170007
116;185;17062021170007
117;178;17062021170007
118;173;17062021170007
119;185;17062021170007
120;178;17062021170007
121;173;17062021170007
122;177;17062021170007
123;171;17062021170007
124;187;17062021170007
125;174;17062021170007
126;172;17062021170007
127;184;17062021170007
128;192;17062021170007
129;183;17062021170007
130;177;17062021170007
131;175;17062021170007
132;171;17062021170007
133;200;17062021170007
134;173;17062021170007
135;178;17062021170007
136;176;17062021170007
137;174;17062021170007
138;185;17062021170007
139;175;17062021170007
140;183;17062021170007
141;185;17062021170007
142;178;17062021170007
143;169;17062021170007
144;183;17062021170007
145;180;17062021170007
146;176;17062021170007
147;192;17062021170007
148;176;17062021170007
149;186;17062021170007
150;191;17062021170007
151;189;17062021170007
152;174;17062021170007
153;178;17062021170007
154;181;17062021170007
155;196;17062021170007
156;186;17062021170007
157;176;17062021170007
158;175;17062021170007
159;172;17062021170007
160;171;17062021170007
161;176;17062021170007
162;176;17062021170007
163;180;17062021170007
164;188;17062021170007
165;185;17062021170007
166;175;17062021170007
167;185;17062021170007
168;190;17062021170007
169;171;17062021170007
170;182;17062021170007
171;176;17062021170007
172;174;17062021170007
173;192;17062021170007
174;174;17062021170007
175;178;17062021170007
176;182;17062021170007
177;174;17062021170007
178;191;17062021170007
179;184;17062021170007
180;178;17062021170007
181;177;17062021170007
182;191;17062021170007
183;176;17062021170007
184;178;17062021170007
185;171;17062021170007
186;186;17062021170007
187;177;17062021170007
188;181;17062021170007
189;186;17062021170007
190;174;17062021170007
191;191;17062021170007
192;186;17062021170007
193;175;17062021170007
194;196;17062021170007
195;182;17062021170007
196;181;17062021170007
197;174;17062021170007
198;185;17062021170007
199;178;17062021170007
200;0;17062021170007
0;0;17062021170010
1;161;17062021170010
2;204;17062021170010
3;186;17062021170010
4;196;17062021170010
5;188;17062021170010
6;196;17062021170010
7;204;17062021170010
8;203;17062021170010
9;190;17062021170010
10;202;17062021170010
11;206;17062021170010
12;199;17062021170010
13;210;17062021170010
14;205;17062021170010
15;218;17062021170010
16;222;17062021170010
17;233;17062021170010
18;276;17062021170010
19;359;17062021170010
20;511;17062021170010
21;883;17062021170010
22;1023;17062021170010
23;1023;17062021170010
24;1023;17062021170010
25;1023;17062021170010
26;1023;17062021170010
27;1023;17062021170010
28;1023;17062021170010
29;1023;17062021170010
30;1023;17062021170010
31;1023;17062021170010
32;1023;17062021170010
33;1023;17062021170010
34;1023;17062021170010
35;872;17062021170010
36;676;17062021170010
37;543;17062021170010
38;436;17062021170010
39;389;17062021170010
40;338;17062021170010
41;310;17062021170010
42;298;17062021170010
43;299;17062021170010
44;314;17062021170010
45;352;17062021170010
46;347;17062021170010
47;336;17062021170010
48;319;17062021170010
49;304;17062021170010
50;286;17062021170010
51;277;17062021170010
52;261;17062021170010
53;251;17062021170010
54;237;17062021170010
55;236;17062021170010
56;230;17062021170010
57;233;17062021170010
58;233;17062021170010
59;237;17062021170010
60;241;17062021170010
61;243;17062021170010
62;240;17062021170010
63;232;17062021170010
64;246;17062021170010
65;228;17062021170010
66;226;17062021170010
67;225;17062021170010
68;227;17062021170010
69;222;17062021170010
70;232;17062021170010
71;218;17062021170010
72;221;17062021170010
73;223;17062021170010
74;220;17062021170010
75;228;17062021170010
76;219;17062021170010
77;214;17062021170010
78;223;17062021170010
79;239;17062021170010
80;216;17062021170010
81;201;17062021170010
82;205;17062021170010
83;202;17062021170010
84;201;17062021170010
85;198;17062021170010
86;211;17062021170010
87;214;17062021170010
88;193;17062021170010
89;181;17062021170010
90;199;17062021170010
91;183;17062021170010
92;188;17062021170010
93;201;17062021170010
94;193;17062021170010
95;183;17062021170010
96;186;17062021170010
97;182;17062021170010
98;177;17062021170010
99;183;17062021170010
100;174;17062021170010
101;200;17062021170010
102;198;17062021170010
103;180;17062021170010
104;186;17062021170010
105;178;17062021170010
106;176;17062021170010
107;176;17062021170010
108;183;17062021170010
109;176;17062021170010
110;173;17062021170010
111;169;17062021170010
112;171;17062021170010
113;170;17062021170010
114;169;17062021170010
115;176;17062021170010
116;184;17062021170010
117;177;17062021170010
118;173;17062021170010
119;186;17062021170010
120;177;17062021170010
121;172;17062021170010
122;177;17062021170010
123;171;17062021170010
124;184;17062021170010
125;173;17062021170010
126;173;17062021170010
127;184;17062021170010
128;188;17062021170010
129;181;17062021170010
130;176;17062021170010
131;174;17062021170010
132;169;17062021170010
133;200;17062021170010
134;172;17062021170010
135;176;17062021170010
136;174;17062021170010
137;173;17062021170010
138;187;17062021170010
139;172;17062021170010
140;181;17062021170010
141;183;17062021170010
142;178;17062021170010
143;168;17062021170010
144;182;17062021170010
145;180;17062021170010
146;176;17062021170010
147;189;17062021170010
148;176;17062021170010
149;185;17062021170010
150;190;17062021170010
151;188;17062021170010
152;174;17062021170010
153;179;17062021170010
154;180;17062021170010
155;194;17062021170010
156;184;17062021170010
157;175;17062021170010
158;175;17062021170010
159;173;17062021170010
160;171;17062021170010
161;175;17062021170010
162;176;17062021170010
163;181;17062021170010
164;186;17062021170010
165;184;17062021170010
166;173;17062021170010
167;184;17062021170010
168;189;17062021170010
169;170;17062021170010
170;183;17062021170010
171;174;17062021170010
172;173;17062021170010
173;189;17062021170010
174;172;17062021170010
175;177;17062021170010
176;181;17062021170010
177;175;17062021170010
178;190;17062021170010
179;181;17062021170010
180;177;17062021170010
181;173;17062021170010
182;191;17062021170010
183;177;17062021170010
184;178;17062021170010
185;169;17062021170010
186;183;17062021170010
187;177;17062021170010
188;183;17062021170010
189;186;17062021170010
190;174;17062021170010
191;191;17062021170010
192;184;17062021170010
193;174;17062021170010
194;197;17062021170010
195;180;17062021170010
196;179;17062021170010
197;175;17062021170010
198;183;17062021170010
199;173;17062021170010
200;0;17062021170010
0;0;17062021170012
1;161;17062021170012
2;205;17062021170012
3;187;17062021170012
4;195;17062021170012
5;186;17062021170012
6;198;17062021170012
7;206;17062021170012
8;206;17062021170012
9;189;17062021170012
10;202;17062021170012
11;202;17062021170012
12;198;17062021170012
13;211;17062021170012
14;207;17062021170012
15;218;17062021170012
16;222;17062021170012
17;232;17062021170012
18;274;17062021170012
19;354;17062021170012
20;506;17062021170012
21;875;17062021170012
22;1023;17062021170012
23;1023;17062021170012
24;1023;17062021170012
25;1023;17062021170012
26;1023;17062021170012
27;1023;17062021170012
28;1023;17062021170012
29;1023;17062021170012
30;1023;17062021170012
31;1023;17062021170012
32;1023;17062021170012
33;1023;17062021170012
34;1023;17062021170012
35;866;17062021170012
36;668;17062021170012
37;541;17062021170012
38;437;17062021170012
39;384;17062021170012
40;336;17062021170012
41;306;17062021170012
42;299;17062021170012
43;296;17062021170012
44;309;17062021170012
45;346;17062021170012
46;346;17062021170012
47;334;17062021170012
48;315;17062021170012
49;303;17062021170012
50;287;17062021170012
51;277;17062021170012
52;261;17062021170012
53;251;17062021170012
54;236;17062021170012
55;234;17062021170012
56;233;17062021170012
57;232;17062021170012
58;234;17062021170012
59;240;17062021170012
60;242;17062021170012
61;241;17062021170012
62;242;17062021170012
63;232;17062021170012
64;249;17062021170012
65;225;17062021170012
66;228;17062021170012
67;224;17062021170012
68;227;17062021170012
69;224;17062021170012
70;233;17062021170012
71;213;17062021170012
72;218;17062021170012
73;222;17062021170012
74;220;17062021170012
75;226;17062021170012
76;219;17062021170012
77;214;17062021170012
78;222;17062021170012
79;238;17062021170012
80;217;17062021170012
81;203;17062021170012
82;203;17062021170012
83;202;17062021170012
84;200;17062021170012
85;199;17062021170012
86;213;17062021170012
87;211;17062021170012
88;194;17062021170012
89;182;17062021170012
90;202;17062021170012
91;183;17062021170012
92;188;17062021170012
93;200;17062021170012
94;193;17062021170012
95;185;17062021170012
96;187;17062021170012
97;184;17062021170012
98;177;17062021170012
99;184;17062021170012
100;172;17062021170012
101;202;17062021170012
102;201;17062021170012
103;180;17062021170012
104;186;17062021170012
105;176;17062021170012
106;175;17062021170012
107;176;17062021170012
108;185;17062021170012
109;180;17062021170012
110;172;17062021170012
111;169;17062021170012
112;172;17062021170012
113;171;17062021170012
114;169;17062021170012
115;175;17062021170012
116;184;17062021170012
117;177;17062021170012
118;172;17062021170012
119;186;17062021170012
120;178;17062021170012
121;172;17062021170012
122;177;17062021170012
123;171;17062021170012
124;185;17062021170012
125;172;17062021170012
126;170;17062021170012
127;185;17062021170012
128;189;17062021170012
129;181;17062021170012
130;176;17062021170012
131;172;17062021170012
132;169;17062021170012
133;199;17062021170012
134;171;17062021170012
135;176;17062021170012
136;174;17062021170012
137;174;17062021170012
138;186;17062021170012
139;173;17062021170012
140;181;17062021170012
141;184;17062021170012
142;180;17062021170012
143;169;17062021170012
144;183;17062021170012
145;180;17062021170012
146;177;17062021170012
147;191;17062021170012
148;175;17062021170012
149;185;17062021170012
150;189;17062021170012
151;187;17062021170012
152;175;17062021170012
153;177;17062021170012
154;181;17062021170012
155;194;17062021170012
156;184;17062021170012
157;176;17062021170012
158;176;17062021170012
159;172;17062021170012
160;171;17062021170012
161;176;17062021170012
162;175;17062021170012
163;181;17062021170012
164;185;17062021170012
165;184;17062021170012
166;175;17062021170012
167;184;17062021170012
168;188;17062021170012
169;169;17062021170012
170;182;17062021170012
171;174;17062021170012
172;173;17062021170012
173;189;17062021170012
174;173;17062021170012
175;177;17062021170012
176;181;17062021170012
177;173;17062021170012
178;190;17062021170012
179;183;17062021170012
180;178;17062021170012
181;176;17062021170012
182;192;17062021170012
183;175;17062021170012
184;177;17062021170012
185;169;17062021170012
186;185;17062021170012
187;177;17062021170012
188;183;17062021170012
189;188;17062021170012
190;172;17062021170012
191;191;17062021170012
192;186;17062021170012
193;174;17062021170012
194;195;17062021170012
195;182;17062021170012
196;180;17062021170012
197;176;17062021170012
198;185;17062021170012
199;176;17062021170012
200;0;17062021170012
0;0;17062021170014
1;161;17062021170014
2;203;17062021170014
3;186;17062021170014
4;194;17062021170014
5;187;17062021170014
6;197;17062021170014
7;205;17062021170014
8;207;17062021170014
9;191;17062021170014
10;201;17062021170014
11;206;17062021170014
12;197;17062021170014
13;209;17062021170014
14;205;17062021170014
15;217;17062021170014
16;222;17062021170014
17;234;17062021170014
18;274;17062021170014
19;358;17062021170014
20;509;17062021170014
21;878;17062021170014
22;1023;17062021170014
23;1023;17062021170014
24;1023;17062021170014
25;1023;17062021170014
26;1023;17062021170014
27;1023;17062021170014
28;1023;17062021170014
29;1023;17062021170014
30;1023;17062021170014
31;1023;17062021170014
32;1023;17062021170014
33;1023;17062021170014
34;1023;17062021170014
35;880;17062021170014
36;677;17062021170014
37;547;17062021170014
38;439;17062021170014
39;391;17062021170014
40;339;17062021170014
41;310;17062021170014
42;301;17062021170014
43;299;17062021170014
44;312;17062021170014
45;347;17062021170014
46;347;17062021170014
47;336;17062021170014
48;319;17062021170014
49;306;17062021170014
50;290;17062021170014
51;277;17062021170014
52;260;17062021170014
53;252;17062021170014
54;236;17062021170014
55;235;17062021170014
56;231;17062021170014
57;233;17062021170014
58;235;17062021170014
59;238;17062021170014
60;241;17062021170014
61;243;17062021170014
62;244;17062021170014
63;233;17062021170014
64;248;17062021170014
65;227;17062021170014
66;226;17062021170014
67;226;17062021170014
68;226;17062021170014
69;224;17062021170014
70;233;17062021170014
71;216;17062021170014
72;220;17062021170014
73;222;17062021170014
74;221;17062021170014
75;226;17062021170014
76;220;17062021170014
77;214;17062021170014
78;223;17062021170014
79;238;17062021170014
80;216;17062021170014
81;202;17062021170014
82;206;17062021170014
83;202;17062021170014
84;200;17062021170014
85;200;17062021170014
86;212;17062021170014
87;213;17062021170014
88;193;17062021170014
89;182;17062021170014
90;200;17062021170014
91;184;17062021170014
92;186;17062021170014
93;200;17062021170014
94;193;17062021170014
95;182;17062021170014
96;183;17062021170014
97;184;17062021170014
98;177;17062021170014
99;184;17062021170014
100;173;17062021170014
101;201;17062021170014
102;200;17062021170014
103;178;17062021170014
104;184;17062021170014
105;178;17062021170014
106;176;17062021170014
107;176;17062021170014
108;184;17062021170014
109;180;17062021170014
110;173;17062021170014
111;168;17062021170014
112;172;17062021170014
113;170;17062021170014
114;168;17062021170014
115;174;17062021170014
116;186;17062021170014
117;178;17062021170014
118;173;17062021170014
119;186;17062021170014
120;175;17062021170014
121;172;17062021170014
122;175;17062021170014
123;172;17062021170014
124;184;17062021170014
125;171;17062021170014
126;172;17062021170014
127;185;17062021170014
128;189;17062021170014
129;181;17062021170014
130;176;17062021170014
131;173;17062021170014
132;169;17062021170014
133;200;17062021170014
134;172;17062021170014
135;175;17062021170014
136;174;17062021170014
137;173;17062021170014
138;186;17062021170014
139;176;17062021170014
140;181;17062021170014
141;184;17062021170014
142;179;17062021170014
143;169;17062021170014
144;182;17062021170014
145;178;17062021170014
146;176;17062021170014
147;192;17062021170014
148;176;17062021170014
149;184;17062021170014
150;189;17062021170014
151;186;17062021170014
152;173;17062021170014
153;178;17062021170014
154;180;17062021170014
155;192;17062021170014
156;184;17062021170014
157;175;17062021170014
158;176;17062021170014
159;174;17062021170014
160;171;17062021170014
161;176;17062021170014
162;176;17062021170014
163;182;17062021170014
164;186;17062021170014
165;185;17062021170014
166;173;17062021170014
167;185;17062021170014
168;190;17062021170014
169;168;17062021170014
170;182;17062021170014
171;174;17062021170014
172;173;17062021170014
173;190;17062021170014
174;174;17062021170014
175;177;17062021170014
176;180;17062021170014
177;173;17062021170014
178;189;17062021170014
179;181;17062021170014
180;178;17062021170014
181;174;17062021170014
182;192;17062021170014
183;177;17062021170014
184;179;17062021170014
185;170;17062021170014
186;184;17062021170014
187;177;17062021170014
188;185;17062021170014
189;186;17062021170014
190;175;17062021170014
191;190;17062021170014
192;187;17062021170014
193;174;17062021170014
194;194;17062021170014
195;182;17062021170014
196;177;17062021170014
197;173;17062021170014
198;185;17062021170014
199;178;17062021170014
200;0;17062021170014
0;0;17062021170016
1;160;17062021170016
2;202;17062021170016
3;185;17062021170016
4;194;17062021170016
5;187;17062021170016
6;195;17062021170016
7;206;17062021170016
8;205;17062021170016
9;189;17062021170016
10;200;17062021170016
11;205;17062021170016
12;198;17062021170016
13;213;17062021170016
14;205;17062021170016
15;218;17062021170016
16;221;17062021170016
17;231;17062021170016
18;277;17062021170016
19;356;17062021170016
20;511;17062021170016
21;882;17062021170016
22;1023;17062021170016
23;1023;17062021170016
24;1023;17062021170016
25;1023;17062021170016
26;1023;17062021170016
27;1023;17062021170016
28;1023;17062021170016
29;1023;17062021170016
30;1023;17062021170016
31;1023;17062021170016
32;1023;17062021170016
33;1023;17062021170016
34;1023;17062021170016
35;880;17062021170016
36;680;17062021170016
37;545;17062021170016
38;442;17062021170016
39;390;17062021170016
40;338;17062021170016
41;307;17062021170016
42;303;17062021170016
43;299;17062021170016
44;313;17062021170016
45;349;17062021170016
46;345;17062021170016
47;333;17062021170016
48;314;17062021170016
49;306;17062021170016
50;292;17062021170016
51;277;17062021170016
52;263;17062021170016
53;250;17062021170016
54;238;17062021170016
55;234;17062021170016
56;230;17062021170016
57;233;17062021170016
58;232;17062021170016
59;236;17062021170016
60;244;17062021170016
61;243;17062021170016
62;243;17062021170016
63;235;17062021170016
64;247;17062021170016
65;226;17062021170016
66;225;17062021170016
67;227;17062021170016
68;227;17062021170016
69;225;17062021170016
70;231;17062021170016
71;216;17062021170016
72;219;17062021170016
73;222;17062021170016
74;219;17062021170016
75;224;17062021170016
76;219;17062021170016
77;212;17062021170016
78;220;17062021170016
79;238;17062021170016
80;217;17062021170016
81;199;17062021170016
82;204;17062021170016
83;201;17062021170016
84;197;17062021170016
85;201;17062021170016
86;211;17062021170016
87;212;17062021170016
88;193;17062021170016
89;182;17062021170016
90;201;17062021170016
91;182;17062021170016
92;184;17062021170016
93;200;17062021170016
94;192;17062021170016
95;181;17062021170016
96;186;17062021170016
97;183;17062021170016
98;176;17062021170016
99;183;17062021170016
100;173;17062021170016
101;203;17062021170016
102;200;17062021170016
103;178;17062021170016
104;183;17062021170016
105;175;17062021170016
106;175;17062021170016
107;175;17062021170016
108;182;17062021170016
109;179;17062021170016
110;173;17062021170016
111;169;17062021170016
112;170;17062021170016
113;171;17062021170016
114;169;17062021170016
115;174;17062021170016
116;184;17062021170016
117;178;17062021170016
118;172;17062021170016
119;185;17062021170016
120;176;17062021170016
121;171;17062021170016
122;177;17062021170016
123;171;17062021170016
124;185;17062021170016
125;173;17062021170016
126;169;17062021170016
127;184;17062021170016
128;189;17062021170016
129;183;17062021170016
130;176;17062021170016
131;173;17062021170016
132;167;17062021170016
133;199;17062021170016
134;172;17062021170016
135;176;17062021170016
136;175;17062021170016
137;173;17062021170016
138;186;17062021170016
139;173;17062021170016
140;181;17062021170016
141;182;17062021170016
142;178;17062021170016
143;170;17062021170016
144;181;17062021170016
145;178;17062021170016
146;175;17062021170016
147;189;17062021170016
148;174;17062021170016
149;184;17062021170016
150;189;17062021170016
151;187;17062021170016
152;172;17062021170016
153;177;17062021170016
154;179;17062021170016
155;194;17062021170016
156;182;17062021170016
157;175;17062021170016
158;174;17062021170016
159;172;17062021170016
160;170;17062021170016
161;175;17062021170016
162;175;17062021170016
163;180;17062021170016
164;186;17062021170016
165;183;17062021170016
166;174;17062021170016
167;185;17062021170016
168;189;17062021170016
169;168;17062021170016
170;182;17062021170016
171;173;17062021170016
172;172;17062021170016
173;187;17062021170016
174;171;17062021170016
175;177;17062021170016
176;179;17062021170016
177;173;17062021170016
178;191;17062021170016
179;181;17062021170016
180;178;17062021170016
181;173;17062021170016
182;192;17062021170016
183;175;17062021170016
184;176;17062021170016
185;169;17062021170016
186;184;17062021170016
187;178;17062021170016
188;181;17062021170016
189;184;17062021170016
190;173;17062021170016
191;189;17062021170016
192;185;17062021170016
193;173;17062021170016
194;194;17062021170016
195;181;17062021170016
196;179;17062021170016
197;174;17062021170016
198;183;17062021170016
199;175;17062021170016
200;0;17062021170016
