ind;val;datetime
0;0;30062021115534
1;150;30062021115534
2;143;30062021115534
3;141;30062021115534
4;142;30062021115534
5;145;30062021115534
6;144;30062021115534
7;147;30062021115534
8;149;30062021115534
9;150;30062021115534
10;153;30062021115534
11;155;30062021115534
12;157;30062021115534
13;164;30062021115534
14;168;30062021115534
15;181;30062021115534
16;195;30062021115534
17;226;30062021115534
18;291;30062021115534
19;423;30062021115534
20;717;30062021115534
21;1023;30062021115534
22;1023;30062021115534
23;1023;30062021115534
24;1023;30062021115534
25;1023;30062021115534
26;1023;30062021115534
27;1023;30062021115534
28;1023;30062021115534
29;1023;30062021115534
30;1023;30062021115534
31;1023;30062021115534
32;1023;30062021115534
33;1023;30062021115534
34;1023;30062021115534
35;1023;30062021115534
36;1023;30062021115534
37;1023;30062021115534
38;870;30062021115534
39;715;30062021115534
40;605;30062021115534
41;528;30062021115534
42;477;30062021115534
43;441;30062021115534
44;424;30062021115534
45;406;30062021115534
46;398;30062021115534
47;394;30062021115534
48;394;30062021115534
49;393;30062021115534
50;396;30062021115534
51;395;30062021115534
52;400;30062021115534
53;407;30062021115534
54;413;30062021115534
55;419;30062021115534
56;433;30062021115534
57;438;30062021115534
58;455;30062021115534
59;463;30062021115534
60;474;30062021115534
61;487;30062021115534
62;497;30062021115534
63;503;30062021115534
64;507;30062021115534
65;512;30062021115534
66;515;30062021115534
67;508;30062021115534
68;510;30062021115534
69;505;30062021115534
70;493;30062021115534
71;487;30062021115534
72;480;30062021115534
73;464;30062021115534
74;454;30062021115534
75;436;30062021115534
76;426;30062021115534
77;415;30062021115534
78;405;30062021115534
79;388;30062021115534
80;377;30062021115534
81;364;30062021115534
82;358;30062021115534
83;348;30062021115534
84;342;30062021115534
85;338;30062021115534
86;331;30062021115534
87;326;30062021115534
88;327;30062021115534
89;318;30062021115534
90;313;30062021115534
91;310;30062021115534
92;298;30062021115534
93;293;30062021115534
94;286;30062021115534
95;275;30062021115534
96;271;30062021115534
97;262;30062021115534
98;261;30062021115534
99;255;30062021115534
100;251;30062021115534
101;248;30062021115534
102;240;30062021115534
103;236;30062021115534
104;232;30062021115534
105;224;30062021115534
106;227;30062021115534
107;218;30062021115534
108;215;30062021115534
109;211;30062021115534
110;209;30062021115534
111;206;30062021115534
112;204;30062021115534
113;196;30062021115534
114;196;30062021115534
115;196;30062021115534
116;191;30062021115534
117;192;30062021115534
118;189;30062021115534
119;187;30062021115534
120;182;30062021115534
121;181;30062021115534
122;179;30062021115534
123;175;30062021115534
124;173;30062021115534
125;173;30062021115534
126;170;30062021115534
127;169;30062021115534
128;169;30062021115534
129;163;30062021115534
130;163;30062021115534
131;162;30062021115534
132;159;30062021115534
133;161;30062021115534
134;156;30062021115534
135;155;30062021115534
136;155;30062021115534
137;151;30062021115534
138;152;30062021115534
139;150;30062021115534
140;147;30062021115534
141;149;30062021115534
142;148;30062021115534
143;144;30062021115534
144;146;30062021115534
145;142;30062021115534
146;145;30062021115534
147;143;30062021115534
148;141;30062021115534
149;142;30062021115534
150;141;30062021115534
151;140;30062021115534
152;140;30062021115534
153;138;30062021115534
154;139;30062021115534
155;136;30062021115534
156;136;30062021115534
157;137;30062021115534
158;135;30062021115534
159;134;30062021115534
160;136;30062021115534
161;134;30062021115534
162;137;30062021115534
163;135;30062021115534
164;134;30062021115534
165;135;30062021115534
166;133;30062021115534
167;133;30062021115534
168;134;30062021115534
169;130;30062021115534
170;134;30062021115534
171;132;30062021115534
172;131;30062021115534
173;132;30062021115534
174;130;30062021115534
175;130;30062021115534
176;132;30062021115534
177;130;30062021115534
178;132;30062021115534
179;130;30062021115534
180;129;30062021115534
181;131;30062021115534
182;130;30062021115534
183;128;30062021115534
184;131;30062021115534
185;127;30062021115534
186;131;30062021115534
187;130;30062021115534
188;127;30062021115534
189;129;30062021115534
190;127;30062021115534
191;128;30062021115534
192;131;30062021115534
193;128;30062021115534
194;129;30062021115534
195;128;30062021115534
196;128;30062021115534
197;129;30062021115534
198;129;30062021115534
199;127;30062021115534
200;0;30062021115534
0;0;30062021115535
1;148;30062021115535
2;142;30062021115535
3;142;30062021115535
4;142;30062021115535
5;145;30062021115535
6;143;30062021115535
7;145;30062021115535
8;148;30062021115535
9;147;30062021115535
10;151;30062021115535
11;151;30062021115535
12;155;30062021115535
13;164;30062021115535
14;169;30062021115535
15;180;30062021115535
16;194;30062021115535
17;225;30062021115535
18;292;30062021115535
19;428;30062021115535
20;725;30062021115535
21;1023;30062021115535
22;1023;30062021115535
23;1023;30062021115535
24;1023;30062021115535
25;1023;30062021115535
26;1023;30062021115535
27;1023;30062021115535
28;1023;30062021115535
29;1023;30062021115535
30;1023;30062021115535
31;1023;30062021115535
32;1023;30062021115535
33;1023;30062021115535
34;1023;30062021115535
35;1023;30062021115535
36;1023;30062021115535
37;1023;30062021115535
38;882;30062021115535
39;729;30062021115535
40;609;30062021115535
41;529;30062021115535
42;487;30062021115535
43;445;30062021115535
44;428;30062021115535
45;409;30062021115535
46;402;30062021115535
47;403;30062021115535
48;398;30062021115535
49;395;30062021115535
50;396;30062021115535
51;402;30062021115535
52;404;30062021115535
53;410;30062021115535
54;418;30062021115535
55;427;30062021115535
56;435;30062021115535
57;440;30062021115535
58;458;30062021115535
59;466;30062021115535
60;478;30062021115535
61;491;30062021115535
62;496;30062021115535
63;510;30062021115535
64;512;30062021115535
65;513;30062021115535
66;522;30062021115535
67;514;30062021115535
68;516;30062021115535
69;510;30062021115535
70;501;30062021115535
71;490;30062021115535
72;484;30062021115535
73;467;30062021115535
74;461;30062021115535
75;443;30062021115535
76;429;30062021115535
77;420;30062021115535
78;406;30062021115535
79;392;30062021115535
80;381;30062021115535
81;363;30062021115535
82;363;30062021115535
83;348;30062021115535
84;342;30062021115535
85;337;30062021115535
86;333;30062021115535
87;332;30062021115535
88;328;30062021115535
89;320;30062021115535
90;316;30062021115535
91;306;30062021115535
92;301;30062021115535
93;296;30062021115535
94;287;30062021115535
95;278;30062021115535
96;274;30062021115535
97;264;30062021115535
98;259;30062021115535
99;255;30062021115535
100;250;30062021115535
101;246;30062021115535
102;239;30062021115535
103;236;30062021115535
104;234;30062021115535
105;224;30062021115535
106;226;30062021115535
107;219;30062021115535
108;214;30062021115535
109;214;30062021115535
110;205;30062021115535
111;204;30062021115535
112;204;30062021115535
113;200;30062021115535
114;195;30062021115535
115;193;30062021115535
116;191;30062021115535
117;192;30062021115535
118;188;30062021115535
119;186;30062021115535
120;181;30062021115535
121;179;30062021115535
122;178;30062021115535
123;178;30062021115535
124;174;30062021115535
125;172;30062021115535
126;169;30062021115535
127;167;30062021115535
128;167;30062021115535
129;163;30062021115535
130;161;30062021115535
131;162;30062021115535
132;157;30062021115535
133;161;30062021115535
134;157;30062021115535
135;153;30062021115535
136;154;30062021115535
137;150;30062021115535
138;153;30062021115535
139;149;30062021115535
140;147;30062021115535
141;149;30062021115535
142;145;30062021115535
143;144;30062021115535
144;145;30062021115535
145;140;30062021115535
146;144;30062021115535
147;142;30062021115535
148;140;30062021115535
149;139;30062021115535
150;139;30062021115535
151;139;30062021115535
152;140;30062021115535
153;137;30062021115535
154;139;30062021115535
155;136;30062021115535
156;135;30062021115535
157;136;30062021115535
158;133;30062021115535
159;133;30062021115535
160;135;30062021115535
161;132;30062021115535
162;134;30062021115535
163;134;30062021115535
164;132;30062021115535
165;133;30062021115535
166;132;30062021115535
167;132;30062021115535
168;133;30062021115535
169;128;30062021115535
170;131;30062021115535
171;130;30062021115535
172;129;30062021115535
173;130;30062021115535
174;130;30062021115535
175;129;30062021115535
176;132;30062021115535
177;128;30062021115535
178;131;30062021115535
179;128;30062021115535
180;128;30062021115535
181;130;30062021115535
182;128;30062021115535
183;127;30062021115535
184;129;30062021115535
185;126;30062021115535
186;129;30062021115535
187;128;30062021115535
188;126;30062021115535
189;128;30062021115535
190;127;30062021115535
191;127;30062021115535
192;130;30062021115535
193;127;30062021115535
194;127;30062021115535
195;127;30062021115535
196;126;30062021115535
197;127;30062021115535
198;128;30062021115535
199;126;30062021115535
200;0;30062021115535
0;0;30062021115536
1;146;30062021115536
2;141;30062021115536
3;140;30062021115536
4;141;30062021115536
5;144;30062021115536
6;140;30062021115536
7;144;30062021115536
8;147;30062021115536
9;146;30062021115536
10;151;30062021115536
11;150;30062021115536
12;154;30062021115536
13;161;30062021115536
14;169;30062021115536
15;178;30062021115536
16;195;30062021115536
17;224;30062021115536
18;292;30062021115536
19;428;30062021115536
20;724;30062021115536
21;1023;30062021115536
22;1023;30062021115536
23;1023;30062021115536
24;1023;30062021115536
25;1023;30062021115536
26;1023;30062021115536
27;1023;30062021115536
28;1023;30062021115536
29;1023;30062021115536
30;1023;30062021115536
31;1023;30062021115536
32;1023;30062021115536
33;1023;30062021115536
34;1023;30062021115536
35;1023;30062021115536
36;1023;30062021115536
37;1023;30062021115536
38;888;30062021115536
39;732;30062021115536
40;613;30062021115536
41;533;30062021115536
42;487;30062021115536
43;450;30062021115536
44;428;30062021115536
45;413;30062021115536
46;402;30062021115536
47;399;30062021115536
48;398;30062021115536
49;397;30062021115536
50;399;30062021115536
51;400;30062021115536
52;404;30062021115536
53;415;30062021115536
54;417;30062021115536
55;424;30062021115536
56;433;30062021115536
57;447;30062021115536
58;459;30062021115536
59;469;30062021115536
60;478;30062021115536
61;492;30062021115536
62;497;30062021115536
63;507;30062021115536
64;515;30062021115536
65;516;30062021115536
66;521;30062021115536
67;519;30062021115536
68;513;30062021115536
69;507;30062021115536
70;497;30062021115536
71;490;30062021115536
72;484;30062021115536
73;469;30062021115536
74;460;30062021115536
75;443;30062021115536
76;434;30062021115536
77;421;30062021115536
78;406;30062021115536
79;392;30062021115536
80;379;30062021115536
81;369;30062021115536
82;360;30062021115536
83;349;30062021115536
84;342;30062021115536
85;339;30062021115536
86;335;30062021115536
87;330;30062021115536
88;328;30062021115536
89;321;30062021115536
90;317;30062021115536
91;312;30062021115536
92;298;30062021115536
93;295;30062021115536
94;286;30062021115536
95;277;30062021115536
96;273;30062021115536
97;266;30062021115536
98;259;30062021115536
99;253;30062021115536
100;247;30062021115536
101;247;30062021115536
102;239;30062021115536
103;234;30062021115536
104;230;30062021115536
105;226;30062021115536
106;227;30062021115536
107;219;30062021115536
108;216;30062021115536
109;212;30062021115536
110;207;30062021115536
111;202;30062021115536
112;201;30062021115536
113;195;30062021115536
114;197;30062021115536
115;194;30062021115536
116;190;30062021115536
117;191;30062021115536
118;185;30062021115536
119;185;30062021115536
120;180;30062021115536
121;179;30062021115536
122;178;30062021115536
123;175;30062021115536
124;172;30062021115536
125;172;30062021115536
126;168;30062021115536
127;165;30062021115536
128;167;30062021115536
129;161;30062021115536
130;160;30062021115536
131;160;30062021115536
132;156;30062021115536
133;159;30062021115536
134;154;30062021115536
135;154;30062021115536
136;153;30062021115536
137;150;30062021115536
138;151;30062021115536
139;147;30062021115536
140;146;30062021115536
141;148;30062021115536
142;144;30062021115536
143;142;30062021115536
144;143;30062021115536
145;139;30062021115536
146;143;30062021115536
147;140;30062021115536
148;137;30062021115536
149;139;30062021115536
150;138;30062021115536
151;138;30062021115536
152;137;30062021115536
153;136;30062021115536
154;137;30062021115536
155;136;30062021115536
156;134;30062021115536
157;134;30062021115536
158;132;30062021115536
159;133;30062021115536
160;133;30062021115536
161;132;30062021115536
162;133;30062021115536
163;132;30062021115536
164;132;30062021115536
165;133;30062021115536
166;131;30062021115536
167;130;30062021115536
168;131;30062021115536
169;128;30062021115536
170;130;30062021115536
171;129;30062021115536
172;128;30062021115536
173;129;30062021115536
174;128;30062021115536
175;127;30062021115536
176;128;30062021115536
177;127;30062021115536
178;130;30062021115536
179;128;30062021115536
180;127;30062021115536
181;128;30062021115536
182;127;30062021115536
183;126;30062021115536
184;128;30062021115536
185;124;30062021115536
186;127;30062021115536
187;126;30062021115536
188;125;30062021115536
189;127;30062021115536
190;125;30062021115536
191;125;30062021115536
192;129;30062021115536
193;125;30062021115536
194;126;30062021115536
195;125;30062021115536
196;125;30062021115536
197;126;30062021115536
198;126;30062021115536
199;124;30062021115536
200;0;30062021115536
0;0;30062021115537
1;146;30062021115537
2;140;30062021115537
3;139;30062021115537
4;140;30062021115537
5;143;30062021115537
6;142;30062021115537
7;144;30062021115537
8;147;30062021115537
9;146;30062021115537
10;151;30062021115537
11;151;30062021115537
12;153;30062021115537
13;163;30062021115537
14;166;30062021115537
15;178;30062021115537
16;193;30062021115537
17;223;30062021115537
18;290;30062021115537
19;424;30062021115537
20;720;30062021115537
21;1023;30062021115537
22;1023;30062021115537
23;1023;30062021115537
24;1023;30062021115537
25;1023;30062021115537
26;1023;30062021115537
27;1023;30062021115537
28;1023;30062021115537
29;1023;30062021115537
30;1023;30062021115537
31;1023;30062021115537
32;1023;30062021115537
33;1023;30062021115537
34;1023;30062021115537
35;1023;30062021115537
36;1023;30062021115537
37;1023;30062021115537
38;889;30062021115537
39;733;30062021115537
40;613;30062021115537
41;530;30062021115537
42;487;30062021115537
43;448;30062021115537
44;425;30062021115537
45;412;30062021115537
46;401;30062021115537
47;397;30062021115537
48;398;30062021115537
49;394;30062021115537
50;396;30062021115537
51;400;30062021115537
52;405;30062021115537
53;412;30062021115537
54;420;30062021115537
55;423;30062021115537
56;434;30062021115537
57;445;30062021115537
58;457;30062021115537
59;465;30062021115537
60;478;30062021115537
61;492;30062021115537
62;495;30062021115537
63;509;30062021115537
64;513;30062021115537
65;514;30062021115537
66;515;30062021115537
67;516;30062021115537
68;512;30062021115537
69;506;30062021115537
70;498;30062021115537
71;491;30062021115537
72;483;30062021115537
73;467;30062021115537
74;460;30062021115537
75;437;30062021115537
76;427;30062021115537
77;419;30062021115537
78;408;30062021115537
79;391;30062021115537
80;384;30062021115537
81;368;30062021115537
82;361;30062021115537
83;348;30062021115537
84;343;30062021115537
85;337;30062021115537
86;331;30062021115537
87;330;30062021115537
88;326;30062021115537
89;317;30062021115537
90;316;30062021115537
91;307;30062021115537
92;299;30062021115537
93;293;30062021115537
94;288;30062021115537
95;277;30062021115537
96;272;30062021115537
97;267;30062021115537
98;260;30062021115537
99;256;30062021115537
100;246;30062021115537
101;248;30062021115537
102;239;30062021115537
103;232;30062021115537
104;231;30062021115537
105;224;30062021115537
106;224;30062021115537
107;217;30062021115537
108;214;30062021115537
109;212;30062021115537
110;207;30062021115537
111;201;30062021115537
112;201;30062021115537
113;195;30062021115537
114;194;30062021115537
115;196;30062021115537
116;190;30062021115537
117;189;30062021115537
118;185;30062021115537
119;183;30062021115537
120;178;30062021115537
121;177;30062021115537
122;177;30062021115537
123;175;30062021115537
124;173;30062021115537
125;171;30062021115537
126;166;30062021115537
127;166;30062021115537
128;166;30062021115537
129;160;30062021115537
130;161;30062021115537
131;160;30062021115537
132;156;30062021115537
133;157;30062021115537
134;154;30062021115537
135;152;30062021115537
136;153;30062021115537
137;148;30062021115537
138;150;30062021115537
139;149;30062021115537
140;146;30062021115537
141;147;30062021115537
142;143;30062021115537
143;142;30062021115537
144;143;30062021115537
145;139;30062021115537
146;143;30062021115537
147;139;30062021115537
148;138;30062021115537
149;139;30062021115537
150;138;30062021115537
151;137;30062021115537
152;137;30062021115537
153;134;30062021115537
154;136;30062021115537
155;134;30062021115537
156;134;30062021115537
157;135;30062021115537
158;133;30062021115537
159;133;30062021115537
160;134;30062021115537
161;130;30062021115537
162;132;30062021115537
163;132;30062021115537
164;130;30062021115537
165;132;30062021115537
166;130;30062021115537
167;130;30062021115537
168;130;30062021115537
169;128;30062021115537
170;131;30062021115537
171;128;30062021115537
172;128;30062021115537
173;128;30062021115537
174;127;30062021115537
175;127;30062021115537
176;129;30062021115537
177;126;30062021115537
178;129;30062021115537
179;128;30062021115537
180;126;30062021115537
181;128;30062021115537
182;127;30062021115537
183;126;30062021115537
184;127;30062021115537
185;125;30062021115537
186;128;30062021115537
187;126;30062021115537
188;124;30062021115537
189;126;30062021115537
190;125;30062021115537
191;125;30062021115537
192;129;30062021115537
193;125;30062021115537
194;126;30062021115537
195;125;30062021115537
196;125;30062021115537
197;127;30062021115537
198;125;30062021115537
199;124;30062021115537
200;0;30062021115537
0;0;30062021115538
1;146;30062021115538
2;140;30062021115538
3;139;30062021115538
4;139;30062021115538
5;141;30062021115538
6;141;30062021115538
7;144;30062021115538
8;144;30062021115538
9;144;30062021115538
10;151;30062021115538
11;150;30062021115538
12;154;30062021115538
13;161;30062021115538
14;166;30062021115538
15;179;30062021115538
16;194;30062021115538
17;226;30062021115538
18;291;30062021115538
19;424;30062021115538
20;726;30062021115538
21;1023;30062021115538
22;1023;30062021115538
23;1023;30062021115538
24;1023;30062021115538
25;1023;30062021115538
26;1023;30062021115538
27;1023;30062021115538
28;1023;30062021115538
29;1023;30062021115538
30;1023;30062021115538
31;1023;30062021115538
32;1023;30062021115538
33;1023;30062021115538
34;1023;30062021115538
35;1023;30062021115538
36;1023;30062021115538
37;1023;30062021115538
38;887;30062021115538
39;728;30062021115538
40;608;30062021115538
41;532;30062021115538
42;489;30062021115538
43;451;30062021115538
44;428;30062021115538
45;410;30062021115538
46;399;30062021115538
47;395;30062021115538
48;399;30062021115538
49;394;30062021115538
50;398;30062021115538
51;401;30062021115538
52;402;30062021115538
53;410;30062021115538
54;412;30062021115538
55;426;30062021115538
56;433;30062021115538
57;444;30062021115538
58;458;30062021115538
59;467;30062021115538
60;478;30062021115538
61;488;30062021115538
62;500;30062021115538
63;507;30062021115538
64;514;30062021115538
65;510;30062021115538
66;521;30062021115538
67;515;30062021115538
68;510;30062021115538
69;507;30062021115538
70;497;30062021115538
71;492;30062021115538
72;481;30062021115538
73;466;30062021115538
74;456;30062021115538
75;442;30062021115538
76;431;30062021115538
77;420;30062021115538
78;404;30062021115538
79;392;30062021115538
80;378;30062021115538
81;368;30062021115538
82;361;30062021115538
83;349;30062021115538
84;344;30062021115538
85;338;30062021115538
86;335;30062021115538
87;329;30062021115538
88;329;30062021115538
89;317;30062021115538
90;315;30062021115538
91;308;30062021115538
92;298;30062021115538
93;296;30062021115538
94;285;30062021115538
95;276;30062021115538
96;275;30062021115538
97;261;30062021115538
98;260;30062021115538
99;251;30062021115538
100;246;30062021115538
101;248;30062021115538
102;237;30062021115538
103;235;30062021115538
104;233;30062021115538
105;225;30062021115538
106;223;30062021115538
107;218;30062021115538
108;214;30062021115538
109;212;30062021115538
110;204;30062021115538
111;203;30062021115538
112;202;30062021115538
113;194;30062021115538
114;194;30062021115538
115;192;30062021115538
116;190;30062021115538
117;191;30062021115538
118;183;30062021115538
119;184;30062021115538
120;179;30062021115538
121;176;30062021115538
122;176;30062021115538
123;175;30062021115538
124;172;30062021115538
125;170;30062021115538
126;166;30062021115538
127;165;30062021115538
128;165;30062021115538
129;161;30062021115538
130;162;30062021115538
131;161;30062021115538
132;155;30062021115538
133;159;30062021115538
134;154;30062021115538
135;151;30062021115538
136;152;30062021115538
137;149;30062021115538
138;150;30062021115538
139;148;30062021115538
140;146;30062021115538
141;146;30062021115538
142;144;30062021115538
143;142;30062021115538
144;142;30062021115538
145;138;30062021115538
146;142;30062021115538
147;140;30062021115538
148;137;30062021115538
149;138;30062021115538
150;137;30062021115538
151;137;30062021115538
152;136;30062021115538
153;134;30062021115538
154;136;30062021115538
155;133;30062021115538
156;133;30062021115538
157;134;30062021115538
158;132;30062021115538
159;132;30062021115538
160;133;30062021115538
161;130;30062021115538
162;132;30062021115538
163;131;30062021115538
164;129;30062021115538
165;132;30062021115538
166;130;30062021115538
167;128;30062021115538
168;130;30062021115538
169;127;30062021115538
170;130;30062021115538
171;128;30062021115538
172;127;30062021115538
173;128;30062021115538
174;128;30062021115538
175;127;30062021115538
176;128;30062021115538
177;126;30062021115538
178;127;30062021115538
179;127;30062021115538
180;125;30062021115538
181;127;30062021115538
182;126;30062021115538
183;126;30062021115538
184;127;30062021115538
185;124;30062021115538
186;127;30062021115538
187;125;30062021115538
188;125;30062021115538
189;125;30062021115538
190;124;30062021115538
191;125;30062021115538
192;128;30062021115538
193;125;30062021115538
194;126;30062021115538
195;125;30062021115538
196;124;30062021115538
197;125;30062021115538
198;126;30062021115538
199;123;30062021115538
200;0;30062021115538
0;0;30062021115539
1;146;30062021115539
2;140;30062021115539
3;139;30062021115539
4;140;30062021115539
5;142;30062021115539
6;141;30062021115539
7;143;30062021115539
8;145;30062021115539
9;145;30062021115539
10;150;30062021115539
11;149;30062021115539
12;154;30062021115539
13;162;30062021115539
14;167;30062021115539
15;178;30062021115539
16;194;30062021115539
17;224;30062021115539
18;291;30062021115539
19;426;30062021115539
20;725;30062021115539
21;1023;30062021115539
22;1023;30062021115539
23;1023;30062021115539
24;1023;30062021115539
25;1023;30062021115539
26;1023;30062021115539
27;1023;30062021115539
28;1023;30062021115539
29;1023;30062021115539
30;1023;30062021115539
31;1023;30062021115539
32;1023;30062021115539
33;1023;30062021115539
34;1023;30062021115539
35;1023;30062021115539
36;1023;30062021115539
37;1023;30062021115539
38;885;30062021115539
39;730;30062021115539
40;617;30062021115539
41;533;30062021115539
42;487;30062021115539
43;449;30062021115539
44;427;30062021115539
45;411;30062021115539
46;400;30062021115539
47;399;30062021115539
48;396;30062021115539
49;393;30062021115539
50;395;30062021115539
51;400;30062021115539
52;400;30062021115539
53;409;30062021115539
54;411;30062021115539
55;427;30062021115539
56;434;30062021115539
57;441;30062021115539
58;459;30062021115539
59;466;30062021115539
60;479;30062021115539
61;490;30062021115539
62;495;30062021115539
63;504;30062021115539
64;510;30062021115539
65;514;30062021115539
66;519;30062021115539
67;514;30062021115539
68;511;30062021115539
69;506;30062021115539
70;495;30062021115539
71;488;30062021115539
72;487;30062021115539
73;468;30062021115539
74;460;30062021115539
75;441;30062021115539
76;429;30062021115539
77;425;30062021115539
78;407;30062021115539
79;389;30062021115539
80;379;30062021115539
81;365;30062021115539
82;358;30062021115539
83;351;30062021115539
84;345;30062021115539
85;337;30062021115539
86;333;30062021115539
87;332;30062021115539
88;326;30062021115539
89;319;30062021115539
90;315;30062021115539
91;307;30062021115539
92;298;30062021115539
93;291;30062021115539
94;286;30062021115539
95;276;30062021115539
96;271;30062021115539
97;265;30062021115539
98;260;30062021115539
99;254;30062021115539
100;247;30062021115539
101;249;30062021115539
102;239;30062021115539
103;232;30062021115539
104;229;30062021115539
105;225;30062021115539
106;223;30062021115539
107;218;30062021115539
108;215;30062021115539
109;214;30062021115539
110;205;30062021115539
111;204;30062021115539
112;202;30062021115539
113;197;30062021115539
114;194;30062021115539
115;192;30062021115539
116;189;30062021115539
117;191;30062021115539
118;185;30062021115539
119;183;30062021115539
120;181;30062021115539
121;177;30062021115539
122;178;30062021115539
123;176;30062021115539
124;170;30062021115539
125;170;30062021115539
126;165;30062021115539
127;165;30062021115539
128;165;30062021115539
129;161;30062021115539
130;160;30062021115539
131;160;30062021115539
132;156;30062021115539
133;158;30062021115539
134;154;30062021115539
135;152;30062021115539
136;152;30062021115539
137;147;30062021115539
138;149;30062021115539
139;147;30062021115539
140;144;30062021115539
141;145;30062021115539
142;142;30062021115539
143;141;30062021115539
144;144;30062021115539
145;139;30062021115539
146;141;30062021115539
147;140;30062021115539
148;138;30062021115539
149;138;30062021115539
150;135;30062021115539
151;135;30062021115539
152;137;30062021115539
153;134;30062021115539
154;137;30062021115539
155;134;30062021115539
156;133;30062021115539
157;133;30062021115539
158;131;30062021115539
159;132;30062021115539
160;132;30062021115539
161;131;30062021115539
162;132;30062021115539
163;132;30062021115539
164;130;30062021115539
165;131;30062021115539
166;129;30062021115539
167;129;30062021115539
168;130;30062021115539
169;126;30062021115539
170;129;30062021115539
171;128;30062021115539
172;127;30062021115539
173;128;30062021115539
174;127;30062021115539
175;126;30062021115539
176;127;30062021115539
177;125;30062021115539
178;128;30062021115539
179;127;30062021115539
180;126;30062021115539
181;127;30062021115539
182;126;30062021115539
183;125;30062021115539
184;126;30062021115539
185;123;30062021115539
186;127;30062021115539
187;126;30062021115539
188;123;30062021115539
189;125;30062021115539
190;124;30062021115539
191;125;30062021115539
192;128;30062021115539
193;125;30062021115539
194;125;30062021115539
195;125;30062021115539
196;124;30062021115539
197;125;30062021115539
198;125;30062021115539
199;123;30062021115539
200;0;30062021115539
0;0;30062021115540
1;146;30062021115540
2;139;30062021115540
3;138;30062021115540
4;140;30062021115540
5;141;30062021115540
6;140;30062021115540
7;144;30062021115540
8;145;30062021115540
9;146;30062021115540
10;151;30062021115540
11;149;30062021115540
12;153;30062021115540
13;162;30062021115540
14;166;30062021115540
15;177;30062021115540
16;193;30062021115540
17;221;30062021115540
18;289;30062021115540
19;425;30062021115540
20;723;30062021115540
21;1023;30062021115540
22;1023;30062021115540
23;1023;30062021115540
24;1023;30062021115540
25;1023;30062021115540
26;1023;30062021115540
27;1023;30062021115540
28;1023;30062021115540
29;1023;30062021115540
30;1023;30062021115540
31;1023;30062021115540
32;1023;30062021115540
33;1023;30062021115540
34;1023;30062021115540
35;1023;30062021115540
36;1023;30062021115540
37;1023;30062021115540
38;894;30062021115540
39;735;30062021115540
40;617;30062021115540
41;534;30062021115540
42;487;30062021115540
43;450;30062021115540
44;429;30062021115540
45;413;30062021115540
46;401;30062021115540
47;398;30062021115540
48;395;30062021115540
49;392;30062021115540
50;399;30062021115540
51;401;30062021115540
52;399;30062021115540
53;412;30062021115540
54;416;30062021115540
55;423;30062021115540
56;435;30062021115540
57;438;30062021115540
58;460;30062021115540
59;466;30062021115540
60;478;30062021115540
61;488;30062021115540
62;491;30062021115540
63;508;30062021115540
64;510;30062021115540
65;511;30062021115540
66;524;30062021115540
67;515;30062021115540
68;515;30062021115540
69;508;30062021115540
70;497;30062021115540
71;487;30062021115540
72;481;30062021115540
73;466;30062021115540
74;458;30062021115540
75;442;30062021115540
76;432;30062021115540
77;421;30062021115540
78;406;30062021115540
79;391;30062021115540
80;383;30062021115540
81;366;30062021115540
82;361;30062021115540
83;348;30062021115540
84;342;30062021115540
85;339;30062021115540
86;334;30062021115540
87;330;30062021115540
88;324;30062021115540
89;321;30062021115540
90;315;30062021115540
91;306;30062021115540
92;299;30062021115540
93;295;30062021115540
94;284;30062021115540
95;277;30062021115540
96;271;30062021115540
97;261;30062021115540
98;260;30062021115540
99;254;30062021115540
100;248;30062021115540
101;243;30062021115540
102;240;30062021115540
103;235;30062021115540
104;232;30062021115540
105;225;30062021115540
106;224;30062021115540
107;217;30062021115540
108;215;30062021115540
109;211;30062021115540
110;205;30062021115540
111;201;30062021115540
112;199;30062021115540
113;197;30062021115540
114;193;30062021115540
115;193;30062021115540
116;190;30062021115540
117;191;30062021115540
118;184;30062021115540
119;183;30062021115540
120;181;30062021115540
121;176;30062021115540
122;175;30062021115540
123;175;30062021115540
124;170;30062021115540
125;172;30062021115540
126;168;30062021115540
127;166;30062021115540
128;166;30062021115540
129;161;30062021115540
130;161;30062021115540
131;156;30062021115540
132;155;30062021115540
133;159;30062021115540
134;153;30062021115540
135;152;30062021115540
136;151;30062021115540
137;148;30062021115540
138;149;30062021115540
139;147;30062021115540
140;145;30062021115540
141;147;30062021115540
142;143;30062021115540
143;141;30062021115540
144;143;30062021115540
145;139;30062021115540
146;140;30062021115540
147;139;30062021115540
148;138;30062021115540
149;138;30062021115540
150;137;30062021115540
151;136;30062021115540
152;137;30062021115540
153;133;30062021115540
154;136;30062021115540
155;134;30062021115540
156;132;30062021115540
157;133;30062021115540
158;131;30062021115540
159;131;30062021115540
160;133;30062021115540
161;131;30062021115540
162;132;30062021115540
163;131;30062021115540
164;129;30062021115540
165;132;30062021115540
166;130;30062021115540
167;129;30062021115540
168;130;30062021115540
169;127;30062021115540
170;129;30062021115540
171;128;30062021115540
172;127;30062021115540
173;128;30062021115540
174;127;30062021115540
175;126;30062021115540
176;127;30062021115540
177;126;30062021115540
178;128;30062021115540
179;126;30062021115540
180;126;30062021115540
181;127;30062021115540
182;127;30062021115540
183;126;30062021115540
184;128;30062021115540
185;124;30062021115540
186;126;30062021115540
187;125;30062021115540
188;123;30062021115540
189;125;30062021115540
190;125;30062021115540
191;125;30062021115540
192;126;30062021115540
193;124;30062021115540
194;124;30062021115540
195;124;30062021115540
196;124;30062021115540
197;125;30062021115540
198;125;30062021115540
199;124;30062021115540
200;0;30062021115540
0;0;30062021115541
1;146;30062021115541
2;140;30062021115541
3;138;30062021115541
4;140;30062021115541
5;141;30062021115541
6;140;30062021115541
7;143;30062021115541
8;146;30062021115541
9;146;30062021115541
10;151;30062021115541
11;150;30062021115541
12;152;30062021115541
13;162;30062021115541
14;166;30062021115541
15;176;30062021115541
16;193;30062021115541
17;224;30062021115541
18;292;30062021115541
19;428;30062021115541
20;722;30062021115541
21;1023;30062021115541
22;1023;30062021115541
23;1023;30062021115541
24;1023;30062021115541
25;1023;30062021115541
26;1023;30062021115541
27;1023;30062021115541
28;1023;30062021115541
29;1023;30062021115541
30;1023;30062021115541
31;1023;30062021115541
32;1023;30062021115541
33;1023;30062021115541
34;1023;30062021115541
35;1023;30062021115541
36;1023;30062021115541
37;1023;30062021115541
38;895;30062021115541
39;737;30062021115541
40;616;30062021115541
41;536;30062021115541
42;489;30062021115541
43;451;30062021115541
44;428;30062021115541
45;410;30062021115541
46;399;30062021115541
47;396;30062021115541
48;400;30062021115541
49;394;30062021115541
50;400;30062021115541
51;399;30062021115541
52;400;30062021115541
53;411;30062021115541
54;417;30062021115541
55;422;30062021115541
56;435;30062021115541
57;445;30062021115541
58;460;30062021115541
59;463;30062021115541
60;476;30062021115541
61;489;30062021115541
62;494;30062021115541
63;507;30062021115541
64;515;30062021115541
65;514;30062021115541
66;518;30062021115541
67;519;30062021115541
68;511;30062021115541
69;507;30062021115541
70;497;30062021115541
71;493;30062021115541
72;484;30062021115541
73;466;30062021115541
74;455;30062021115541
75;441;30062021115541
76;433;30062021115541
77;421;30062021115541
78;406;30062021115541
79;393;30062021115541
80;381;30062021115541
81;366;30062021115541
82;357;30062021115541
83;349;30062021115541
84;345;30062021115541
85;338;30062021115541
86;331;30062021115541
87;329;30062021115541
88;326;30062021115541
89;317;30062021115541
90;313;30062021115541
91;309;30062021115541
92;298;30062021115541
93;294;30062021115541
94;283;30062021115541
95;277;30062021115541
96;271;30062021115541
97;263;30062021115541
98;258;30062021115541
99;255;30062021115541
100;248;30062021115541
101;246;30062021115541
102;238;30062021115541
103;234;30062021115541
104;233;30062021115541
105;225;30062021115541
106;227;30062021115541
107;215;30062021115541
108;214;30062021115541
109;211;30062021115541
110;208;30062021115541
111;202;30062021115541
112;202;30062021115541
113;195;30062021115541
114;194;30062021115541
115;194;30062021115541
116;189;30062021115541
117;191;30062021115541
118;185;30062021115541
119;184;30062021115541
120;179;30062021115541
121;176;30062021115541
122;176;30062021115541
123;174;30062021115541
124;170;30062021115541
125;171;30062021115541
126;165;30062021115541
127;165;30062021115541
128;167;30062021115541
129;160;30062021115541
130;160;30062021115541
131;160;30062021115541
132;156;30062021115541
133;158;30062021115541
134;152;30062021115541
135;152;30062021115541
136;152;30062021115541
137;147;30062021115541
138;148;30062021115541
139;148;30062021115541
140;145;30062021115541
141;146;30062021115541
142;143;30062021115541
143;143;30062021115541
144;141;30062021115541
145;139;30062021115541
146;141;30062021115541
147;139;30062021115541
148;138;30062021115541
149;138;30062021115541
150;137;30062021115541
151;138;30062021115541
152;136;30062021115541
153;135;30062021115541
154;135;30062021115541
155;133;30062021115541
156;133;30062021115541
157;133;30062021115541
158;131;30062021115541
159;133;30062021115541
160;134;30062021115541
161;131;30062021115541
162;133;30062021115541
163;132;30062021115541
164;129;30062021115541
165;132;30062021115541
166;130;30062021115541
167;130;30062021115541
168;130;30062021115541
169;127;30062021115541
170;130;30062021115541
171;128;30062021115541
172;128;30062021115541
173;130;30062021115541
174;127;30062021115541
175;126;30062021115541
176;126;30062021115541
177;126;30062021115541
178;128;30062021115541
179;126;30062021115541
180;127;30062021115541
181;127;30062021115541
182;126;30062021115541
183;126;30062021115541
184;126;30062021115541
185;124;30062021115541
186;128;30062021115541
187;126;30062021115541
188;123;30062021115541
189;124;30062021115541
190;124;30062021115541
191;124;30062021115541
192;128;30062021115541
193;125;30062021115541
194;125;30062021115541
195;125;30062021115541
196;124;30062021115541
197;125;30062021115541
198;126;30062021115541
199;123;30062021115541
200;0;30062021115541
0;0;30062021115541
1;146;30062021115541
2;139;30062021115541
3;139;30062021115541
4;140;30062021115541
5;140;30062021115541
6;140;30062021115541
7;143;30062021115541
8;144;30062021115541
9;145;30062021115541
10;151;30062021115541
11;152;30062021115541
12;154;30062021115541
13;161;30062021115541
14;166;30062021115541
15;177;30062021115541
16;194;30062021115541
17;224;30062021115541
18;290;30062021115541
19;425;30062021115541
20;724;30062021115541
21;1023;30062021115541
22;1023;30062021115541
23;1023;30062021115541
24;1023;30062021115541
25;1023;30062021115541
26;1023;30062021115541
27;1023;30062021115541
28;1023;30062021115541
29;1023;30062021115541
30;1023;30062021115541
31;1023;30062021115541
32;1023;30062021115541
33;1023;30062021115541
34;1023;30062021115541
35;1023;30062021115541
36;1023;30062021115541
37;1023;30062021115541
38;894;30062021115541
39;736;30062021115541
40;620;30062021115541
41;535;30062021115541
42;489;30062021115541
43;450;30062021115541
44;429;30062021115541
45;413;30062021115541
46;398;30062021115541
47;401;30062021115541
48;399;30062021115541
49;396;30062021115541
50;398;30062021115541
51;401;30062021115541
52;399;30062021115541
53;415;30062021115541
54;417;30062021115541
55;427;30062021115541
56;432;30062021115541
57;445;30062021115541
58;463;30062021115541
59;467;30062021115541
60;477;30062021115541
61;492;30062021115541
62;496;30062021115541
63;508;30062021115541
64;515;30062021115541
65;513;30062021115541
66;516;30062021115541
67;519;30062021115541
68;511;30062021115541
69;507;30062021115541
70;494;30062021115541
71;491;30062021115541
72;490;30062021115541
73;470;30062021115541
74;458;30062021115541
75;444;30062021115541
76;430;30062021115541
77;418;30062021115541
78;406;30062021115541
79;392;30062021115541
80;381;30062021115541
81;363;30062021115541
82;358;30062021115541
83;348;30062021115541
84;343;30062021115541
85;338;30062021115541
86;335;30062021115541
87;332;30062021115541
88;326;30062021115541
89;320;30062021115541
90;316;30062021115541
91;310;30062021115541
92;300;30062021115541
93;294;30062021115541
94;286;30062021115541
95;275;30062021115541
96;273;30062021115541
97;262;30062021115541
98;260;30062021115541
99;254;30062021115541
100;246;30062021115541
101;245;30062021115541
102;240;30062021115541
103;234;30062021115541
104;231;30062021115541
105;225;30062021115541
106;226;30062021115541
107;217;30062021115541
108;212;30062021115541
109;210;30062021115541
110;205;30062021115541
111;203;30062021115541
112;202;30062021115541
113;193;30062021115541
114;193;30062021115541
115;193;30062021115541
116;189;30062021115541
117;190;30062021115541
118;184;30062021115541
119;185;30062021115541
120;180;30062021115541
121;177;30062021115541
122;176;30062021115541
123;174;30062021115541
124;171;30062021115541
125;171;30062021115541
126;167;30062021115541
127;166;30062021115541
128;165;30062021115541
129;161;30062021115541
130;160;30062021115541
131;160;30062021115541
132;156;30062021115541
133;159;30062021115541
134;152;30062021115541
135;152;30062021115541
136;152;30062021115541
137;147;30062021115541
138;150;30062021115541
139;146;30062021115541
140;145;30062021115541
141;147;30062021115541
142;143;30062021115541
143;142;30062021115541
144;143;30062021115541
145;140;30062021115541
146;141;30062021115541
147;140;30062021115541
148;139;30062021115541
149;139;30062021115541
150;137;30062021115541
151;137;30062021115541
152;136;30062021115541
153;134;30062021115541
154;136;30062021115541
155;133;30062021115541
156;134;30062021115541
157;133;30062021115541
158;132;30062021115541
159;132;30062021115541
160;132;30062021115541
161;129;30062021115541
162;132;30062021115541
163;131;30062021115541
164;130;30062021115541
165;131;30062021115541
166;130;30062021115541
167;129;30062021115541
168;131;30062021115541
169;127;30062021115541
170;131;30062021115541
171;128;30062021115541
172;128;30062021115541
173;128;30062021115541
174;127;30062021115541
175;126;30062021115541
176;128;30062021115541
177;126;30062021115541
178;128;30062021115541
179;127;30062021115541
180;126;30062021115541
181;127;30062021115541
182;127;30062021115541
183;125;30062021115541
184;127;30062021115541
185;124;30062021115541
186;127;30062021115541
187;125;30062021115541
188;124;30062021115541
189;125;30062021115541
190;124;30062021115541
191;125;30062021115541
192;127;30062021115541
193;125;30062021115541
194;125;30062021115541
195;125;30062021115541
196;123;30062021115541
197;125;30062021115541
198;125;30062021115541
199;123;30062021115541
200;0;30062021115541
0;0;30062021115542
1;146;30062021115542
2;140;30062021115542
3;140;30062021115542
4;141;30062021115542
5;141;30062021115542
6;140;30062021115542
7;144;30062021115542
8;146;30062021115542
9;145;30062021115542
10;150;30062021115542
11;151;30062021115542
12;154;30062021115542
13;160;30062021115542
14;165;30062021115542
15;176;30062021115542
16;192;30062021115542
17;221;30062021115542
18;292;30062021115542
19;426;30062021115542
20;721;30062021115542
21;1023;30062021115542
22;1023;30062021115542
23;1023;30062021115542
24;1023;30062021115542
25;1023;30062021115542
26;1023;30062021115542
27;1023;30062021115542
28;1023;30062021115542
29;1023;30062021115542
30;1023;30062021115542
31;1023;30062021115542
32;1023;30062021115542
33;1023;30062021115542
34;1023;30062021115542
35;1023;30062021115542
36;1023;30062021115542
37;1023;30062021115542
38;890;30062021115542
39;735;30062021115542
40;614;30062021115542
41;535;30062021115542
42;487;30062021115542
43;447;30062021115542
44;426;30062021115542
45;411;30062021115542
46;399;30062021115542
47;396;30062021115542
48;392;30062021115542
49;397;30062021115542
50;399;30062021115542
51;401;30062021115542
52;404;30062021115542
53;410;30062021115542
54;414;30062021115542
55;421;30062021115542
56;432;30062021115542
57;442;30062021115542
58;453;30062021115542
59;464;30062021115542
60;479;30062021115542
61;486;30062021115542
62;494;30062021115542
63;508;30062021115542
64;503;30062021115542
65;511;30062021115542
66;517;30062021115542
67;516;30062021115542
68;514;30062021115542
69;504;30062021115542
70;496;30062021115542
71;489;30062021115542
72;482;30062021115542
73;467;30062021115542
74;455;30062021115542
75;438;30062021115542
76;432;30062021115542
77;424;30062021115542
78;404;30062021115542
79;388;30062021115542
80;380;30062021115542
81;367;30062021115542
82;359;30062021115542
83;347;30062021115542
84;345;30062021115542
85;337;30062021115542
86;333;30062021115542
87;328;30062021115542
88;326;30062021115542
89;316;30062021115542
90;315;30062021115542
91;309;30062021115542
92;300;30062021115542
93;295;30062021115542
94;283;30062021115542
95;278;30062021115542
96;272;30062021115542
97;264;30062021115542
98;258;30062021115542
99;254;30062021115542
100;251;30062021115542
101;244;30062021115542
102;239;30062021115542
103;234;30062021115542
104;231;30062021115542
105;224;30062021115542
106;223;30062021115542
107;219;30062021115542
108;214;30062021115542
109;211;30062021115542
110;204;30062021115542
111;204;30062021115542
112;201;30062021115542
113;194;30062021115542
114;193;30062021115542
115;193;30062021115542
116;188;30062021115542
117;191;30062021115542
118;183;30062021115542
119;181;30062021115542
120;180;30062021115542
121;177;30062021115542
122;176;30062021115542
123;176;30062021115542
124;170;30062021115542
125;171;30062021115542
126;165;30062021115542
127;164;30062021115542
128;166;30062021115542
129;161;30062021115542
130;160;30062021115542
131;160;30062021115542
132;155;30062021115542
133;158;30062021115542
134;152;30062021115542
135;153;30062021115542
136;152;30062021115542
137;148;30062021115542
138;149;30062021115542
139;147;30062021115542
140;145;30062021115542
141;147;30062021115542
142;143;30062021115542
143;141;30062021115542
144;143;30062021115542
145;139;30062021115542
146;141;30062021115542
147;140;30062021115542
148;138;30062021115542
149;139;30062021115542
150;137;30062021115542
151;137;30062021115542
152;137;30062021115542
153;134;30062021115542
154;136;30062021115542
155;135;30062021115542
156;133;30062021115542
157;133;30062021115542
158;131;30062021115542
159;131;30062021115542
160;132;30062021115542
161;131;30062021115542
162;133;30062021115542
163;132;30062021115542
164;130;30062021115542
165;132;30062021115542
166;130;30062021115542
167;130;30062021115542
168;130;30062021115542
169;126;30062021115542
170;130;30062021115542
171;129;30062021115542
172;128;30062021115542
173;128;30062021115542
174;127;30062021115542
175;127;30062021115542
176;128;30062021115542
177;126;30062021115542
178;128;30062021115542
179;126;30062021115542
180;126;30062021115542
181;128;30062021115542
182;126;30062021115542
183;125;30062021115542
184;127;30062021115542
185;123;30062021115542
186;127;30062021115542
187;125;30062021115542
188;125;30062021115542
189;126;30062021115542
190;124;30062021115542
191;125;30062021115542
192;128;30062021115542
193;124;30062021115542
194;125;30062021115542
195;125;30062021115542
196;125;30062021115542
197;125;30062021115542
198;125;30062021115542
199;124;30062021115542
200;0;30062021115542
