ind;val;datetime
0;0;02082021180111
1;144;02082021180111
2;121;02082021180111
3;120;02082021180111
4;120;02082021180111
5;121;02082021180111
6;118;02082021180111
7;120;02082021180111
8;120;02082021180111
9;118;02082021180111
10;121;02082021180111
11;118;02082021180111
12;119;02082021180111
13;121;02082021180111
14;119;02082021180111
15;120;02082021180111
16;120;02082021180111
17;119;02082021180111
18;121;02082021180111
19;120;02082021180111
20;119;02082021180111
21;120;02082021180111
22;117;02082021180111
23;120;02082021180111
24;120;02082021180111
25;119;02082021180111
26;122;02082021180111
27;119;02082021180111
28;120;02082021180111
29;120;02082021180111
30;120;02082021180111
31;119;02082021180111
32;121;02082021180111
33;119;02082021180111
34;122;02082021180111
35;120;02082021180111
36;118;02082021180111
37;121;02082021180111
38;118;02082021180111
39;119;02082021180111
40;121;02082021180111
41;117;02082021180111
42;121;02082021180111
43;119;02082021180111
44;120;02082021180111
45;122;02082021180111
46;118;02082021180111
47;120;02082021180111
48;120;02082021180111
49;119;02082021180111
50;121;02082021180111
51;120;02082021180111
52;119;02082021180111
53;120;02082021180111
54;118;02082021180111
55;119;02082021180111
56;120;02082021180111
57;118;02082021180111
58;120;02082021180111
59;119;02082021180111
60;120;02082021180111
61;121;02082021180111
62;119;02082021180111
63;120;02082021180111
64;121;02082021180111
65;118;02082021180111
66;121;02082021180111
67;119;02082021180111
68;118;02082021180111
69;120;02082021180111
70;119;02082021180111
71;118;02082021180111
72;121;02082021180111
73;118;02082021180111
74;121;02082021180111
75;119;02082021180111
76;119;02082021180111
77;121;02082021180111
78;119;02082021180111
79;121;02082021180111
80;121;02082021180111
81;118;02082021180111
82;122;02082021180111
83;118;02082021180111
84;119;02082021180111
85;121;02082021180111
86;119;02082021180111
87;119;02082021180111
88;121;02082021180111
89;117;02082021180111
90;121;02082021180111
91;120;02082021180111
92;119;02082021180111
93;120;02082021180111
94;120;02082021180111
95;119;02082021180111
96;121;02082021180111
97;119;02082021180111
98;121;02082021180111
99;120;02082021180111
100;119;02082021180111
101;122;02082021180111
102;119;02082021180111
103;120;02082021180111
104;121;02082021180111
105;118;02082021180111
106;121;02082021180111
107;119;02082021180111
108;118;02082021180111
109;120;02082021180111
110;119;02082021180111
111;119;02082021180111
112;122;02082021180111
113;119;02082021180111
114;120;02082021180111
115;120;02082021180111
116;118;02082021180111
117;123;02082021180111
118;119;02082021180111
119;120;02082021180111
120;118;02082021180111
121;118;02082021180111
122;120;02082021180111
123;120;02082021180111
124;119;02082021180111
125;121;02082021180111
126;119;02082021180111
127;119;02082021180111
128;121;02082021180111
129;119;02082021180111
130;121;02082021180111
131;121;02082021180111
132;119;02082021180111
133;124;02082021180111
134;120;02082021180111
135;120;02082021180111
136;122;02082021180111
137;119;02082021180111
138;120;02082021180111
139;120;02082021180111
140;119;02082021180111
141;122;02082021180111
142;120;02082021180111
143;120;02082021180111
144;122;02082021180111
145;118;02082021180111
146;122;02082021180111
147;120;02082021180111
148;119;02082021180111
149;119;02082021180111
150;120;02082021180111
151;121;02082021180111
152;120;02082021180111
153;119;02082021180111
154;121;02082021180111
155;120;02082021180111
156;120;02082021180111
157;120;02082021180111
158;119;02082021180111
159;120;02082021180111
160;121;02082021180111
161;119;02082021180111
162;122;02082021180111
163;121;02082021180111
164;120;02082021180111
165;122;02082021180111
166;120;02082021180111
167;120;02082021180111
168;122;02082021180111
169;119;02082021180111
170;121;02082021180111
171;120;02082021180111
172;120;02082021180111
173;120;02082021180111
174;120;02082021180111
175;119;02082021180111
176;121;02082021180111
177;119;02082021180111
178;121;02082021180111
179;120;02082021180111
180;120;02082021180111
181;120;02082021180111
182;120;02082021180111
183;120;02082021180111
184;122;02082021180111
185;119;02082021180111
186;121;02082021180111
187;121;02082021180111
188;119;02082021180111
189;121;02082021180111
190;119;02082021180111
191;119;02082021180111
192;122;02082021180111
193;120;02082021180111
194;120;02082021180111
195;120;02082021180111
196;119;02082021180111
197;120;02082021180111
198;120;02082021180111
199;119;02082021180111
200;0;02082021180111
0;0;02082021180112
1;143;02082021180112
2;120;02082021180112
3;120;02082021180112
4;120;02082021180112
5;121;02082021180112
6;119;02082021180112
7;120;02082021180112
8;119;02082021180112
9;118;02082021180112
10;121;02082021180112
11;119;02082021180112
12;118;02082021180112
13;121;02082021180112
14;118;02082021180112
15;121;02082021180112
16;120;02082021180112
17;118;02082021180112
18;121;02082021180112
19;120;02082021180112
20;119;02082021180112
21;120;02082021180112
22;118;02082021180112
23;119;02082021180112
24;119;02082021180112
25;118;02082021180112
26;121;02082021180112
27;119;02082021180112
28;119;02082021180112
29;121;02082021180112
30;119;02082021180112
31;118;02082021180112
32;120;02082021180112
33;117;02082021180112
34;120;02082021180112
35;119;02082021180112
36;118;02082021180112
37;121;02082021180112
38;118;02082021180112
39;119;02082021180112
40;120;02082021180112
41;117;02082021180112
42;119;02082021180112
43;119;02082021180112
44;119;02082021180112
45;121;02082021180112
46;118;02082021180112
47;118;02082021180112
48;120;02082021180112
49;118;02082021180112
50;120;02082021180112
51;118;02082021180112
52;119;02082021180112
53;120;02082021180112
54;118;02082021180112
55;118;02082021180112
56;119;02082021180112
57;117;02082021180112
58;120;02082021180112
59;119;02082021180112
60;119;02082021180112
61;120;02082021180112
62;118;02082021180112
63;119;02082021180112
64;121;02082021180112
65;116;02082021180112
66;121;02082021180112
67;119;02082021180112
68;118;02082021180112
69;120;02082021180112
70;119;02082021180112
71;118;02082021180112
72;121;02082021180112
73;118;02082021180112
74;119;02082021180112
75;118;02082021180112
76;118;02082021180112
77;120;02082021180112
78;118;02082021180112
79;120;02082021180112
80;120;02082021180112
81;117;02082021180112
82;121;02082021180112
83;120;02082021180112
84;119;02082021180112
85;120;02082021180112
86;119;02082021180112
87;119;02082021180112
88;120;02082021180112
89;117;02082021180112
90;121;02082021180112
91;120;02082021180112
92;118;02082021180112
93;121;02082021180112
94;119;02082021180112
95;118;02082021180112
96;121;02082021180112
97;119;02082021180112
98;119;02082021180112
99;120;02082021180112
100;119;02082021180112
101;121;02082021180112
102;118;02082021180112
103;118;02082021180112
104;118;02082021180112
105;118;02082021180112
106;121;02082021180112
107;117;02082021180112
108;118;02082021180112
109;120;02082021180112
110;118;02082021180112
111;119;02082021180112
112;121;02082021180112
113;117;02082021180112
114;119;02082021180112
115;121;02082021180112
116;120;02082021180112
117;121;02082021180112
118;119;02082021180112
119;120;02082021180112
120;120;02082021180112
121;118;02082021180112
122;120;02082021180112
123;119;02082021180112
124;118;02082021180112
125;121;02082021180112
126;118;02082021180112
127;119;02082021180112
128;120;02082021180112
129;118;02082021180112
130;120;02082021180112
131;121;02082021180112
132;118;02082021180112
133;122;02082021180112
134;118;02082021180112
135;119;02082021180112
136;121;02082021180112
137;118;02082021180112
138;121;02082021180112
139;118;02082021180112
140;117;02082021180112
141;121;02082021180112
142;119;02082021180112
143;118;02082021180112
144;120;02082021180112
145;118;02082021180112
146;121;02082021180112
147;120;02082021180112
148;118;02082021180112
149;120;02082021180112
150;119;02082021180112
151;119;02082021180112
152;120;02082021180112
153;119;02082021180112
154;121;02082021180112
155;119;02082021180112
156;119;02082021180112
157;119;02082021180112
158;119;02082021180112
159;119;02082021180112
160;120;02082021180112
161;118;02082021180112
162;120;02082021180112
163;120;02082021180112
164;120;02082021180112
165;122;02082021180112
166;119;02082021180112
167;119;02082021180112
168;122;02082021180112
169;118;02082021180112
170;121;02082021180112
171;120;02082021180112
172;120;02082021180112
173;121;02082021180112
174;120;02082021180112
175;119;02082021180112
176;121;02082021180112
177;118;02082021180112
178;121;02082021180112
179;120;02082021180112
180;119;02082021180112
181;121;02082021180112
182;121;02082021180112
183;119;02082021180112
184;120;02082021180112
185;118;02082021180112
186;122;02082021180112
187;119;02082021180112
188;118;02082021180112
189;120;02082021180112
190;118;02082021180112
191;119;02082021180112
192;123;02082021180112
193;120;02082021180112
194;120;02082021180112
195;120;02082021180112
196;120;02082021180112
197;120;02082021180112
198;120;02082021180112
199;118;02082021180112
200;0;02082021180112
0;0;02082021180113
1;143;02082021180113
2;121;02082021180113
3;119;02082021180113
4;119;02082021180113
5;121;02082021180113
6;119;02082021180113
7;120;02082021180113
8;121;02082021180113
9;118;02082021180113
10;121;02082021180113
11;118;02082021180113
12;118;02082021180113
13;121;02082021180113
14;119;02082021180113
15;120;02082021180113
16;121;02082021180113
17;118;02082021180113
18;120;02082021180113
19;119;02082021180113
20;119;02082021180113
21;118;02082021180113
22;117;02082021180113
23;119;02082021180113
24;121;02082021180113
25;119;02082021180113
26;120;02082021180113
27;118;02082021180113
28;119;02082021180113
29;121;02082021180113
30;119;02082021180113
31;119;02082021180113
32;120;02082021180113
33;118;02082021180113
34;121;02082021180113
35;120;02082021180113
36;118;02082021180113
37;121;02082021180113
38;119;02082021180113
39;120;02082021180113
40;120;02082021180113
41;119;02082021180113
42;120;02082021180113
43;118;02082021180113
44;119;02082021180113
45;120;02082021180113
46;119;02082021180113
47;119;02082021180113
48;121;02082021180113
49;118;02082021180113
50;121;02082021180113
51;119;02082021180113
52;119;02082021180113
53;121;02082021180113
54;119;02082021180113
55;119;02082021180113
56;120;02082021180113
57;118;02082021180113
58;120;02082021180113
59;118;02082021180113
60;118;02082021180113
61;120;02082021180113
62;119;02082021180113
63;120;02082021180113
64;121;02082021180113
65;118;02082021180113
66;120;02082021180113
67;119;02082021180113
68;119;02082021180113
69;121;02082021180113
70;119;02082021180113
71;119;02082021180113
72;121;02082021180113
73;117;02082021180113
74;121;02082021180113
75;119;02082021180113
76;118;02082021180113
77;120;02082021180113
78;118;02082021180113
79;119;02082021180113
80;120;02082021180113
81;118;02082021180113
82;120;02082021180113
83;119;02082021180113
84;119;02082021180113
85;120;02082021180113
86;118;02082021180113
87;120;02082021180113
88;121;02082021180113
89;116;02082021180113
90;120;02082021180113
91;120;02082021180113
92;118;02082021180113
93;121;02082021180113
94;120;02082021180113
95;120;02082021180113
96;121;02082021180113
97;119;02082021180113
98;120;02082021180113
99;119;02082021180113
100;118;02082021180113
101;121;02082021180113
102;118;02082021180113
103;119;02082021180113
104;120;02082021180113
105;118;02082021180113
106;121;02082021180113
107;119;02082021180113
108;119;02082021180113
109;120;02082021180113
110;117;02082021180113
111;118;02082021180113
112;122;02082021180113
113;117;02082021180113
114;120;02082021180113
115;121;02082021180113
116;120;02082021180113
117;122;02082021180113
118;119;02082021180113
119;120;02082021180113
120;120;02082021180113
121;118;02082021180113
122;120;02082021180113
123;119;02082021180113
124;118;02082021180113
125;121;02082021180113
126;119;02082021180113
127;120;02082021180113
128;122;02082021180113
129;119;02082021180113
130;119;02082021180113
131;121;02082021180113
132;118;02082021180113
133;123;02082021180113
134;119;02082021180113
135;119;02082021180113
136;121;02082021180113
137;118;02082021180113
138;120;02082021180113
139;119;02082021180113
140;118;02082021180113
141;120;02082021180113
142;120;02082021180113
143;119;02082021180113
144;121;02082021180113
145;118;02082021180113
146;121;02082021180113
147;121;02082021180113
148;119;02082021180113
149;120;02082021180113
150;120;02082021180113
151;120;02082021180113
152;120;02082021180113
153;118;02082021180113
154;120;02082021180113
155;119;02082021180113
156;119;02082021180113
157;119;02082021180113
158;119;02082021180113
159;119;02082021180113
160;120;02082021180113
161;119;02082021180113
162;121;02082021180113
163;121;02082021180113
164;120;02082021180113
165;122;02082021180113
166;121;02082021180113
167;120;02082021180113
168;120;02082021180113
169;118;02082021180113
170;121;02082021180113
171;121;02082021180113
172;120;02082021180113
173;121;02082021180113
174;120;02082021180113
175;119;02082021180113
176;121;02082021180113
177;119;02082021180113
178;121;02082021180113
179;120;02082021180113
180;120;02082021180113
181;121;02082021180113
182;121;02082021180113
183;119;02082021180113
184;121;02082021180113
185;118;02082021180113
186;121;02082021180113
187;120;02082021180113
188;117;02082021180113
189;120;02082021180113
190;119;02082021180113
191;120;02082021180113
192;122;02082021180113
193;119;02082021180113
194;121;02082021180113
195;121;02082021180113
196;119;02082021180113
197;120;02082021180113
198;120;02082021180113
199;118;02082021180113
200;0;02082021180113
0;0;02082021180113
1;143;02082021180113
2;121;02082021180113
3;119;02082021180113
4;120;02082021180113
5;121;02082021180113
6;118;02082021180113
7;120;02082021180113
8;120;02082021180113
9;118;02082021180113
10;121;02082021180113
11;120;02082021180113
12;119;02082021180113
13;122;02082021180113
14;119;02082021180113
15;121;02082021180113
16;120;02082021180113
17;118;02082021180113
18;121;02082021180113
19;119;02082021180113
20;119;02082021180113
21;119;02082021180113
22;117;02082021180113
23;120;02082021180113
24;120;02082021180113
25;118;02082021180113
26;121;02082021180113
27;119;02082021180113
28;120;02082021180113
29;122;02082021180113
30;121;02082021180113
31;119;02082021180113
32;120;02082021180113
33;117;02082021180113
34;121;02082021180113
35;120;02082021180113
36;119;02082021180113
37;121;02082021180113
38;118;02082021180113
39;119;02082021180113
40;120;02082021180113
41;118;02082021180113
42;120;02082021180113
43;119;02082021180113
44;120;02082021180113
45;121;02082021180113
46;119;02082021180113
47;118;02082021180113
48;120;02082021180113
49;118;02082021180113
50;121;02082021180113
51;119;02082021180113
52;119;02082021180113
53;120;02082021180113
54;118;02082021180113
55;118;02082021180113
56;120;02082021180113
57;117;02082021180113
58;120;02082021180113
59;119;02082021180113
60;119;02082021180113
61;121;02082021180113
62;119;02082021180113
63;120;02082021180113
64;121;02082021180113
65;117;02082021180113
66;121;02082021180113
67;118;02082021180113
68;118;02082021180113
69;122;02082021180113
70;118;02082021180113
71;118;02082021180113
72;120;02082021180113
73;117;02082021180113
74;120;02082021180113
75;119;02082021180113
76;119;02082021180113
77;120;02082021180113
78;118;02082021180113
79;120;02082021180113
80;120;02082021180113
81;118;02082021180113
82;122;02082021180113
83;119;02082021180113
84;118;02082021180113
85;120;02082021180113
86;118;02082021180113
87;120;02082021180113
88;121;02082021180113
89;117;02082021180113
90;120;02082021180113
91;120;02082021180113
92;117;02082021180113
93;122;02082021180113
94;120;02082021180113
95;119;02082021180113
96;121;02082021180113
97;119;02082021180113
98;119;02082021180113
99;120;02082021180113
100;119;02082021180113
101;121;02082021180113
102;120;02082021180113
103;119;02082021180113
104;119;02082021180113
105;118;02082021180113
106;121;02082021180113
107;119;02082021180113
108;119;02082021180113
109;121;02082021180113
110;119;02082021180113
111;119;02082021180113
112;120;02082021180113
113;118;02082021180113
114;120;02082021180113
115;120;02082021180113
116;119;02082021180113
117;122;02082021180113
118;120;02082021180113
119;120;02082021180113
120;119;02082021180113
121;118;02082021180113
122;120;02082021180113
123;119;02082021180113
124;118;02082021180113
125;121;02082021180113
126;119;02082021180113
127;119;02082021180113
128;122;02082021180113
129;119;02082021180113
130;119;02082021180113
131;121;02082021180113
132;118;02082021180113
133;122;02082021180113
134;119;02082021180113
135;119;02082021180113
136;120;02082021180113
137;118;02082021180113
138;121;02082021180113
139;119;02082021180113
140;119;02082021180113
141;121;02082021180113
142;119;02082021180113
143;119;02082021180113
144;120;02082021180113
145;118;02082021180113
146;121;02082021180113
147;121;02082021180113
148;120;02082021180113
149;120;02082021180113
150;119;02082021180113
151;120;02082021180113
152;120;02082021180113
153;118;02082021180113
154;121;02082021180113
155;119;02082021180113
156;118;02082021180113
157;121;02082021180113
158;119;02082021180113
159;120;02082021180113
160;120;02082021180113
161;119;02082021180113
162;121;02082021180113
163;120;02082021180113
164;119;02082021180113
165;121;02082021180113
166;119;02082021180113
167;120;02082021180113
168;121;02082021180113
169;117;02082021180113
170;121;02082021180113
171;120;02082021180113
172;119;02082021180113
173;121;02082021180113
174;119;02082021180113
175;118;02082021180113
176;120;02082021180113
177;118;02082021180113
178;121;02082021180113
179;121;02082021180113
180;119;02082021180113
181;121;02082021180113
182;120;02082021180113
183;120;02082021180113
184;121;02082021180113
185;119;02082021180113
186;122;02082021180113
187;119;02082021180113
188;118;02082021180113
189;120;02082021180113
190;120;02082021180113
191;119;02082021180113
192;123;02082021180113
193;119;02082021180113
194;119;02082021180113
195;120;02082021180113
196;119;02082021180113
197;121;02082021180113
198;120;02082021180113
199;120;02082021180113
200;0;02082021180113
0;0;02082021180114
1;143;02082021180114
2;121;02082021180114
3;119;02082021180114
4;120;02082021180114
5;120;02082021180114
6;118;02082021180114
7;119;02082021180114
8;120;02082021180114
9;117;02082021180114
10;121;02082021180114
11;119;02082021180114
12;119;02082021180114
13;121;02082021180114
14;119;02082021180114
15;121;02082021180114
16;119;02082021180114
17;118;02082021180114
18;121;02082021180114
19;120;02082021180114
20;119;02082021180114
21;120;02082021180114
22;117;02082021180114
23;119;02082021180114
24;120;02082021180114
25;118;02082021180114
26;121;02082021180114
27;119;02082021180114
28;120;02082021180114
29;122;02082021180114
30;120;02082021180114
31;119;02082021180114
32;120;02082021180114
33;118;02082021180114
34;121;02082021180114
35;120;02082021180114
36;119;02082021180114
37;121;02082021180114
38;118;02082021180114
39;119;02082021180114
40;120;02082021180114
41;117;02082021180114
42;121;02082021180114
43;120;02082021180114
44;120;02082021180114
45;121;02082021180114
46;119;02082021180114
47;119;02082021180114
48;120;02082021180114
49;118;02082021180114
50;122;02082021180114
51;118;02082021180114
52;118;02082021180114
53;120;02082021180114
54;118;02082021180114
55;118;02082021180114
56;119;02082021180114
57;118;02082021180114
58;120;02082021180114
59;120;02082021180114
60;120;02082021180114
61;120;02082021180114
62;119;02082021180114
63;119;02082021180114
64;121;02082021180114
65;117;02082021180114
66;120;02082021180114
67;118;02082021180114
68;118;02082021180114
69;121;02082021180114
70;118;02082021180114
71;118;02082021180114
72;120;02082021180114
73;117;02082021180114
74;120;02082021180114
75;118;02082021180114
76;118;02082021180114
77;120;02082021180114
78;118;02082021180114
79;120;02082021180114
80;121;02082021180114
81;117;02082021180114
82;121;02082021180114
83;118;02082021180114
84;118;02082021180114
85;120;02082021180114
86;119;02082021180114
87;119;02082021180114
88;120;02082021180114
89;116;02082021180114
90;122;02082021180114
91;120;02082021180114
92;118;02082021180114
93;121;02082021180114
94;120;02082021180114
95;119;02082021180114
96;121;02082021180114
97;120;02082021180114
98;119;02082021180114
99;121;02082021180114
100;119;02082021180114
101;122;02082021180114
102;120;02082021180114
103;119;02082021180114
104;119;02082021180114
105;117;02082021180114
106;121;02082021180114
107;119;02082021180114
108;118;02082021180114
109;120;02082021180114
110;118;02082021180114
111;119;02082021180114
112;122;02082021180114
113;119;02082021180114
114;120;02082021180114
115;120;02082021180114
116;119;02082021180114
117;122;02082021180114
118;119;02082021180114
119;120;02082021180114
120;119;02082021180114
121;119;02082021180114
122;120;02082021180114
123;119;02082021180114
124;118;02082021180114
125;120;02082021180114
126;118;02082021180114
127;118;02082021180114
128;121;02082021180114
129;119;02082021180114
130;120;02082021180114
131;120;02082021180114
132;118;02082021180114
133;123;02082021180114
134;119;02082021180114
135;119;02082021180114
136;120;02082021180114
137;119;02082021180114
138;120;02082021180114
139;120;02082021180114
140;118;02082021180114
141;121;02082021180114
142;119;02082021180114
143;119;02082021180114
144;121;02082021180114
145;118;02082021180114
146;121;02082021180114
147;121;02082021180114
148;119;02082021180114
149;119;02082021180114
150;119;02082021180114
151;119;02082021180114
152;120;02082021180114
153;119;02082021180114
154;121;02082021180114
155;119;02082021180114
156;118;02082021180114
157;119;02082021180114
158;119;02082021180114
159;120;02082021180114
160;121;02082021180114
161;119;02082021180114
162;121;02082021180114
163;121;02082021180114
164;119;02082021180114
165;121;02082021180114
166;119;02082021180114
167;120;02082021180114
168;121;02082021180114
169;119;02082021180114
170;121;02082021180114
171;120;02082021180114
172;119;02082021180114
173;121;02082021180114
174;121;02082021180114
175;119;02082021180114
176;120;02082021180114
177;119;02082021180114
178;121;02082021180114
179;120;02082021180114
180;119;02082021180114
181;121;02082021180114
182;120;02082021180114
183;120;02082021180114
184;121;02082021180114
185;119;02082021180114
186;121;02082021180114
187;120;02082021180114
188;118;02082021180114
189;120;02082021180114
190;119;02082021180114
191;121;02082021180114
192;123;02082021180114
193;119;02082021180114
194;119;02082021180114
195;120;02082021180114
196;118;02082021180114
197;121;02082021180114
198;120;02082021180114
199;119;02082021180114
200;0;02082021180114
0;0;02082021180114
1;144;02082021180114
2;121;02082021180114
3;120;02082021180114
4;121;02082021180114
5;121;02082021180114
6;118;02082021180114
7;120;02082021180114
8;121;02082021180114
9;118;02082021180114
10;121;02082021180114
11;118;02082021180114
12;118;02082021180114
13;120;02082021180114
14;118;02082021180114
15;121;02082021180114
16;121;02082021180114
17;118;02082021180114
18;121;02082021180114
19;120;02082021180114
20;119;02082021180114
21;119;02082021180114
22;118;02082021180114
23;120;02082021180114
24;121;02082021180114
25;119;02082021180114
26;120;02082021180114
27;118;02082021180114
28;119;02082021180114
29;122;02082021180114
30;120;02082021180114
31;119;02082021180114
32;121;02082021180114
33;118;02082021180114
34;122;02082021180114
35;120;02082021180114
36;118;02082021180114
37;120;02082021180114
38;117;02082021180114
39;120;02082021180114
40;121;02082021180114
41;118;02082021180114
42;120;02082021180114
43;119;02082021180114
44;119;02082021180114
45;122;02082021180114
46;119;02082021180114
47;119;02082021180114
48;121;02082021180114
49;118;02082021180114
50;122;02082021180114
51;118;02082021180114
52;119;02082021180114
53;120;02082021180114
54;119;02082021180114
55;119;02082021180114
56;120;02082021180114
57;120;02082021180114
58;121;02082021180114
59;119;02082021180114
60;120;02082021180114
61;120;02082021180114
62;119;02082021180114
63;119;02082021180114
64;122;02082021180114
65;118;02082021180114
66;121;02082021180114
67;119;02082021180114
68;118;02082021180114
69;121;02082021180114
70;118;02082021180114
71;119;02082021180114
72;121;02082021180114
73;118;02082021180114
74;121;02082021180114
75;119;02082021180114
76;119;02082021180114
77;120;02082021180114
78;119;02082021180114
79;119;02082021180114
80;121;02082021180114
81;117;02082021180114
82;122;02082021180114
83;119;02082021180114
84;119;02082021180114
85;121;02082021180114
86;118;02082021180114
87;119;02082021180114
88;121;02082021180114
89;117;02082021180114
90;120;02082021180114
91;120;02082021180114
92;118;02082021180114
93;121;02082021180114
94;120;02082021180114
95;118;02082021180114
96;121;02082021180114
97;118;02082021180114
98;120;02082021180114
99;119;02082021180114
100;118;02082021180114
101;121;02082021180114
102;119;02082021180114
103;119;02082021180114
104;121;02082021180114
105;119;02082021180114
106;121;02082021180114
107;119;02082021180114
108;119;02082021180114
109;121;02082021180114
110;117;02082021180114
111;120;02082021180114
112;122;02082021180114
113;118;02082021180114
114;119;02082021180114
115;121;02082021180114
116;119;02082021180114
117;122;02082021180114
118;119;02082021180114
119;120;02082021180114
120;119;02082021180114
121;118;02082021180114
122;120;02082021180114
123;120;02082021180114
124;118;02082021180114
125;121;02082021180114
126;119;02082021180114
127;119;02082021180114
128;121;02082021180114
129;119;02082021180114
130;120;02082021180114
131;121;02082021180114
132;118;02082021180114
133;123;02082021180114
134;119;02082021180114
135;119;02082021180114
136;121;02082021180114
137;119;02082021180114
138;121;02082021180114
139;120;02082021180114
140;118;02082021180114
141;121;02082021180114
142;120;02082021180114
143;119;02082021180114
144;121;02082021180114
145;118;02082021180114
146;122;02082021180114
147;120;02082021180114
148;119;02082021180114
149;120;02082021180114
150;120;02082021180114
151;119;02082021180114
152;120;02082021180114
153;119;02082021180114
154;121;02082021180114
155;119;02082021180114
156;118;02082021180114
157;119;02082021180114
158;118;02082021180114
159;119;02082021180114
160;121;02082021180114
161;119;02082021180114
162;121;02082021180114
163;121;02082021180114
164;120;02082021180114
165;121;02082021180114
166;119;02082021180114
167;120;02082021180114
168;121;02082021180114
169;119;02082021180114
170;120;02082021180114
171;120;02082021180114
172;119;02082021180114
173;121;02082021180114
174;119;02082021180114
175;119;02082021180114
176;121;02082021180114
177;119;02082021180114
178;120;02082021180114
179;120;02082021180114
180;119;02082021180114
181;121;02082021180114
182;121;02082021180114
183;119;02082021180114
184;121;02082021180114
185;118;02082021180114
186;123;02082021180114
187;120;02082021180114
188;118;02082021180114
189;119;02082021180114
190;118;02082021180114
191;119;02082021180114
192;122;02082021180114
193;119;02082021180114
194;120;02082021180114
195;121;02082021180114
196;118;02082021180114
197;120;02082021180114
198;121;02082021180114
199;120;02082021180114
200;0;02082021180114
0;0;02082021180115
1;143;02082021180115
2;122;02082021180115
3;119;02082021180115
4;120;02082021180115
5;121;02082021180115
6;117;02082021180115
7;120;02082021180115
8;120;02082021180115
9;118;02082021180115
10;121;02082021180115
11;118;02082021180115
12;119;02082021180115
13;121;02082021180115
14;120;02082021180115
15;121;02082021180115
16;120;02082021180115
17;118;02082021180115
18;121;02082021180115
19;120;02082021180115
20;119;02082021180115
21;119;02082021180115
22;117;02082021180115
23;120;02082021180115
24;120;02082021180115
25;119;02082021180115
26;121;02082021180115
27;120;02082021180115
28;119;02082021180115
29;122;02082021180115
30;120;02082021180115
31;119;02082021180115
32;120;02082021180115
33;117;02082021180115
34;121;02082021180115
35;120;02082021180115
36;119;02082021180115
37;122;02082021180115
38;119;02082021180115
39;120;02082021180115
40;120;02082021180115
41;118;02082021180115
42;121;02082021180115
43;120;02082021180115
44;120;02082021180115
45;121;02082021180115
46;119;02082021180115
47;119;02082021180115
48;121;02082021180115
49;119;02082021180115
50;122;02082021180115
51;119;02082021180115
52;119;02082021180115
53;121;02082021180115
54;119;02082021180115
55;118;02082021180115
56;120;02082021180115
57;119;02082021180115
58;121;02082021180115
59;120;02082021180115
60;120;02082021180115
61;120;02082021180115
62;119;02082021180115
63;119;02082021180115
64;122;02082021180115
65;118;02082021180115
66;121;02082021180115
67;120;02082021180115
68;119;02082021180115
69;122;02082021180115
70;119;02082021180115
71;119;02082021180115
72;122;02082021180115
73;118;02082021180115
74;121;02082021180115
75;118;02082021180115
76;118;02082021180115
77;121;02082021180115
78;118;02082021180115
79;120;02082021180115
80;121;02082021180115
81;119;02082021180115
82;122;02082021180115
83;120;02082021180115
84;118;02082021180115
85;119;02082021180115
86;119;02082021180115
87;120;02082021180115
88;121;02082021180115
89;117;02082021180115
90;121;02082021180115
91;119;02082021180115
92;118;02082021180115
93;121;02082021180115
94;120;02082021180115
95;119;02082021180115
96;121;02082021180115
97;120;02082021180115
98;120;02082021180115
99;120;02082021180115
100;119;02082021180115
101;122;02082021180115
102;120;02082021180115
103;120;02082021180115
104;120;02082021180115
105;118;02082021180115
106;122;02082021180115
107;119;02082021180115
108;119;02082021180115
109;121;02082021180115
110;118;02082021180115
111;119;02082021180115
112;122;02082021180115
113;119;02082021180115
114;120;02082021180115
115;120;02082021180115
116;119;02082021180115
117;122;02082021180115
118;119;02082021180115
119;120;02082021180115
120;120;02082021180115
121;119;02082021180115
122;120;02082021180115
123;119;02082021180115
124;119;02082021180115
125;121;02082021180115
126;119;02082021180115
127;119;02082021180115
128;122;02082021180115
129;119;02082021180115
130;120;02082021180115
131;121;02082021180115
132;118;02082021180115
133;123;02082021180115
134;119;02082021180115
135;120;02082021180115
136;122;02082021180115
137;119;02082021180115
138;120;02082021180115
139;119;02082021180115
140;119;02082021180115
141;121;02082021180115
142;119;02082021180115
143;119;02082021180115
144;122;02082021180115
145;119;02082021180115
146;122;02082021180115
147;121;02082021180115
148;119;02082021180115
149;120;02082021180115
150;119;02082021180115
151;120;02082021180115
152;121;02082021180115
153;119;02082021180115
154;122;02082021180115
155;119;02082021180115
156;119;02082021180115
157;120;02082021180115
158;120;02082021180115
159;118;02082021180115
160;121;02082021180115
161;119;02082021180115
162;121;02082021180115
163;121;02082021180115
164;120;02082021180115
165;123;02082021180115
166;121;02082021180115
167;122;02082021180115
168;121;02082021180115
169;118;02082021180115
170;122;02082021180115
171;120;02082021180115
172;120;02082021180115
173;121;02082021180115
174;119;02082021180115
175;119;02082021180115
176;122;02082021180115
177;119;02082021180115
178;122;02082021180115
179;121;02082021180115
180;120;02082021180115
181;122;02082021180115
182;121;02082021180115
183;119;02082021180115
184;121;02082021180115
185;119;02082021180115
186;122;02082021180115
187;121;02082021180115
188;119;02082021180115
189;121;02082021180115
190;119;02082021180115
191;119;02082021180115
192;123;02082021180115
193;120;02082021180115
194;120;02082021180115
195;121;02082021180115
196;119;02082021180115
197;121;02082021180115
198;122;02082021180115
199;119;02082021180115
200;0;02082021180115
0;0;02082021180115
1;143;02082021180115
2;121;02082021180115
3;119;02082021180115
4;120;02082021180115
5;121;02082021180115
6;119;02082021180115
7;120;02082021180115
8;121;02082021180115
9;118;02082021180115
10;121;02082021180115
11;118;02082021180115
12;118;02082021180115
13;121;02082021180115
14;120;02082021180115
15;121;02082021180115
16;120;02082021180115
17;118;02082021180115
18;121;02082021180115
19;119;02082021180115
20;118;02082021180115
21;119;02082021180115
22;118;02082021180115
23;121;02082021180115
24;121;02082021180115
25;119;02082021180115
26;121;02082021180115
27;119;02082021180115
28;120;02082021180115
29;122;02082021180115
30;119;02082021180115
31;120;02082021180115
32;121;02082021180115
33;118;02082021180115
34;121;02082021180115
35;119;02082021180115
36;118;02082021180115
37;122;02082021180115
38;119;02082021180115
39;120;02082021180115
40;120;02082021180115
41;118;02082021180115
42;121;02082021180115
43;119;02082021180115
44;118;02082021180115
45;121;02082021180115
46;119;02082021180115
47;119;02082021180115
48;121;02082021180115
49;119;02082021180115
50;122;02082021180115
51;119;02082021180115
52;118;02082021180115
53;120;02082021180115
54;119;02082021180115
55;118;02082021180115
56;120;02082021180115
57;119;02082021180115
58;119;02082021180115
59;119;02082021180115
60;120;02082021180115
61;121;02082021180115
62;119;02082021180115
63;120;02082021180115
64;121;02082021180115
65;119;02082021180115
66;121;02082021180115
67;120;02082021180115
68;119;02082021180115
69;121;02082021180115
70;119;02082021180115
71;119;02082021180115
72;122;02082021180115
73;118;02082021180115
74;121;02082021180115
75;119;02082021180115
76;119;02082021180115
77;120;02082021180115
78;119;02082021180115
79;119;02082021180115
80;120;02082021180115
81;118;02082021180115
82;121;02082021180115
83;119;02082021180115
84;119;02082021180115
85;121;02082021180115
86;119;02082021180115
87;119;02082021180115
88;120;02082021180115
89;118;02082021180115
90;121;02082021180115
91;120;02082021180115
92;118;02082021180115
93;121;02082021180115
94;119;02082021180115
95;119;02082021180115
96;122;02082021180115
97;119;02082021180115
98;120;02082021180115
99;120;02082021180115
100;118;02082021180115
101;121;02082021180115
102;119;02082021180115
103;120;02082021180115
104;120;02082021180115
105;117;02082021180115
106;121;02082021180115
107;119;02082021180115
108;119;02082021180115
109;122;02082021180115
110;119;02082021180115
111;119;02082021180115
112;120;02082021180115
113;119;02082021180115
114;121;02082021180115
115;121;02082021180115
116;119;02082021180115
117;122;02082021180115
118;119;02082021180115
119;120;02082021180115
120;119;02082021180115
121;119;02082021180115
122;120;02082021180115
123;120;02082021180115
124;118;02082021180115
125;121;02082021180115
126;119;02082021180115
127;120;02082021180115
128;122;02082021180115
129;119;02082021180115
130;119;02082021180115
131;120;02082021180115
132;118;02082021180115
133;123;02082021180115
134;120;02082021180115
135;120;02082021180115
136;122;02082021180115
137;119;02082021180115
138;121;02082021180115
139;119;02082021180115
140;119;02082021180115
141;121;02082021180115
142;120;02082021180115
143;119;02082021180115
144;121;02082021180115
145;118;02082021180115
146;122;02082021180115
147;121;02082021180115
148;119;02082021180115
149;120;02082021180115
150;120;02082021180115
151;120;02082021180115
152;120;02082021180115
153;119;02082021180115
154;122;02082021180115
155;120;02082021180115
156;119;02082021180115
157;120;02082021180115
158;119;02082021180115
159;120;02082021180115
160;121;02082021180115
161;120;02082021180115
162;120;02082021180115
163;120;02082021180115
164;119;02082021180115
165;122;02082021180115
166;121;02082021180115
167;121;02082021180115
168;122;02082021180115
169;118;02082021180115
170;122;02082021180115
171;121;02082021180115
172;120;02082021180115
173;121;02082021180115
174;120;02082021180115
175;120;02082021180115
176;121;02082021180115
177;119;02082021180115
178;122;02082021180115
179;121;02082021180115
180;121;02082021180115
181;121;02082021180115
182;121;02082021180115
183;120;02082021180115
184;120;02082021180115
185;118;02082021180115
186;122;02082021180115
187;121;02082021180115
188;119;02082021180115
189;120;02082021180115
190;120;02082021180115
191;120;02082021180115
192;123;02082021180115
193;120;02082021180115
194;120;02082021180115
195;120;02082021180115
196;119;02082021180115
197;121;02082021180115
198;121;02082021180115
199;120;02082021180115
200;0;02082021180115
0;0;02082021180115
1;143;02082021180115
2;121;02082021180115
3;119;02082021180115
4;120;02082021180115
5;120;02082021180115
6;118;02082021180115
7;119;02082021180115
8;121;02082021180115
9;119;02082021180115
10;122;02082021180115
11;119;02082021180115
12;119;02082021180115
13;121;02082021180115
14;119;02082021180115
15;120;02082021180115
16;121;02082021180115
17;118;02082021180115
18;121;02082021180115
19;120;02082021180115
20;119;02082021180115
21;120;02082021180115
22;117;02082021180115
23;120;02082021180115
24;120;02082021180115
25;119;02082021180115
26;121;02082021180115
27;119;02082021180115
28;119;02082021180115
29;121;02082021180115
30;119;02082021180115
31;119;02082021180115
32;120;02082021180115
33;117;02082021180115
34;121;02082021180115
35;121;02082021180115
36;118;02082021180115
37;121;02082021180115
38;118;02082021180115
39;119;02082021180115
40;121;02082021180115
41;117;02082021180115
42;121;02082021180115
43;119;02082021180115
44;119;02082021180115
45;121;02082021180115
46;118;02082021180115
47;119;02082021180115
48;120;02082021180115
49;118;02082021180115
50;121;02082021180115
51;119;02082021180115
52;118;02082021180115
53;120;02082021180115
54;118;02082021180115
55;118;02082021180115
56;119;02082021180115
57;118;02082021180115
58;120;02082021180115
59;120;02082021180115
60;119;02082021180115
61;120;02082021180115
62;119;02082021180115
63;120;02082021180115
64;121;02082021180115
65;118;02082021180115
66;120;02082021180115
67;119;02082021180115
68;118;02082021180115
69;122;02082021180115
70;118;02082021180115
71;118;02082021180115
72;121;02082021180115
73;118;02082021180115
74;121;02082021180115
75;118;02082021180115
76;118;02082021180115
77;120;02082021180115
78;118;02082021180115
79;119;02082021180115
80;121;02082021180115
81;119;02082021180115
82;121;02082021180115
83;119;02082021180115
84;119;02082021180115
85;121;02082021180115
86;118;02082021180115
87;119;02082021180115
88;120;02082021180115
89;117;02082021180115
90;120;02082021180115
91;120;02082021180115
92;118;02082021180115
93;121;02082021180115
94;120;02082021180115
95;119;02082021180115
96;120;02082021180115
97;119;02082021180115
98;120;02082021180115
99;120;02082021180115
100;119;02082021180115
101;121;02082021180115
102;119;02082021180115
103;119;02082021180115
104;120;02082021180115
105;119;02082021180115
106;122;02082021180115
107;118;02082021180115
108;118;02082021180115
109;120;02082021180115
110;118;02082021180115
111;119;02082021180115
112;122;02082021180115
113;118;02082021180115
114;120;02082021180115
115;120;02082021180115
116;118;02082021180115
117;122;02082021180115
118;119;02082021180115
119;120;02082021180115
120;119;02082021180115
121;118;02082021180115
122;120;02082021180115
123;120;02082021180115
124;119;02082021180115
125;121;02082021180115
126;120;02082021180115
127;120;02082021180115
128;122;02082021180115
129;119;02082021180115
130;119;02082021180115
131;121;02082021180115
132;119;02082021180115
133;123;02082021180115
134;118;02082021180115
135;120;02082021180115
136;121;02082021180115
137;118;02082021180115
138;121;02082021180115
139;119;02082021180115
140;118;02082021180115
141;121;02082021180115
142;120;02082021180115
143;119;02082021180115
144;120;02082021180115
145;118;02082021180115
146;121;02082021180115
147;120;02082021180115
148;118;02082021180115
149;120;02082021180115
150;119;02082021180115
151;120;02082021180115
152;121;02082021180115
153;119;02082021180115
154;121;02082021180115
155;119;02082021180115
156;119;02082021180115
157;120;02082021180115
158;119;02082021180115
159;119;02082021180115
160;121;02082021180115
161;120;02082021180115
162;121;02082021180115
163;121;02082021180115
164;119;02082021180115
165;122;02082021180115
166;120;02082021180115
167;120;02082021180115
168;123;02082021180115
169;119;02082021180115
170;120;02082021180115
171;120;02082021180115
172;120;02082021180115
173;122;02082021180115
174;121;02082021180115
175;118;02082021180115
176;120;02082021180115
177;118;02082021180115
178;121;02082021180115
179;120;02082021180115
180;119;02082021180115
181;122;02082021180115
182;120;02082021180115
183;120;02082021180115
184;121;02082021180115
185;118;02082021180115
186;122;02082021180115
187;119;02082021180115
188;119;02082021180115
189;120;02082021180115
190;119;02082021180115
191;121;02082021180115
192;124;02082021180115
193;120;02082021180115
194;121;02082021180115
195;120;02082021180115
196;119;02082021180115
197;120;02082021180115
198;120;02082021180115
199;120;02082021180115
200;0;02082021180115
