wavelength;val
308.3536887;136.2
311.06533687107657;135.88888888888889
313.7744241737383;114.55555555555556
316.4809081419907;112.55555555555556
319.1847464903953;113.44444444444444
321.88589711500316;114.11111111111111
324.58431809428856;112
327.27996769008166;113.77777777777777
329.97280434850234;114
332.662786700893;111.88888888888889
335.34987356475267;115
338.0340239446695;112.33333333333333
340.7151970332544;111.77777777777777
343.3933522120746;114.88888888888889
346.0684490525864;112.44444444444444
348.740447317069;114.11111111111111
351.40930695955797;113.66666666666667
354.07498812677755;111.55555555555556
356.7374511590751;114.77777777777777
359.39665659135386;112.88888888888889
362.05256515400646;112.66666666666667
364.70513777384775;113.11111111111111
367.35433557504894;110.88888888888889
370.00011988007026;113.44444444444444
372.6424522105946;114.33333333333333
375.2812942884607;112.33333333333333
377.9166080365963;114.44444444444444
380.5483555799517;112.22222222222223
383.17649924643325;113
385.8010015678362;115
388.42182528077814;113.22222222222223
391.0389333276326;112.77777777777777
393.6522888574624;114.33333333333333
396.2618552269521;111.44444444444444
398.86759600134246;114.88888888888889
401.46947495536324;113.33333333333333
404.0674560741662;112
406.66150355425907;115.11111111111111
409.25158180443833;112
411.8376554467228;113.66666666666667
414.419689317287;113.88888888888889
416.9976484673941;111.55555555555556
419.5714981643297;114.33333333333333
422.1412038923347;112.88888888888889
424.7067313535392;113.33333333333333
427.2680464688952;115
429.82511537911006;112.66666666666667
432.37790444558016;112.88888888888889
434.926380251324;114.55555555555556
437.4705096019152;112.44444444444444
440.0102595264165;115.11111111111111
442.5455972783125;112.88888888888889
445.076490336443;112.33333333333333
447.6029064059365;113.77777777777777
450.12481341914395;112.44444444444444
452.64217953657106;112.33333333333333
455.1549731478124;113.22222222222223
457.66316287248446;112
460.16671756115886;114.22222222222223
462.665606296296;113.33333333333333
465.1597983931779;113.22222222222223
467.649263400842;114.55555555555556
470.1339711030141;113
472.6138915190419;114.33333333333333
475.0889949048281;115.77777777777777
477.55925175376393;111.55555555555556
480.0246327976627;114.88888888888889
482.48510900769213;113.22222222222223
484.9406515953089;112.55555555555556
487.3912320131912;115.33333333333333
489.8368219561722;112.77777777777777
492.2773933621733;112.44444444444444
494.71291841313786;115.11111111111111
497.1433695359641;111.55555555555556
499.5687194034384;114.66666666666667
501.9889409351687;112.44444444444444
504.4040072985182;112.55555555555556
506.8138919095378;114.44444444444444
509.2185684339005;112.44444444444444
511.6180107878335;114
514.0121931390529;114.77777777777777
516.4010899076957;111.88888888888889
518.7846757672543;115.22222222222223
521.1629256455082;113.22222222222223
523.5358147254593;113.11111111111111
525.9033184462638;114.44444444444444
528.2654125041665;112.33333333333333
530.6220728534325;114.22222222222223
532.9732757072825;115.11111111111111
535.3189975388251;111.11111111111111
537.6592150819897;115.55555555555556
539.9939053324608;114.44444444444444
542.3230455486108;112.55555555555556
544.646613252433;116.33333333333333
546.9645862304759;115
549.276942534775;113.44444444444444
551.5836604837881;115.55555555555556
553.8847186633267;113.44444444444444
556.1800959274902;113.66666666666667
558.4697713995996;113.77777777777777
560.75372447313;112.55555555555556
563.0319348126441;115.66666666666667
565.3043823547265;113.44444444444444
567.5710473089151;113.22222222222223
569.8319101586363;113.55555555555556
572.0869516621375;111.88888888888889
574.3361528534199;115
576.5794950431729;112.77777777777777
578.8169598197068;113.55555555555556
581.0485290498858;115.11111111111111
583.2741848800623;112.44444444444444
585.4939097370092;113.22222222222223
587.7076863288537;115.44444444444444
589.9154976460105;112.44444444444444
592.1173269621156;113.88888888888889
594.3131578349586;114.77777777777777
596.502974107417;113.55555555555556
598.6867599083889;116
600.8644996537265;113.44444444444444
603.0361780471695;114.44444444444444
