ind;val;datetime
0;0;02082021173249
1;154;02082021173249
2;131;02082021173249
3;129;02082021173249
4;129;02082021173249
5;131;02082021173249
6;128;02082021173249
7;129;02082021173249
8;130;02082021173249
9;128;02082021173249
10;131;02082021173249
11;128;02082021173249
12;128;02082021173249
13;131;02082021173249
14;130;02082021173249
15;132;02082021173249
16;132;02082021173249
17;132;02082021173249
18;138;02082021173249
19;141;02082021173249
20;155;02082021173249
21;193;02082021173249
22;296;02082021173249
23;575;02082021173249
24;1023;02082021173249
25;1023;02082021173249
26;1023;02082021173249
27;1023;02082021173249
28;1023;02082021173249
29;1023;02082021173249
30;1023;02082021173249
31;872;02082021173249
32;617;02082021173249
33;462;02082021173249
34;360;02082021173249
35;291;02082021173249
36;240;02082021173249
37;209;02082021173249
38;183;02082021173249
39;169;02082021173249
40;159;02082021173249
41;149;02082021173249
42;146;02082021173249
43;141;02082021173249
44;139;02082021173249
45;136;02082021173249
46;132;02082021173249
47;132;02082021173249
48;134;02082021173249
49;130;02082021173249
50;132;02082021173249
51;130;02082021173249
52;129;02082021173249
53;132;02082021173249
54;129;02082021173249
55;129;02082021173249
56;131;02082021173249
57;128;02082021173249
58;130;02082021173249
59;128;02082021173249
60;129;02082021173249
61;129;02082021173249
62;128;02082021173249
63;129;02082021173249
64;131;02082021173249
65;126;02082021173249
66;131;02082021173249
67;128;02082021173249
68;129;02082021173249
69;131;02082021173249
70;128;02082021173249
71;128;02082021173249
72;129;02082021173249
73;127;02082021173249
74;129;02082021173249
75;128;02082021173249
76;128;02082021173249
77;129;02082021173249
78;127;02082021173249
79;128;02082021173249
80;129;02082021173249
81;128;02082021173249
82;131;02082021173249
83;129;02082021173249
84;128;02082021173249
85;130;02082021173249
86;127;02082021173249
87;129;02082021173249
88;130;02082021173249
89;126;02082021173249
90;130;02082021173249
91;129;02082021173249
92;126;02082021173249
93;130;02082021173249
94;128;02082021173249
95;127;02082021173249
96;129;02082021173249
97;128;02082021173249
98;130;02082021173249
99;129;02082021173249
100;127;02082021173249
101;130;02082021173249
102;128;02082021173249
103;128;02082021173249
104;128;02082021173249
105;127;02082021173249
106;131;02082021173249
107;129;02082021173249
108;127;02082021173249
109;129;02082021173249
110;125;02082021173249
111;128;02082021173249
112;131;02082021173249
113;127;02082021173249
114;130;02082021173249
115;129;02082021173249
116;128;02082021173249
117;131;02082021173249
118;129;02082021173249
119;129;02082021173249
120;129;02082021173249
121;127;02082021173249
122;129;02082021173249
123;129;02082021173249
124;127;02082021173249
125;130;02082021173249
126;127;02082021173249
127;128;02082021173249
128;130;02082021173249
129;126;02082021173249
130;129;02082021173249
131;129;02082021173249
132;127;02082021173249
133;132;02082021173249
134;128;02082021173249
135;128;02082021173249
136;130;02082021173249
137;127;02082021173249
138;129;02082021173249
139;129;02082021173249
140;127;02082021173249
141;130;02082021173249
142;128;02082021173249
143;127;02082021173249
144;129;02082021173249
145;126;02082021173249
146;130;02082021173249
147;128;02082021173249
148;127;02082021173249
149;128;02082021173249
150;128;02082021173249
151;128;02082021173249
152;128;02082021173249
153;126;02082021173249
154;129;02082021173249
155;127;02082021173249
156;127;02082021173249
157;128;02082021173249
158;127;02082021173249
159;129;02082021173249
160;129;02082021173249
161;128;02082021173249
162;130;02082021173249
163;129;02082021173249
164;128;02082021173249
165;130;02082021173249
166;128;02082021173249
167;128;02082021173249
168;131;02082021173249
169;126;02082021173249
170;130;02082021173249
171;129;02082021173249
172;128;02082021173249
173;129;02082021173249
174;128;02082021173249
175;127;02082021173249
176;128;02082021173249
177;126;02082021173249
178;128;02082021173249
179;128;02082021173249
180;128;02082021173249
181;130;02082021173249
182;129;02082021173249
183;128;02082021173249
184;129;02082021173249
185;126;02082021173249
186;129;02082021173249
187;130;02082021173249
188;127;02082021173249
189;128;02082021173249
190;127;02082021173249
191;128;02082021173249
192;132;02082021173249
193;128;02082021173249
194;129;02082021173249
195;128;02082021173249
196;127;02082021173249
197;130;02082021173249
198;129;02082021173249
199;128;02082021173249
200;0;02082021173249
0;0;02082021173249
1;153;02082021173249
2;129;02082021173249
3;128;02082021173249
4;129;02082021173249
5;129;02082021173249
6;126;02082021173249
7;128;02082021173249
8;130;02082021173249
9;127;02082021173249
10;130;02082021173249
11;128;02082021173249
12;128;02082021173249
13;131;02082021173249
14;130;02082021173249
15;130;02082021173249
16;133;02082021173249
17;132;02082021173249
18;138;02082021173249
19;141;02082021173249
20;155;02082021173249
21;194;02082021173249
22;300;02082021173249
23;594;02082021173249
24;1023;02082021173249
25;1023;02082021173249
26;1023;02082021173249
27;1023;02082021173249
28;1023;02082021173249
29;1023;02082021173249
30;1023;02082021173249
31;892;02082021173249
32;636;02082021173249
33;471;02082021173249
34;365;02082021173249
35;298;02082021173249
36;245;02082021173249
37;210;02082021173249
38;186;02082021173249
39;170;02082021173249
40;159;02082021173249
41;149;02082021173249
42;147;02082021173249
43;139;02082021173249
44;137;02082021173249
45;136;02082021173249
46;132;02082021173249
47;131;02082021173249
48;133;02082021173249
49;129;02082021173249
50;132;02082021173249
51;129;02082021173249
52;128;02082021173249
53;130;02082021173249
54;128;02082021173249
55;127;02082021173249
56;129;02082021173249
57;127;02082021173249
58;130;02082021173249
59;128;02082021173249
60;128;02082021173249
61;130;02082021173249
62;127;02082021173249
63;129;02082021173249
64;130;02082021173249
65;126;02082021173249
66;129;02082021173249
67;128;02082021173249
68;126;02082021173249
69;130;02082021173249
70;127;02082021173249
71;127;02082021173249
72;129;02082021173249
73;126;02082021173249
74;129;02082021173249
75;126;02082021173249
76;127;02082021173249
77;129;02082021173249
78;126;02082021173249
79;128;02082021173249
80;128;02082021173249
81;127;02082021173249
82;130;02082021173249
83;127;02082021173249
84;127;02082021173249
85;128;02082021173249
86;126;02082021173249
87;127;02082021173249
88;128;02082021173249
89;124;02082021173249
90;129;02082021173249
91;128;02082021173249
92;125;02082021173249
93;129;02082021173249
94;127;02082021173249
95;127;02082021173249
96;129;02082021173249
97;128;02082021173249
98;128;02082021173249
99;128;02082021173249
100;125;02082021173249
101;129;02082021173249
102;126;02082021173249
103;127;02082021173249
104;128;02082021173249
105;126;02082021173249
106;129;02082021173249
107;127;02082021173249
108;127;02082021173249
109;129;02082021173249
110;126;02082021173249
111;127;02082021173249
112;130;02082021173249
113;127;02082021173249
114;128;02082021173249
115;130;02082021173249
116;127;02082021173249
117;130;02082021173249
118;127;02082021173249
119;128;02082021173249
120;127;02082021173249
121;125;02082021173249
122;128;02082021173249
123;128;02082021173249
124;126;02082021173249
125;129;02082021173249
126;126;02082021173249
127;127;02082021173249
128;129;02082021173249
129;127;02082021173249
130;127;02082021173249
131;128;02082021173249
132;127;02082021173249
133;131;02082021173249
134;126;02082021173249
135;127;02082021173249
136;129;02082021173249
137;126;02082021173249
138;128;02082021173249
139;128;02082021173249
140;126;02082021173249
141;130;02082021173249
142;128;02082021173249
143;127;02082021173249
144;129;02082021173249
145;127;02082021173249
146;129;02082021173249
147;127;02082021173249
148;126;02082021173249
149;127;02082021173249
150;126;02082021173249
151;126;02082021173249
152;128;02082021173249
153;125;02082021173249
154;129;02082021173249
155;127;02082021173249
156;126;02082021173249
157;127;02082021173249
158;126;02082021173249
159;126;02082021173249
160;128;02082021173249
161;126;02082021173249
162;129;02082021173249
163;128;02082021173249
164;126;02082021173249
165;129;02082021173249
166;128;02082021173249
167;127;02082021173249
168;128;02082021173249
169;126;02082021173249
170;128;02082021173249
171;127;02082021173249
172;126;02082021173249
173;128;02082021173249
174;127;02082021173249
175;126;02082021173249
176;129;02082021173249
177;127;02082021173249
178;128;02082021173249
179;127;02082021173249
180;127;02082021173249
181;129;02082021173249
182;127;02082021173249
183;127;02082021173249
184;128;02082021173249
185;125;02082021173249
186;128;02082021173249
187;127;02082021173249
188;125;02082021173249
189;127;02082021173249
190;126;02082021173249
191;126;02082021173249
192;131;02082021173249
193;126;02082021173249
194;127;02082021173249
195;128;02082021173249
196;126;02082021173249
197;128;02082021173249
198;128;02082021173249
199;126;02082021173249
200;0;02082021173249
0;0;02082021173250
1;154;02082021173250
2;129;02082021173250
3;128;02082021173250
4;129;02082021173250
5;130;02082021173250
6;128;02082021173250
7;127;02082021173250
8;130;02082021173250
9;127;02082021173250
10;130;02082021173250
11;128;02082021173250
12;127;02082021173250
13;131;02082021173250
14;130;02082021173250
15;132;02082021173250
16;133;02082021173250
17;132;02082021173250
18;138;02082021173250
19;142;02082021173250
20;154;02082021173250
21;195;02082021173250
22;295;02082021173250
23;590;02082021173250
24;1023;02082021173250
25;1023;02082021173250
26;1023;02082021173250
27;1023;02082021173250
28;1023;02082021173250
29;1023;02082021173250
30;1023;02082021173250
31;886;02082021173250
32;631;02082021173250
33;465;02082021173250
34;365;02082021173250
35;295;02082021173250
36;242;02082021173250
37;211;02082021173250
38;188;02082021173250
39;171;02082021173250
40;159;02082021173250
41;148;02082021173250
42;145;02082021173250
43;139;02082021173250
44;137;02082021173250
45;136;02082021173250
46;132;02082021173250
47;132;02082021173250
48;133;02082021173250
49;129;02082021173250
50;132;02082021173250
51;130;02082021173250
52;130;02082021173250
53;131;02082021173250
54;128;02082021173250
55;128;02082021173250
56;128;02082021173250
57;127;02082021173250
58;128;02082021173250
59;128;02082021173250
60;129;02082021173250
61;129;02082021173250
62;128;02082021173250
63;129;02082021173250
64;130;02082021173250
65;126;02082021173250
66;129;02082021173250
67;128;02082021173250
68;127;02082021173250
69;130;02082021173250
70;127;02082021173250
71;127;02082021173250
72;129;02082021173250
73;126;02082021173250
74;128;02082021173250
75;127;02082021173250
76;126;02082021173250
77;129;02082021173250
78;126;02082021173250
79;128;02082021173250
80;129;02082021173250
81;127;02082021173250
82;130;02082021173250
83;127;02082021173250
84;128;02082021173250
85;129;02082021173250
86;125;02082021173250
87;128;02082021173250
88;129;02082021173250
89;125;02082021173250
90;129;02082021173250
91;128;02082021173250
92;125;02082021173250
93;129;02082021173250
94;127;02082021173250
95;127;02082021173250
96;130;02082021173250
97;127;02082021173250
98;128;02082021173250
99;127;02082021173250
100;127;02082021173250
101;130;02082021173250
102;127;02082021173250
103;128;02082021173250
104;128;02082021173250
105;127;02082021173250
106;130;02082021173250
107;127;02082021173250
108;126;02082021173250
109;129;02082021173250
110;126;02082021173250
111;128;02082021173250
112;130;02082021173250
113;127;02082021173250
114;128;02082021173250
115;130;02082021173250
116;127;02082021173250
117;130;02082021173250
118;128;02082021173250
119;129;02082021173250
120;128;02082021173250
121;127;02082021173250
122;128;02082021173250
123;128;02082021173250
124;126;02082021173250
125;129;02082021173250
126;127;02082021173250
127;127;02082021173250
128;129;02082021173250
129;126;02082021173250
130;128;02082021173250
131;129;02082021173250
132;127;02082021173250
133;131;02082021173250
134;127;02082021173250
135;129;02082021173250
136;130;02082021173250
137;127;02082021173250
138;129;02082021173250
139;128;02082021173250
140;127;02082021173250
141;129;02082021173250
142;127;02082021173250
143;126;02082021173250
144;129;02082021173250
145;126;02082021173250
146;130;02082021173250
147;128;02082021173250
148;128;02082021173250
149;127;02082021173250
150;127;02082021173250
151;127;02082021173250
152;129;02082021173250
153;126;02082021173250
154;128;02082021173250
155;127;02082021173250
156;127;02082021173250
157;128;02082021173250
158;126;02082021173250
159;127;02082021173250
160;128;02082021173250
161;127;02082021173250
162;129;02082021173250
163;127;02082021173250
164;127;02082021173250
165;130;02082021173250
166;128;02082021173250
167;129;02082021173250
168;129;02082021173250
169;127;02082021173250
170;128;02082021173250
171;128;02082021173250
172;127;02082021173250
173;128;02082021173250
174;127;02082021173250
175;126;02082021173250
176;128;02082021173250
177;125;02082021173250
178;128;02082021173250
179;129;02082021173250
180;127;02082021173250
181;130;02082021173250
182;128;02082021173250
183;127;02082021173250
184;129;02082021173250
185;126;02082021173250
186;130;02082021173250
187;128;02082021173250
188;126;02082021173250
189;128;02082021173250
190;127;02082021173250
191;127;02082021173250
192;130;02082021173250
193;127;02082021173250
194;126;02082021173250
195;128;02082021173250
196;127;02082021173250
197;130;02082021173250
198;128;02082021173250
199;128;02082021173250
200;0;02082021173250
0;0;02082021173250
1;152;02082021173250
2;128;02082021173250
3;127;02082021173250
4;127;02082021173250
5;128;02082021173250
6;126;02082021173250
7;128;02082021173250
8;128;02082021173250
9;126;02082021173250
10;130;02082021173250
11;127;02082021173250
12;127;02082021173250
13;130;02082021173250
14;128;02082021173250
15;131;02082021173250
16;132;02082021173250
17;131;02082021173250
18;137;02082021173250
19;140;02082021173250
20;156;02082021173250
21;192;02082021173250
22;301;02082021173250
23;595;02082021173250
24;1023;02082021173250
25;1023;02082021173250
26;1023;02082021173250
27;1023;02082021173250
28;1023;02082021173250
29;1023;02082021173250
30;1023;02082021173250
31;902;02082021173250
32;646;02082021173250
33;473;02082021173250
34;371;02082021173250
35;299;02082021173250
36;247;02082021173250
37;211;02082021173250
38;188;02082021173250
39;170;02082021173250
40;159;02082021173250
41;148;02082021173250
42;146;02082021173250
43;140;02082021173250
44;137;02082021173250
45;135;02082021173250
46;132;02082021173250
47;131;02082021173250
48;131;02082021173250
49;130;02082021173250
50;131;02082021173250
51;128;02082021173250
52;128;02082021173250
53;129;02082021173250
54;128;02082021173250
55;128;02082021173250
56;129;02082021173250
57;126;02082021173250
58;129;02082021173250
59;128;02082021173250
60;128;02082021173250
61;129;02082021173250
62;127;02082021173250
63;129;02082021173250
64;128;02082021173250
65;125;02082021173250
66;129;02082021173250
67;127;02082021173250
68;126;02082021173250
69;129;02082021173250
70;125;02082021173250
71;126;02082021173250
72;129;02082021173250
73;125;02082021173250
74;128;02082021173250
75;126;02082021173250
76;126;02082021173250
77;128;02082021173250
78;125;02082021173250
79;127;02082021173250
80;129;02082021173250
81;125;02082021173250
82;129;02082021173250
83;127;02082021173250
84;126;02082021173250
85;128;02082021173250
86;125;02082021173250
87;127;02082021173250
88;128;02082021173250
89;125;02082021173250
90;128;02082021173250
91;128;02082021173250
92;126;02082021173250
93;127;02082021173250
94;126;02082021173250
95;126;02082021173250
96;129;02082021173250
97;127;02082021173250
98;127;02082021173250
99;128;02082021173250
100;127;02082021173250
101;128;02082021173250
102;126;02082021173250
103;126;02082021173250
104;127;02082021173250
105;126;02082021173250
106;129;02082021173250
107;127;02082021173250
108;126;02082021173250
109;129;02082021173250
110;125;02082021173250
111;127;02082021173250
112;129;02082021173250
113;126;02082021173250
114;128;02082021173250
115;128;02082021173250
116;127;02082021173250
117;129;02082021173250
118;127;02082021173250
119;128;02082021173250
120;127;02082021173250
121;126;02082021173250
122;128;02082021173250
123;127;02082021173250
124;126;02082021173250
125;127;02082021173250
126;126;02082021173250
127;126;02082021173250
128;128;02082021173250
129;126;02082021173250
130;127;02082021173250
131;127;02082021173250
132;126;02082021173250
133;130;02082021173250
134;126;02082021173250
135;127;02082021173250
136;129;02082021173250
137;126;02082021173250
138;128;02082021173250
139;127;02082021173250
140;125;02082021173250
141;128;02082021173250
142;125;02082021173250
143;126;02082021173250
144;128;02082021173250
145;125;02082021173250
146;129;02082021173250
147;127;02082021173250
148;126;02082021173250
149;126;02082021173250
150;126;02082021173250
151;127;02082021173250
152;127;02082021173250
153;126;02082021173250
154;129;02082021173250
155;127;02082021173250
156;126;02082021173250
157;127;02082021173250
158;126;02082021173250
159;125;02082021173250
160;128;02082021173250
161;125;02082021173250
162;128;02082021173250
163;128;02082021173250
164;127;02082021173250
165;128;02082021173250
166;127;02082021173250
167;127;02082021173250
168;129;02082021173250
169;126;02082021173250
170;127;02082021173250
171;127;02082021173250
172;126;02082021173250
173;127;02082021173250
174;126;02082021173250
175;125;02082021173250
176;128;02082021173250
177;126;02082021173250
178;128;02082021173250
179;126;02082021173250
180;127;02082021173250
181;128;02082021173250
182;127;02082021173250
183;127;02082021173250
184;128;02082021173250
185;125;02082021173250
186;128;02082021173250
187;128;02082021173250
188;124;02082021173250
189;127;02082021173250
190;126;02082021173250
191;126;02082021173250
192;130;02082021173250
193;126;02082021173250
194;127;02082021173250
195;127;02082021173250
196;126;02082021173250
197;127;02082021173250
198;127;02082021173250
199;127;02082021173250
200;0;02082021173250
0;0;02082021173250
1;154;02082021173250
2;129;02082021173250
3;129;02082021173250
4;129;02082021173250
5;131;02082021173250
6;127;02082021173250
7;129;02082021173250
8;130;02082021173250
9;127;02082021173250
10;130;02082021173250
11;129;02082021173250
12;128;02082021173250
13;132;02082021173250
14;129;02082021173250
15;132;02082021173250
16;131;02082021173250
17;132;02082021173250
18;137;02082021173250
19;141;02082021173250
20;156;02082021173250
21;192;02082021173250
22;296;02082021173250
23;581;02082021173250
24;1023;02082021173250
25;1023;02082021173250
26;1023;02082021173250
27;1023;02082021173250
28;1023;02082021173250
29;1023;02082021173250
30;1023;02082021173250
31;886;02082021173250
32;623;02082021173250
33;461;02082021173250
34;364;02082021173250
35;291;02082021173250
36;243;02082021173250
37;210;02082021173250
38;185;02082021173250
39;170;02082021173250
40;160;02082021173250
41;150;02082021173250
42;147;02082021173250
43;140;02082021173250
44;138;02082021173250
45;137;02082021173250
46;133;02082021173250
47;133;02082021173250
48;134;02082021173250
49;130;02082021173250
50;133;02082021173250
51;129;02082021173250
52;129;02082021173250
53;130;02082021173250
54;129;02082021173250
55;128;02082021173250
56;130;02082021173250
57;128;02082021173250
58;130;02082021173250
59;129;02082021173250
60;128;02082021173250
61;131;02082021173250
62;129;02082021173250
63;129;02082021173250
64;131;02082021173250
65;127;02082021173250
66;130;02082021173250
67;128;02082021173250
68;128;02082021173250
69;130;02082021173250
70;127;02082021173250
71;128;02082021173250
72;130;02082021173250
73;126;02082021173250
74;130;02082021173250
75;128;02082021173250
76;127;02082021173250
77;129;02082021173250
78;128;02082021173250
79;129;02082021173250
80;129;02082021173250
81;127;02082021173250
82;130;02082021173250
83;128;02082021173250
84;128;02082021173250
85;129;02082021173250
86;126;02082021173250
87;128;02082021173250
88;130;02082021173250
89;126;02082021173250
90;129;02082021173250
91;128;02082021173250
92;128;02082021173250
93;130;02082021173250
94;128;02082021173250
95;127;02082021173250
96;130;02082021173250
97;128;02082021173250
98;130;02082021173250
99;129;02082021173250
100;127;02082021173250
101;130;02082021173250
102;127;02082021173250
103;128;02082021173250
104;128;02082021173250
105;127;02082021173250
106;130;02082021173250
107;126;02082021173250
108;128;02082021173250
109;129;02082021173250
110;128;02082021173250
111;129;02082021173250
112;130;02082021173250
113;128;02082021173250
114;129;02082021173250
115;130;02082021173250
116;128;02082021173250
117;132;02082021173250
118;128;02082021173250
119;129;02082021173250
120;128;02082021173250
121;126;02082021173250
122;129;02082021173250
123;128;02082021173250
124;127;02082021173250
125;130;02082021173250
126;127;02082021173250
127;128;02082021173250
128;130;02082021173250
129;127;02082021173250
130;130;02082021173250
131;128;02082021173250
132;128;02082021173250
133;131;02082021173250
134;127;02082021173250
135;126;02082021173250
136;130;02082021173250
137;126;02082021173250
138;128;02082021173250
139;128;02082021173250
140;126;02082021173250
141;130;02082021173250
142;128;02082021173250
143;128;02082021173250
144;129;02082021173250
145;126;02082021173250
146;129;02082021173250
147;128;02082021173250
148;127;02082021173250
149;128;02082021173250
150;127;02082021173250
151;128;02082021173250
152;129;02082021173250
153;127;02082021173250
154;129;02082021173250
155;126;02082021173250
156;126;02082021173250
157;127;02082021173250
158;127;02082021173250
159;127;02082021173250
160;129;02082021173250
161;127;02082021173250
162;129;02082021173250
163;128;02082021173250
164;127;02082021173250
165;131;02082021173250
166;128;02082021173250
167;129;02082021173250
168;129;02082021173250
169;126;02082021173250
170;129;02082021173250
171;128;02082021173250
172;128;02082021173250
173;129;02082021173250
174;128;02082021173250
175;127;02082021173250
176;129;02082021173250
177;126;02082021173250
178;130;02082021173250
179;128;02082021173250
180;127;02082021173250
181;130;02082021173250
182;128;02082021173250
183;127;02082021173250
184;130;02082021173250
185;127;02082021173250
186;129;02082021173250
187;128;02082021173250
188;126;02082021173250
189;128;02082021173250
190;127;02082021173250
191;128;02082021173250
192;131;02082021173250
193;127;02082021173250
194;128;02082021173250
195;128;02082021173250
196;127;02082021173250
197;130;02082021173250
198;129;02082021173250
199;128;02082021173250
200;0;02082021173250
0;0;02082021173251
1;153;02082021173251
2;129;02082021173251
3;127;02082021173251
4;128;02082021173251
5;129;02082021173251
6;125;02082021173251
7;127;02082021173251
8;128;02082021173251
9;126;02082021173251
10;130;02082021173251
11;127;02082021173251
12;127;02082021173251
13;130;02082021173251
14;128;02082021173251
15;133;02082021173251
16;132;02082021173251
17;131;02082021173251
18;136;02082021173251
19;140;02082021173251
20;156;02082021173251
21;193;02082021173251
22;303;02082021173251
23;591;02082021173251
24;1023;02082021173251
25;1023;02082021173251
26;1023;02082021173251
27;1023;02082021173251
28;1023;02082021173251
29;1023;02082021173251
30;1023;02082021173251
31;899;02082021173251
32;640;02082021173251
33;473;02082021173251
34;369;02082021173251
35;298;02082021173251
36;243;02082021173251
37;211;02082021173251
38;185;02082021173251
39;169;02082021173251
40;159;02082021173251
41;148;02082021173251
42;146;02082021173251
43;139;02082021173251
44;137;02082021173251
45;135;02082021173251
46;132;02082021173251
47;132;02082021173251
48;133;02082021173251
49;130;02082021173251
50;132;02082021173251
51;129;02082021173251
52;128;02082021173251
53;130;02082021173251
54;127;02082021173251
55;127;02082021173251
56;128;02082021173251
57;126;02082021173251
58;130;02082021173251
59;128;02082021173251
60;128;02082021173251
61;129;02082021173251
62;127;02082021173251
63;128;02082021173251
64;129;02082021173251
65;126;02082021173251
66;130;02082021173251
67;127;02082021173251
68;127;02082021173251
69;130;02082021173251
70;126;02082021173251
71;126;02082021173251
72;128;02082021173251
73;125;02082021173251
74;128;02082021173251
75;126;02082021173251
76;127;02082021173251
77;129;02082021173251
78;126;02082021173251
79;128;02082021173251
80;129;02082021173251
81;125;02082021173251
82;129;02082021173251
83;128;02082021173251
84;126;02082021173251
85;128;02082021173251
86;125;02082021173251
87;127;02082021173251
88;128;02082021173251
89;124;02082021173251
90;129;02082021173251
91;127;02082021173251
92;124;02082021173251
93;129;02082021173251
94;127;02082021173251
95;126;02082021173251
96;129;02082021173251
97;127;02082021173251
98;127;02082021173251
99;127;02082021173251
100;126;02082021173251
101;129;02082021173251
102;126;02082021173251
103;126;02082021173251
104;127;02082021173251
105;124;02082021173251
106;129;02082021173251
107;127;02082021173251
108;125;02082021173251
109;129;02082021173251
110;125;02082021173251
111;126;02082021173251
112;128;02082021173251
113;125;02082021173251
114;127;02082021173251
115;128;02082021173251
116;126;02082021173251
117;131;02082021173251
118;126;02082021173251
119;127;02082021173251
120;126;02082021173251
121;126;02082021173251
122;127;02082021173251
123;126;02082021173251
124;126;02082021173251
125;128;02082021173251
126;126;02082021173251
127;126;02082021173251
128;129;02082021173251
129;126;02082021173251
130;127;02082021173251
131;127;02082021173251
132;125;02082021173251
133;129;02082021173251
134;127;02082021173251
135;126;02082021173251
136;129;02082021173251
137;125;02082021173251
138;127;02082021173251
139;127;02082021173251
140;126;02082021173251
141;128;02082021173251
142;126;02082021173251
143;127;02082021173251
144;128;02082021173251
145;125;02082021173251
146;128;02082021173251
147;127;02082021173251
148;126;02082021173251
149;126;02082021173251
150;127;02082021173251
151;127;02082021173251
152;127;02082021173251
153;125;02082021173251
154;128;02082021173251
155;125;02082021173251
156;125;02082021173251
157;127;02082021173251
158;127;02082021173251
159;126;02082021173251
160;128;02082021173251
161;126;02082021173251
162;128;02082021173251
163;127;02082021173251
164;126;02082021173251
165;128;02082021173251
166;127;02082021173251
167;127;02082021173251
168;128;02082021173251
169;125;02082021173251
170;127;02082021173251
171;127;02082021173251
172;127;02082021173251
173;128;02082021173251
174;128;02082021173251
175;125;02082021173251
176;127;02082021173251
177;126;02082021173251
178;127;02082021173251
179;126;02082021173251
180;126;02082021173251
181;129;02082021173251
182;126;02082021173251
183;127;02082021173251
184;128;02082021173251
185;125;02082021173251
186;128;02082021173251
187;127;02082021173251
188;126;02082021173251
189;127;02082021173251
190;127;02082021173251
191;126;02082021173251
192;130;02082021173251
193;127;02082021173251
194;127;02082021173251
195;127;02082021173251
196;126;02082021173251
197;128;02082021173251
198;126;02082021173251
199;126;02082021173251
200;0;02082021173251
0;0;02082021173251
1;150;02082021173251
2;125;02082021173251
3;125;02082021173251
4;125;02082021173251
5;126;02082021173251
6;124;02082021173251
7;126;02082021173251
8;125;02082021173251
9;123;02082021173251
10;127;02082021173251
11;124;02082021173251
12;123;02082021173251
13;126;02082021173251
14;125;02082021173251
15;126;02082021173251
16;126;02082021173251
17;124;02082021173251
18;126;02082021173251
19;124;02082021173251
20;124;02082021173251
21;125;02082021173251
22;122;02082021173251
23;126;02082021173251
24;126;02082021173251
25;124;02082021173251
26;127;02082021173251
27;123;02082021173251
28;125;02082021173251
29;126;02082021173251
30;124;02082021173251
31;125;02082021173251
32;126;02082021173251
33;124;02082021173251
34;128;02082021173251
35;125;02082021173251
36;124;02082021173251
37;126;02082021173251
38;124;02082021173251
39;125;02082021173251
40;126;02082021173251
41;122;02082021173251
42;127;02082021173251
43;125;02082021173251
44;125;02082021173251
45;126;02082021173251
46;123;02082021173251
47;124;02082021173251
48;127;02082021173251
49;124;02082021173251
50;127;02082021173251
51;124;02082021173251
52;123;02082021173251
53;126;02082021173251
54;125;02082021173251
55;123;02082021173251
56;124;02082021173251
57;123;02082021173251
58;126;02082021173251
59;125;02082021173251
60;125;02082021173251
61;126;02082021173251
62;124;02082021173251
63;125;02082021173251
64;127;02082021173251
65;124;02082021173251
66;127;02082021173251
67;124;02082021173251
68;124;02082021173251
69;127;02082021173251
70;123;02082021173251
71;124;02082021173251
72;126;02082021173251
73;122;02082021173251
74;126;02082021173251
75;123;02082021173251
76;124;02082021173251
77;126;02082021173251
78;124;02082021173251
79;124;02082021173251
80;126;02082021173251
81;123;02082021173251
82;127;02082021173251
83;126;02082021173251
84;125;02082021173251
85;125;02082021173251
86;123;02082021173251
87;125;02082021173251
88;126;02082021173251
89;122;02082021173251
90;125;02082021173251
91;126;02082021173251
92;123;02082021173251
93;127;02082021173251
94;125;02082021173251
95;124;02082021173251
96;127;02082021173251
97;125;02082021173251
98;124;02082021173251
99;125;02082021173251
100;124;02082021173251
101;126;02082021173251
102;124;02082021173251
103;125;02082021173251
104;126;02082021173251
105;123;02082021173251
106;127;02082021173251
107;124;02082021173251
108;124;02082021173251
109;127;02082021173251
110;123;02082021173251
111;125;02082021173251
112;127;02082021173251
113;123;02082021173251
114;125;02082021173251
115;126;02082021173251
116;125;02082021173251
117;128;02082021173251
118;125;02082021173251
119;125;02082021173251
120;124;02082021173251
121;125;02082021173251
122;126;02082021173251
123;125;02082021173251
124;123;02082021173251
125;126;02082021173251
126;124;02082021173251
127;125;02082021173251
128;126;02082021173251
129;124;02082021173251
130;125;02082021173251
131;126;02082021173251
132;124;02082021173251
133;129;02082021173251
134;124;02082021173251
135;125;02082021173251
136;127;02082021173251
137;124;02082021173251
138;126;02082021173251
139;126;02082021173251
140;124;02082021173251
141;126;02082021173251
142;125;02082021173251
143;125;02082021173251
144;127;02082021173251
145;123;02082021173251
146;126;02082021173251
147;126;02082021173251
148;125;02082021173251
149;125;02082021173251
150;125;02082021173251
151;125;02082021173251
152;126;02082021173251
153;124;02082021173251
154;126;02082021173251
155;124;02082021173251
156;123;02082021173251
157;125;02082021173251
158;123;02082021173251
159;123;02082021173251
160;126;02082021173251
161;124;02082021173251
162;126;02082021173251
163;125;02082021173251
164;125;02082021173251
165;127;02082021173251
166;125;02082021173251
167;126;02082021173251
168;127;02082021173251
169;124;02082021173251
170;126;02082021173251
171;126;02082021173251
172;124;02082021173251
173;124;02082021173251
174;125;02082021173251
175;122;02082021173251
176;126;02082021173251
177;124;02082021173251
178;126;02082021173251
179;126;02082021173251
180;125;02082021173251
181;127;02082021173251
182;125;02082021173251
183;124;02082021173251
184;126;02082021173251
185;124;02082021173251
186;127;02082021173251
187;126;02082021173251
188;122;02082021173251
189;125;02082021173251
190;124;02082021173251
191;124;02082021173251
192;128;02082021173251
193;126;02082021173251
194;125;02082021173251
195;126;02082021173251
196;125;02082021173251
197;126;02082021173251
198;126;02082021173251
199;124;02082021173251
200;0;02082021173251
0;0;02082021173251
1;149;02082021173251
2;125;02082021173251
3;123;02082021173251
4;124;02082021173251
5;125;02082021173251
6;122;02082021173251
7;123;02082021173251
8;124;02082021173251
9;122;02082021173251
10;125;02082021173251
11;122;02082021173251
12;123;02082021173251
13;124;02082021173251
14;123;02082021173251
15;124;02082021173251
16;125;02082021173251
17;123;02082021173251
18;125;02082021173251
19;123;02082021173251
20;122;02082021173251
21;123;02082021173251
22;121;02082021173251
23;125;02082021173251
24;125;02082021173251
25;124;02082021173251
26;126;02082021173251
27;123;02082021173251
28;123;02082021173251
29;125;02082021173251
30;124;02082021173251
31;124;02082021173251
32;125;02082021173251
33;123;02082021173251
34;126;02082021173251
35;124;02082021173251
36;122;02082021173251
37;125;02082021173251
38;122;02082021173251
39;123;02082021173251
40;125;02082021173251
41;121;02082021173251
42;125;02082021173251
43;124;02082021173251
44;124;02082021173251
45;125;02082021173251
46;122;02082021173251
47;123;02082021173251
48;127;02082021173251
49;123;02082021173251
50;126;02082021173251
51;123;02082021173251
52;122;02082021173251
53;124;02082021173251
54;122;02082021173251
55;122;02082021173251
56;123;02082021173251
57;122;02082021173251
58;125;02082021173251
59;123;02082021173251
60;123;02082021173251
61;124;02082021173251
62;123;02082021173251
63;124;02082021173251
64;125;02082021173251
65;123;02082021173251
66;125;02082021173251
67;123;02082021173251
68;122;02082021173251
69;125;02082021173251
70;122;02082021173251
71;122;02082021173251
72;125;02082021173251
73;121;02082021173251
74;125;02082021173251
75;123;02082021173251
76;122;02082021173251
77;124;02082021173251
78;122;02082021173251
79;123;02082021173251
80;124;02082021173251
81;122;02082021173251
82;126;02082021173251
83;124;02082021173251
84;123;02082021173251
85;124;02082021173251
86;122;02082021173251
87;123;02082021173251
88;125;02082021173251
89;122;02082021173251
90;125;02082021173251
91;124;02082021173251
92;121;02082021173251
93;125;02082021173251
94;123;02082021173251
95;122;02082021173251
96;125;02082021173251
97;123;02082021173251
98;125;02082021173251
99;124;02082021173251
100;123;02082021173251
101;125;02082021173251
102;123;02082021173251
103;124;02082021173251
104;125;02082021173251
105;122;02082021173251
106;126;02082021173251
107;123;02082021173251
108;123;02082021173251
109;125;02082021173251
110;122;02082021173251
111;123;02082021173251
112;126;02082021173251
113;122;02082021173251
114;124;02082021173251
115;125;02082021173251
116;123;02082021173251
117;127;02082021173251
118;123;02082021173251
119;124;02082021173251
120;123;02082021173251
121;122;02082021173251
122;124;02082021173251
123;123;02082021173251
124;121;02082021173251
125;125;02082021173251
126;123;02082021173251
127;123;02082021173251
128;126;02082021173251
129;123;02082021173251
130;125;02082021173251
131;125;02082021173251
132;122;02082021173251
133;128;02082021173251
134;124;02082021173251
135;124;02082021173251
136;126;02082021173251
137;122;02082021173251
138;125;02082021173251
139;124;02082021173251
140;122;02082021173251
141;124;02082021173251
142;124;02082021173251
143;123;02082021173251
144;125;02082021173251
145;122;02082021173251
146;125;02082021173251
147;124;02082021173251
148;122;02082021173251
149;123;02082021173251
150;124;02082021173251
151;123;02082021173251
152;124;02082021173251
153;122;02082021173251
154;124;02082021173251
155;123;02082021173251
156;123;02082021173251
157;124;02082021173251
158;123;02082021173251
159;123;02082021173251
160;125;02082021173251
161;123;02082021173251
162;124;02082021173251
163;124;02082021173251
164;122;02082021173251
165;125;02082021173251
166;124;02082021173251
167;124;02082021173251
168;125;02082021173251
169;122;02082021173251
170;125;02082021173251
171;123;02082021173251
172;124;02082021173251
173;125;02082021173251
174;123;02082021173251
175;122;02082021173251
176;124;02082021173251
177;124;02082021173251
178;124;02082021173251
179;123;02082021173251
180;123;02082021173251
181;125;02082021173251
182;124;02082021173251
183;123;02082021173251
184;125;02082021173251
185;122;02082021173251
186;126;02082021173251
187;125;02082021173251
188;122;02082021173251
189;124;02082021173251
190;123;02082021173251
191;123;02082021173251
192;126;02082021173251
193;124;02082021173251
194;124;02082021173251
195;125;02082021173251
196;123;02082021173251
197;125;02082021173251
198;125;02082021173251
199;123;02082021173251
200;0;02082021173251
0;0;02082021173252
1;154;02082021173252
2;130;02082021173252
3;129;02082021173252
4;127;02082021173252
5;131;02082021173252
6;128;02082021173252
7;129;02082021173252
8;131;02082021173252
9;128;02082021173252
10;131;02082021173252
11;129;02082021173252
12;128;02082021173252
13;131;02082021173252
14;130;02082021173252
15;132;02082021173252
16;133;02082021173252
17;131;02082021173252
18;138;02082021173252
19;142;02082021173252
20;156;02082021173252
21;191;02082021173252
22;297;02082021173252
23;579;02082021173252
24;1023;02082021173252
25;1023;02082021173252
26;1023;02082021173252
27;1023;02082021173252
28;1023;02082021173252
29;1023;02082021173252
30;1023;02082021173252
31;879;02082021173252
32;619;02082021173252
33;459;02082021173252
34;362;02082021173252
35;292;02082021173252
36;241;02082021173252
37;211;02082021173252
38;184;02082021173252
39;171;02082021173252
40;159;02082021173252
41;147;02082021173252
42;146;02082021173252
43;140;02082021173252
44;138;02082021173252
45;137;02082021173252
46;133;02082021173252
47;133;02082021173252
48;134;02082021173252
49;131;02082021173252
50;133;02082021173252
51;129;02082021173252
52;129;02082021173252
53;130;02082021173252
54;128;02082021173252
55;129;02082021173252
56;131;02082021173252
57;128;02082021173252
58;130;02082021173252
59;129;02082021173252
60;128;02082021173252
61;130;02082021173252
62;128;02082021173252
63;130;02082021173252
64;131;02082021173252
65;128;02082021173252
66;130;02082021173252
67;129;02082021173252
68;128;02082021173252
69;131;02082021173252
70;127;02082021173252
71;128;02082021173252
72;130;02082021173252
73;126;02082021173252
74;130;02082021173252
75;127;02082021173252
76;128;02082021173252
77;129;02082021173252
78;126;02082021173252
79;129;02082021173252
80;129;02082021173252
81;128;02082021173252
82;130;02082021173252
83;128;02082021173252
84;129;02082021173252
85;129;02082021173252
86;128;02082021173252
87;128;02082021173252
88;129;02082021173252
89;126;02082021173252
90;128;02082021173252
91;129;02082021173252
92;127;02082021173252
93;129;02082021173252
94;128;02082021173252
95;129;02082021173252
96;130;02082021173252
97;129;02082021173252
98;128;02082021173252
99;128;02082021173252
100;128;02082021173252
101;131;02082021173252
102;127;02082021173252
103;129;02082021173252
104;129;02082021173252
105;127;02082021173252
106;129;02082021173252
107;127;02082021173252
108;128;02082021173252
109;130;02082021173252
110;127;02082021173252
111;128;02082021173252
112;130;02082021173252
113;127;02082021173252
114;129;02082021173252
115;129;02082021173252
116;128;02082021173252
117;131;02082021173252
118;128;02082021173252
119;129;02082021173252
120;128;02082021173252
121;128;02082021173252
122;128;02082021173252
123;128;02082021173252
124;127;02082021173252
125;129;02082021173252
126;128;02082021173252
127;128;02082021173252
128;131;02082021173252
129;128;02082021173252
130;128;02082021173252
131;130;02082021173252
132;128;02082021173252
133;131;02082021173252
134;127;02082021173252
135;128;02082021173252
136;130;02082021173252
137;127;02082021173252
138;130;02082021173252
139;129;02082021173252
140;126;02082021173252
141;130;02082021173252
142;127;02082021173252
143;127;02082021173252
144;130;02082021173252
145;126;02082021173252
146;129;02082021173252
147;128;02082021173252
148;126;02082021173252
149;129;02082021173252
150;126;02082021173252
151;128;02082021173252
152;129;02082021173252
153;127;02082021173252
154;130;02082021173252
155;127;02082021173252
156;127;02082021173252
157;128;02082021173252
158;127;02082021173252
159;127;02082021173252
160;129;02082021173252
161;126;02082021173252
162;129;02082021173252
163;128;02082021173252
164;128;02082021173252
165;130;02082021173252
166;128;02082021173252
167;129;02082021173252
168;129;02082021173252
169;127;02082021173252
170;130;02082021173252
171;128;02082021173252
172;127;02082021173252
173;129;02082021173252
174;128;02082021173252
175;127;02082021173252
176;128;02082021173252
177;127;02082021173252
178;129;02082021173252
179;127;02082021173252
180;127;02082021173252
181;130;02082021173252
182;129;02082021173252
183;128;02082021173252
184;129;02082021173252
185;127;02082021173252
186;130;02082021173252
187;129;02082021173252
188;127;02082021173252
189;129;02082021173252
190;128;02082021173252
191;128;02082021173252
192;131;02082021173252
193;128;02082021173252
194;128;02082021173252
195;128;02082021173252
196;127;02082021173252
197;128;02082021173252
198;128;02082021173252
199;128;02082021173252
200;0;02082021173252
0;0;02082021173252
1;152;02082021173252
2;129;02082021173252
3;128;02082021173252
4;128;02082021173252
5;129;02082021173252
6;126;02082021173252
7;127;02082021173252
8;128;02082021173252
9;126;02082021173252
10;130;02082021173252
11;126;02082021173252
12;127;02082021173252
13;130;02082021173252
14;129;02082021173252
15;131;02082021173252
16;132;02082021173252
17;131;02082021173252
18;136;02082021173252
19;141;02082021173252
20;155;02082021173252
21;190;02082021173252
22;301;02082021173252
23;587;02082021173252
24;1023;02082021173252
25;1023;02082021173252
26;1023;02082021173252
27;1023;02082021173252
28;1023;02082021173252
29;1023;02082021173252
30;1023;02082021173252
31;890;02082021173252
32;626;02082021173252
33;470;02082021173252
34;362;02082021173252
35;295;02082021173252
36;243;02082021173252
37;210;02082021173252
38;187;02082021173252
39;171;02082021173252
40;159;02082021173252
41;148;02082021173252
42;144;02082021173252
43;139;02082021173252
44;137;02082021173252
45;136;02082021173252
46;131;02082021173252
47;130;02082021173252
48;131;02082021173252
49;129;02082021173252
50;132;02082021173252
51;128;02082021173252
52;128;02082021173252
53;129;02082021173252
54;127;02082021173252
55;127;02082021173252
56;129;02082021173252
57;127;02082021173252
58;128;02082021173252
59;127;02082021173252
60;126;02082021173252
61;128;02082021173252
62;127;02082021173252
63;128;02082021173252
64;129;02082021173252
65;126;02082021173252
66;129;02082021173252
67;127;02082021173252
68;126;02082021173252
69;130;02082021173252
70;125;02082021173252
71;126;02082021173252
72;128;02082021173252
73;125;02082021173252
74;128;02082021173252
75;125;02082021173252
76;126;02082021173252
77;127;02082021173252
78;125;02082021173252
79;127;02082021173252
80;128;02082021173252
81;126;02082021173252
82;129;02082021173252
83;127;02082021173252
84;127;02082021173252
85;128;02082021173252
86;125;02082021173252
87;127;02082021173252
88;128;02082021173252
89;124;02082021173252
90;128;02082021173252
91;126;02082021173252
92;124;02082021173252
93;128;02082021173252
94;126;02082021173252
95;126;02082021173252
96;128;02082021173252
97;126;02082021173252
98;126;02082021173252
99;128;02082021173252
100;126;02082021173252
101;127;02082021173252
102;126;02082021173252
103;126;02082021173252
104;128;02082021173252
105;124;02082021173252
106;129;02082021173252
107;127;02082021173252
108;126;02082021173252
109;128;02082021173252
110;125;02082021173252
111;126;02082021173252
112;129;02082021173252
113;125;02082021173252
114;127;02082021173252
115;127;02082021173252
116;126;02082021173252
117;130;02082021173252
118;126;02082021173252
119;126;02082021173252
120;125;02082021173252
121;125;02082021173252
122;127;02082021173252
123;127;02082021173252
124;125;02082021173252
125;128;02082021173252
126;126;02082021173252
127;126;02082021173252
128;128;02082021173252
129;126;02082021173252
130;126;02082021173252
131;128;02082021173252
132;126;02082021173252
133;130;02082021173252
134;126;02082021173252
135;126;02082021173252
136;128;02082021173252
137;125;02082021173252
138;128;02082021173252
139;126;02082021173252
140;124;02082021173252
141;128;02082021173252
142;126;02082021173252
143;126;02082021173252
144;127;02082021173252
145;125;02082021173252
146;128;02082021173252
147;126;02082021173252
148;125;02082021173252
149;126;02082021173252
150;126;02082021173252
151;126;02082021173252
152;126;02082021173252
153;126;02082021173252
154;127;02082021173252
155;125;02082021173252
156;126;02082021173252
157;126;02082021173252
158;126;02082021173252
159;125;02082021173252
160;128;02082021173252
161;126;02082021173252
162;128;02082021173252
163;127;02082021173252
164;125;02082021173252
165;128;02082021173252
166;127;02082021173252
167;127;02082021173252
168;129;02082021173252
169;125;02082021173252
170;127;02082021173252
171;126;02082021173252
172;126;02082021173252
173;127;02082021173252
174;127;02082021173252
175;125;02082021173252
176;128;02082021173252
177;126;02082021173252
178;128;02082021173252
179;127;02082021173252
180;127;02082021173252
181;128;02082021173252
182;126;02082021173252
183;126;02082021173252
184;128;02082021173252
185;125;02082021173252
186;128;02082021173252
187;127;02082021173252
188;125;02082021173252
189;127;02082021173252
190;127;02082021173252
191;126;02082021173252
192;129;02082021173252
193;126;02082021173252
194;126;02082021173252
195;127;02082021173252
196;126;02082021173252
197;127;02082021173252
198;127;02082021173252
199;126;02082021173252
200;0;02082021173252
0;0;02082021173252
1;154;02082021173252
2;130;02082021173252
3;128;02082021173252
4;128;02082021173252
5;130;02082021173252
6;127;02082021173252
7;128;02082021173252
8;130;02082021173252
9;128;02082021173252
10;130;02082021173252
11;128;02082021173252
12;129;02082021173252
13;131;02082021173252
14;129;02082021173252
15;132;02082021173252
16;132;02082021173252
17;132;02082021173252
18;138;02082021173252
19;140;02082021173252
20;155;02082021173252
21;194;02082021173252
22;298;02082021173252
23;586;02082021173252
24;1023;02082021173252
25;1023;02082021173252
26;1023;02082021173252
27;1023;02082021173252
28;1023;02082021173252
29;1023;02082021173252
30;1023;02082021173252
31;883;02082021173252
32;626;02082021173252
33;464;02082021173252
34;363;02082021173252
35;293;02082021173252
36;242;02082021173252
37;211;02082021173252
38;185;02082021173252
39;171;02082021173252
40;159;02082021173252
41;147;02082021173252
42;146;02082021173252
43;141;02082021173252
44;138;02082021173252
45;137;02082021173252
46;133;02082021173252
47;131;02082021173252
48;133;02082021173252
49;130;02082021173252
50;133;02082021173252
51;129;02082021173252
52;129;02082021173252
53;130;02082021173252
54;129;02082021173252
55;128;02082021173252
56;130;02082021173252
57;127;02082021173252
58;130;02082021173252
59;128;02082021173252
60;128;02082021173252
61;129;02082021173252
62;128;02082021173252
63;128;02082021173252
64;130;02082021173252
65;127;02082021173252
66;129;02082021173252
67;128;02082021173252
68;127;02082021173252
69;130;02082021173252
70;127;02082021173252
71;128;02082021173252
72;131;02082021173252
73;126;02082021173252
74;129;02082021173252
75;126;02082021173252
76;127;02082021173252
77;129;02082021173252
78;127;02082021173252
79;128;02082021173252
80;129;02082021173252
81;128;02082021173252
82;130;02082021173252
83;127;02082021173252
84;128;02082021173252
85;129;02082021173252
86;127;02082021173252
87;128;02082021173252
88;129;02082021173252
89;126;02082021173252
90;129;02082021173252
91;129;02082021173252
92;126;02082021173252
93;129;02082021173252
94;127;02082021173252
95;127;02082021173252
96;130;02082021173252
97;127;02082021173252
98;128;02082021173252
99;128;02082021173252
100;127;02082021173252
101;130;02082021173252
102;127;02082021173252
103;128;02082021173252
104;128;02082021173252
105;127;02082021173252
106;130;02082021173252
107;127;02082021173252
108;127;02082021173252
109;129;02082021173252
110;125;02082021173252
111;127;02082021173252
112;130;02082021173252
113;127;02082021173252
114;129;02082021173252
115;129;02082021173252
116;127;02082021173252
117;130;02082021173252
118;128;02082021173252
119;128;02082021173252
120;127;02082021173252
121;126;02082021173252
122;129;02082021173252
123;128;02082021173252
124;126;02082021173252
125;129;02082021173252
126;126;02082021173252
127;127;02082021173252
128;129;02082021173252
129;127;02082021173252
130;129;02082021173252
131;129;02082021173252
132;127;02082021173252
133;131;02082021173252
134;127;02082021173252
135;127;02082021173252
136;130;02082021173252
137;126;02082021173252
138;129;02082021173252
139;128;02082021173252
140;127;02082021173252
141;130;02082021173252
142;126;02082021173252
143;127;02082021173252
144;129;02082021173252
145;126;02082021173252
146;131;02082021173252
147;129;02082021173252
148;127;02082021173252
149;127;02082021173252
150;127;02082021173252
151;128;02082021173252
152;129;02082021173252
153;126;02082021173252
154;128;02082021173252
155;127;02082021173252
156;127;02082021173252
157;128;02082021173252
158;127;02082021173252
159;127;02082021173252
160;129;02082021173252
161;126;02082021173252
162;128;02082021173252
163;128;02082021173252
164;127;02082021173252
165;130;02082021173252
166;128;02082021173252
167;128;02082021173252
168;130;02082021173252
169;127;02082021173252
170;129;02082021173252
171;128;02082021173252
172;127;02082021173252
173;128;02082021173252
174;128;02082021173252
175;127;02082021173252
176;129;02082021173252
177;127;02082021173252
178;128;02082021173252
179;128;02082021173252
180;127;02082021173252
181;130;02082021173252
182;128;02082021173252
183;127;02082021173252
184;129;02082021173252
185;126;02082021173252
186;129;02082021173252
187;128;02082021173252
188;126;02082021173252
189;128;02082021173252
190;127;02082021173252
191;127;02082021173252
192;132;02082021173252
193;127;02082021173252
194;128;02082021173252
195;128;02082021173252
196;127;02082021173252
197;129;02082021173252
198;128;02082021173252
199;127;02082021173252
200;0;02082021173252
0;0;02082021173253
1;152;02082021173253
2;129;02082021173253
3;127;02082021173253
4;128;02082021173253
5;130;02082021173253
6;126;02082021173253
7;127;02082021173253
8;129;02082021173253
9;127;02082021173253
10;130;02082021173253
11;126;02082021173253
12;128;02082021173253
13;130;02082021173253
14;128;02082021173253
15;131;02082021173253
16;132;02082021173253
17;130;02082021173253
18;136;02082021173253
19;141;02082021173253
20;156;02082021173253
21;193;02082021173253
22;302;02082021173253
23;593;02082021173253
24;1023;02082021173253
25;1023;02082021173253
26;1023;02082021173253
27;1023;02082021173253
28;1023;02082021173253
29;1023;02082021173253
30;1023;02082021173253
31;896;02082021173253
32;636;02082021173253
33;471;02082021173253
34;369;02082021173253
35;294;02082021173253
36;243;02082021173253
37;210;02082021173253
38;186;02082021173253
39;169;02082021173253
40;160;02082021173253
41;147;02082021173253
42;146;02082021173253
43;140;02082021173253
44;137;02082021173253
45;135;02082021173253
46;130;02082021173253
47;131;02082021173253
48;132;02082021173253
49;129;02082021173253
50;132;02082021173253
51;128;02082021173253
52;127;02082021173253
53;130;02082021173253
54;127;02082021173253
55;127;02082021173253
56;128;02082021173253
57;126;02082021173253
58;129;02082021173253
59;127;02082021173253
60;127;02082021173253
61;129;02082021173253
62;127;02082021173253
63;128;02082021173253
64;128;02082021173253
65;126;02082021173253
66;129;02082021173253
67;127;02082021173253
68;126;02082021173253
69;129;02082021173253
70;126;02082021173253
71;126;02082021173253
72;129;02082021173253
73;124;02082021173253
74;129;02082021173253
75;126;02082021173253
76;126;02082021173253
77;128;02082021173253
78;125;02082021173253
79;127;02082021173253
80;130;02082021173253
81;126;02082021173253
82;129;02082021173253
83;127;02082021173253
84;127;02082021173253
85;128;02082021173253
86;125;02082021173253
87;126;02082021173253
88;128;02082021173253
89;124;02082021173253
90;127;02082021173253
91;128;02082021173253
92;126;02082021173253
93;128;02082021173253
94;127;02082021173253
95;126;02082021173253
96;129;02082021173253
97;127;02082021173253
98;128;02082021173253
99;127;02082021173253
100;126;02082021173253
101;129;02082021173253
102;126;02082021173253
103;127;02082021173253
104;126;02082021173253
105;125;02082021173253
106;129;02082021173253
107;127;02082021173253
108;126;02082021173253
109;129;02082021173253
110;124;02082021173253
111;127;02082021173253
112;129;02082021173253
113;125;02082021173253
114;128;02082021173253
115;128;02082021173253
116;127;02082021173253
117;130;02082021173253
118;126;02082021173253
119;127;02082021173253
120;126;02082021173253
121;125;02082021173253
122;126;02082021173253
123;127;02082021173253
124;125;02082021173253
125;129;02082021173253
126;127;02082021173253
127;126;02082021173253
128;129;02082021173253
129;126;02082021173253
130;127;02082021173253
131;129;02082021173253
132;126;02082021173253
133;129;02082021173253
134;126;02082021173253
135;127;02082021173253
136;128;02082021173253
137;125;02082021173253
138;127;02082021173253
139;127;02082021173253
140;126;02082021173253
141;128;02082021173253
142;127;02082021173253
143;127;02082021173253
144;128;02082021173253
145;124;02082021173253
146;128;02082021173253
147;126;02082021173253
148;127;02082021173253
149;127;02082021173253
150;126;02082021173253
151;127;02082021173253
152;127;02082021173253
153;125;02082021173253
154;127;02082021173253
155;125;02082021173253
156;125;02082021173253
157;126;02082021173253
158;126;02082021173253
159;127;02082021173253
160;127;02082021173253
161;125;02082021173253
162;127;02082021173253
163;127;02082021173253
164;126;02082021173253
165;129;02082021173253
166;127;02082021173253
167;127;02082021173253
168;129;02082021173253
169;125;02082021173253
170;127;02082021173253
171;126;02082021173253
172;126;02082021173253
173;126;02082021173253
174;127;02082021173253
175;125;02082021173253
176;128;02082021173253
177;126;02082021173253
178;128;02082021173253
179;127;02082021173253
180;126;02082021173253
181;127;02082021173253
182;128;02082021173253
183;126;02082021173253
184;128;02082021173253
185;125;02082021173253
186;128;02082021173253
187;128;02082021173253
188;125;02082021173253
189;127;02082021173253
190;125;02082021173253
191;126;02082021173253
192;131;02082021173253
193;126;02082021173253
194;127;02082021173253
195;127;02082021173253
196;127;02082021173253
197;127;02082021173253
198;128;02082021173253
199;127;02082021173253
200;0;02082021173253
0;0;02082021173253
1;152;02082021173253
2;128;02082021173253
3;126;02082021173253
4;128;02082021173253
5;129;02082021173253
6;126;02082021173253
7;128;02082021173253
8;128;02082021173253
9;127;02082021173253
10;129;02082021173253
11;127;02082021173253
12;127;02082021173253
13;129;02082021173253
14;128;02082021173253
15;130;02082021173253
16;131;02082021173253
17;131;02082021173253
18;136;02082021173253
19;142;02082021173253
20;154;02082021173253
21;193;02082021173253
22;297;02082021173253
23;588;02082021173253
24;1023;02082021173253
25;1023;02082021173253
26;1023;02082021173253
27;1023;02082021173253
28;1023;02082021173253
29;1023;02082021173253
30;1023;02082021173253
31;891;02082021173253
32;636;02082021173253
33;470;02082021173253
34;367;02082021173253
35;293;02082021173253
36;242;02082021173253
37;211;02082021173253
38;186;02082021173253
39;170;02082021173253
40;159;02082021173253
41;147;02082021173253
42;146;02082021173253
43;140;02082021173253
44;137;02082021173253
45;136;02082021173253
46;130;02082021173253
47;131;02082021173253
48;132;02082021173253
49;130;02082021173253
50;131;02082021173253
51;128;02082021173253
52;127;02082021173253
53;130;02082021173253
54;128;02082021173253
55;127;02082021173253
56;128;02082021173253
57;126;02082021173253
58;129;02082021173253
59;128;02082021173253
60;128;02082021173253
61;128;02082021173253
62;127;02082021173253
63;128;02082021173253
64;129;02082021173253
65;126;02082021173253
66;128;02082021173253
67;126;02082021173253
68;126;02082021173253
69;129;02082021173253
70;126;02082021173253
71;126;02082021173253
72;128;02082021173253
73;125;02082021173253
74;128;02082021173253
75;127;02082021173253
76;125;02082021173253
77;127;02082021173253
78;125;02082021173253
79;127;02082021173253
80;128;02082021173253
81;125;02082021173253
82;129;02082021173253
83;126;02082021173253
84;126;02082021173253
85;127;02082021173253
86;125;02082021173253
87;126;02082021173253
88;128;02082021173253
89;125;02082021173253
90;128;02082021173253
91;128;02082021173253
92;126;02082021173253
93;128;02082021173253
94;127;02082021173253
95;126;02082021173253
96;127;02082021173253
97;126;02082021173253
98;127;02082021173253
99;127;02082021173253
100;126;02082021173253
101;128;02082021173253
102;127;02082021173253
103;127;02082021173253
104;127;02082021173253
105;125;02082021173253
106;130;02082021173253
107;127;02082021173253
108;126;02082021173253
109;128;02082021173253
110;125;02082021173253
111;127;02082021173253
112;128;02082021173253
113;125;02082021173253
114;126;02082021173253
115;127;02082021173253
116;127;02082021173253
117;129;02082021173253
118;126;02082021173253
119;128;02082021173253
120;128;02082021173253
121;127;02082021173253
122;127;02082021173253
123;127;02082021173253
124;126;02082021173253
125;129;02082021173253
126;125;02082021173253
127;127;02082021173253
128;129;02082021173253
129;126;02082021173253
130;127;02082021173253
131;127;02082021173253
132;127;02082021173253
133;130;02082021173253
134;126;02082021173253
135;127;02082021173253
136;129;02082021173253
137;126;02082021173253
138;128;02082021173253
139;127;02082021173253
140;126;02082021173253
141;128;02082021173253
142;127;02082021173253
143;126;02082021173253
144;127;02082021173253
145;125;02082021173253
146;128;02082021173253
147;127;02082021173253
148;125;02082021173253
149;126;02082021173253
150;126;02082021173253
151;126;02082021173253
152;127;02082021173253
153;125;02082021173253
154;127;02082021173253
155;126;02082021173253
156;126;02082021173253
157;128;02082021173253
158;125;02082021173253
159;126;02082021173253
160;128;02082021173253
161;126;02082021173253
162;127;02082021173253
163;128;02082021173253
164;126;02082021173253
165;126;02082021173253
166;127;02082021173253
167;126;02082021173253
168;129;02082021173253
169;125;02082021173253
170;127;02082021173253
171;127;02082021173253
172;126;02082021173253
173;127;02082021173253
174;127;02082021173253
175;127;02082021173253
176;128;02082021173253
177;126;02082021173253
178;128;02082021173253
179;126;02082021173253
180;126;02082021173253
181;128;02082021173253
182;127;02082021173253
183;127;02082021173253
184;128;02082021173253
185;124;02082021173253
186;129;02082021173253
187;127;02082021173253
188;126;02082021173253
189;128;02082021173253
190;126;02082021173253
191;128;02082021173253
192;130;02082021173253
193;127;02082021173253
194;126;02082021173253
195;127;02082021173253
196;127;02082021173253
197;127;02082021173253
198;127;02082021173253
199;125;02082021173253
200;0;02082021173253
0;0;02082021173254
1;154;02082021173254
2;130;02082021173254
3;128;02082021173254
4;129;02082021173254
5;131;02082021173254
6;127;02082021173254
7;129;02082021173254
8;130;02082021173254
9;128;02082021173254
10;131;02082021173254
11;127;02082021173254
12;127;02082021173254
13;132;02082021173254
14;130;02082021173254
15;132;02082021173254
16;132;02082021173254
17;132;02082021173254
18;138;02082021173254
19;142;02082021173254
20;156;02082021173254
21;193;02082021173254
22;296;02082021173254
23;586;02082021173254
24;1023;02082021173254
25;1023;02082021173254
26;1023;02082021173254
27;1023;02082021173254
28;1023;02082021173254
29;1023;02082021173254
30;1023;02082021173254
31;883;02082021173254
32;623;02082021173254
33;464;02082021173254
34;364;02082021173254
35;293;02082021173254
36;239;02082021173254
37;210;02082021173254
38;185;02082021173254
39;170;02082021173254
40;161;02082021173254
41;148;02082021173254
42;146;02082021173254
43;141;02082021173254
44;138;02082021173254
45;137;02082021173254
46;132;02082021173254
47;132;02082021173254
48;133;02082021173254
49;130;02082021173254
50;132;02082021173254
51;130;02082021173254
52;129;02082021173254
53;130;02082021173254
54;129;02082021173254
55;128;02082021173254
56;130;02082021173254
57;128;02082021173254
58;130;02082021173254
59;129;02082021173254
60;128;02082021173254
61;129;02082021173254
62;127;02082021173254
63;128;02082021173254
64;130;02082021173254
65;127;02082021173254
66;130;02082021173254
67;128;02082021173254
68;127;02082021173254
69;131;02082021173254
70;127;02082021173254
71;127;02082021173254
72;130;02082021173254
73;127;02082021173254
74;129;02082021173254
75;128;02082021173254
76;128;02082021173254
77;130;02082021173254
78;127;02082021173254
79;128;02082021173254
80;129;02082021173254
81;127;02082021173254
82;130;02082021173254
83;128;02082021173254
84;129;02082021173254
85;129;02082021173254
86;127;02082021173254
87;128;02082021173254
88;130;02082021173254
89;126;02082021173254
90;129;02082021173254
91;129;02082021173254
92;127;02082021173254
93;129;02082021173254
94;129;02082021173254
95;128;02082021173254
96;130;02082021173254
97;128;02082021173254
98;128;02082021173254
99;129;02082021173254
100;127;02082021173254
101;130;02082021173254
102;128;02082021173254
103;129;02082021173254
104;128;02082021173254
105;128;02082021173254
106;131;02082021173254
107;128;02082021173254
108;127;02082021173254
109;129;02082021173254
110;127;02082021173254
111;128;02082021173254
112;130;02082021173254
113;127;02082021173254
114;129;02082021173254
115;129;02082021173254
116;128;02082021173254
117;132;02082021173254
118;128;02082021173254
119;129;02082021173254
120;127;02082021173254
121;127;02082021173254
122;128;02082021173254
123;128;02082021173254
124;127;02082021173254
125;130;02082021173254
126;127;02082021173254
127;129;02082021173254
128;131;02082021173254
129;127;02082021173254
130;128;02082021173254
131;129;02082021173254
132;127;02082021173254
133;131;02082021173254
134;126;02082021173254
135;127;02082021173254
136;130;02082021173254
137;128;02082021173254
138;129;02082021173254
139;129;02082021173254
140;127;02082021173254
141;131;02082021173254
142;128;02082021173254
143;127;02082021173254
144;130;02082021173254
145;126;02082021173254
146;130;02082021173254
147;128;02082021173254
148;126;02082021173254
149;128;02082021173254
150;128;02082021173254
151;127;02082021173254
152;128;02082021173254
153;127;02082021173254
154;129;02082021173254
155;127;02082021173254
156;127;02082021173254
157;129;02082021173254
158;128;02082021173254
159;128;02082021173254
160;129;02082021173254
161;128;02082021173254
162;129;02082021173254
163;129;02082021173254
164;127;02082021173254
165;129;02082021173254
166;128;02082021173254
167;129;02082021173254
168;130;02082021173254
169;127;02082021173254
170;129;02082021173254
171;129;02082021173254
172;128;02082021173254
173;129;02082021173254
174;128;02082021173254
175;128;02082021173254
176;129;02082021173254
177;127;02082021173254
178;129;02082021173254
179;127;02082021173254
180;128;02082021173254
181;129;02082021173254
182;128;02082021173254
183;128;02082021173254
184;129;02082021173254
185;127;02082021173254
186;130;02082021173254
187;128;02082021173254
188;127;02082021173254
189;129;02082021173254
190;127;02082021173254
191;128;02082021173254
192;131;02082021173254
193;129;02082021173254
194;128;02082021173254
195;128;02082021173254
196;127;02082021173254
197;130;02082021173254
198;128;02082021173254
199;126;02082021173254
200;0;02082021173254
0;0;02082021173254
1;153;02082021173254
2;130;02082021173254
3;128;02082021173254
4;127;02082021173254
5;129;02082021173254
6;126;02082021173254
7;127;02082021173254
8;128;02082021173254
9;126;02082021173254
10;130;02082021173254
11;128;02082021173254
12;127;02082021173254
13;130;02082021173254
14;128;02082021173254
15;131;02082021173254
16;132;02082021173254
17;131;02082021173254
18;137;02082021173254
19;140;02082021173254
20;155;02082021173254
21;193;02082021173254
22;302;02082021173254
23;591;02082021173254
24;1023;02082021173254
25;1023;02082021173254
26;1023;02082021173254
27;1023;02082021173254
28;1023;02082021173254
29;1023;02082021173254
30;1023;02082021173254
31;896;02082021173254
32;635;02082021173254
33;472;02082021173254
34;366;02082021173254
35;299;02082021173254
36;244;02082021173254
37;210;02082021173254
38;186;02082021173254
39;171;02082021173254
40;161;02082021173254
41;149;02082021173254
42;146;02082021173254
43;139;02082021173254
44;136;02082021173254
45;136;02082021173254
46;131;02082021173254
47;132;02082021173254
48;132;02082021173254
49;129;02082021173254
50;131;02082021173254
51;129;02082021173254
52;128;02082021173254
53;130;02082021173254
54;127;02082021173254
55;127;02082021173254
56;129;02082021173254
57;127;02082021173254
58;128;02082021173254
59;127;02082021173254
60;127;02082021173254
61;129;02082021173254
62;127;02082021173254
63;128;02082021173254
64;129;02082021173254
65;125;02082021173254
66;129;02082021173254
67;127;02082021173254
68;127;02082021173254
69;130;02082021173254
70;125;02082021173254
71;126;02082021173254
72;129;02082021173254
73;126;02082021173254
74;129;02082021173254
75;126;02082021173254
76;126;02082021173254
77;128;02082021173254
78;127;02082021173254
79;127;02082021173254
80;128;02082021173254
81;126;02082021173254
82;129;02082021173254
83;127;02082021173254
84;128;02082021173254
85;128;02082021173254
86;127;02082021173254
87;127;02082021173254
88;129;02082021173254
89;125;02082021173254
90;128;02082021173254
91;127;02082021173254
92;125;02082021173254
93;127;02082021173254
94;126;02082021173254
95;126;02082021173254
96;129;02082021173254
97;127;02082021173254
98;128;02082021173254
99;126;02082021173254
100;126;02082021173254
101;128;02082021173254
102;127;02082021173254
103;127;02082021173254
104;128;02082021173254
105;125;02082021173254
106;130;02082021173254
107;127;02082021173254
108;126;02082021173254
109;128;02082021173254
110;126;02082021173254
111;126;02082021173254
112;129;02082021173254
113;125;02082021173254
114;127;02082021173254
115;128;02082021173254
116;127;02082021173254
117;130;02082021173254
118;127;02082021173254
119;128;02082021173254
120;127;02082021173254
121;126;02082021173254
122;126;02082021173254
123;127;02082021173254
124;125;02082021173254
125;128;02082021173254
126;126;02082021173254
127;127;02082021173254
128;128;02082021173254
129;126;02082021173254
130;128;02082021173254
131;128;02082021173254
132;126;02082021173254
133;129;02082021173254
134;126;02082021173254
135;126;02082021173254
136;129;02082021173254
137;127;02082021173254
138;129;02082021173254
139;127;02082021173254
140;126;02082021173254
141;128;02082021173254
142;126;02082021173254
143;126;02082021173254
144;127;02082021173254
145;124;02082021173254
146;129;02082021173254
147;128;02082021173254
148;126;02082021173254
149;127;02082021173254
150;126;02082021173254
151;127;02082021173254
152;127;02082021173254
153;125;02082021173254
154;129;02082021173254
155;125;02082021173254
156;125;02082021173254
157;127;02082021173254
158;126;02082021173254
159;126;02082021173254
160;128;02082021173254
161;126;02082021173254
162;128;02082021173254
163;127;02082021173254
164;127;02082021173254
165;129;02082021173254
166;127;02082021173254
167;127;02082021173254
168;127;02082021173254
169;125;02082021173254
170;128;02082021173254
171;127;02082021173254
172;126;02082021173254
173;128;02082021173254
174;126;02082021173254
175;126;02082021173254
176;128;02082021173254
177;126;02082021173254
178;129;02082021173254
179;127;02082021173254
180;127;02082021173254
181;129;02082021173254
182;127;02082021173254
183;126;02082021173254
184;128;02082021173254
185;125;02082021173254
186;128;02082021173254
187;127;02082021173254
188;125;02082021173254
189;127;02082021173254
190;126;02082021173254
191;126;02082021173254
192;130;02082021173254
193;126;02082021173254
194;127;02082021173254
195;127;02082021173254
196;125;02082021173254
197;127;02082021173254
198;127;02082021173254
199;126;02082021173254
200;0;02082021173254
0;0;02082021173254
1;152;02082021173254
2;129;02082021173254
3;127;02082021173254
4;128;02082021173254
5;129;02082021173254
6;126;02082021173254
7;128;02082021173254
8;129;02082021173254
9;127;02082021173254
10;130;02082021173254
11;127;02082021173254
12;128;02082021173254
13;130;02082021173254
14;129;02082021173254
15;131;02082021173254
16;132;02082021173254
17;132;02082021173254
18;137;02082021173254
19;142;02082021173254
20;155;02082021173254
21;193;02082021173254
22;300;02082021173254
23;589;02082021173254
24;1023;02082021173254
25;1023;02082021173254
26;1023;02082021173254
27;1023;02082021173254
28;1023;02082021173254
29;1023;02082021173254
30;1023;02082021173254
31;894;02082021173254
32;636;02082021173254
33;470;02082021173254
34;367;02082021173254
35;295;02082021173254
36;248;02082021173254
37;212;02082021173254
38;186;02082021173254
39;172;02082021173254
40;159;02082021173254
41;149;02082021173254
42;145;02082021173254
43;140;02082021173254
44;136;02082021173254
45;135;02082021173254
46;131;02082021173254
47;131;02082021173254
48;133;02082021173254
49;128;02082021173254
50;132;02082021173254
51;129;02082021173254
52;128;02082021173254
53;130;02082021173254
54;127;02082021173254
55;127;02082021173254
56;128;02082021173254
57;127;02082021173254
58;129;02082021173254
59;127;02082021173254
60;128;02082021173254
61;128;02082021173254
62;127;02082021173254
63;128;02082021173254
64;129;02082021173254
65;125;02082021173254
66;129;02082021173254
67;128;02082021173254
68;127;02082021173254
69;130;02082021173254
70;126;02082021173254
71;127;02082021173254
72;128;02082021173254
73;126;02082021173254
74;128;02082021173254
75;126;02082021173254
76;126;02082021173254
77;127;02082021173254
78;125;02082021173254
79;126;02082021173254
80;128;02082021173254
81;126;02082021173254
82;129;02082021173254
83;127;02082021173254
84;126;02082021173254
85;128;02082021173254
86;125;02082021173254
87;127;02082021173254
88;129;02082021173254
89;124;02082021173254
90;128;02082021173254
91;127;02082021173254
92;125;02082021173254
93;128;02082021173254
94;127;02082021173254
95;125;02082021173254
96;128;02082021173254
97;127;02082021173254
98;127;02082021173254
99;127;02082021173254
100;126;02082021173254
101;128;02082021173254
102;126;02082021173254
103;127;02082021173254
104;129;02082021173254
105;126;02082021173254
106;130;02082021173254
107;127;02082021173254
108;126;02082021173254
109;128;02082021173254
110;126;02082021173254
111;127;02082021173254
112;129;02082021173254
113;125;02082021173254
114;128;02082021173254
115;128;02082021173254
116;127;02082021173254
117;130;02082021173254
118;127;02082021173254
119;127;02082021173254
120;126;02082021173254
121;125;02082021173254
122;128;02082021173254
123;127;02082021173254
124;125;02082021173254
125;129;02082021173254
126;126;02082021173254
127;127;02082021173254
128;128;02082021173254
129;126;02082021173254
130;128;02082021173254
131;129;02082021173254
132;127;02082021173254
133;130;02082021173254
134;126;02082021173254
135;127;02082021173254
136;128;02082021173254
137;125;02082021173254
138;129;02082021173254
139;127;02082021173254
140;126;02082021173254
141;129;02082021173254
142;126;02082021173254
143;127;02082021173254
144;128;02082021173254
145;126;02082021173254
146;128;02082021173254
147;127;02082021173254
148;126;02082021173254
149;127;02082021173254
150;127;02082021173254
151;126;02082021173254
152;127;02082021173254
153;125;02082021173254
154;128;02082021173254
155;126;02082021173254
156;126;02082021173254
157;127;02082021173254
158;126;02082021173254
159;125;02082021173254
160;128;02082021173254
161;126;02082021173254
162;128;02082021173254
163;128;02082021173254
164;127;02082021173254
165;129;02082021173254
166;127;02082021173254
167;127;02082021173254
168;129;02082021173254
169;126;02082021173254
170;127;02082021173254
171;128;02082021173254
172;127;02082021173254
173;128;02082021173254
174;127;02082021173254
175;126;02082021173254
176;128;02082021173254
177;126;02082021173254
178;129;02082021173254
179;127;02082021173254
180;125;02082021173254
181;129;02082021173254
182;128;02082021173254
183;127;02082021173254
184;128;02082021173254
185;124;02082021173254
186;128;02082021173254
187;128;02082021173254
188;125;02082021173254
189;127;02082021173254
190;126;02082021173254
191;126;02082021173254
192;130;02082021173254
193;126;02082021173254
194;127;02082021173254
195;127;02082021173254
196;126;02082021173254
197;128;02082021173254
198;127;02082021173254
199;127;02082021173254
200;0;02082021173254
