ind;val;datetime
0;0;30062021114445
1;153;30062021114445
2;136;30062021114445
3;134;30062021114445
4;135;30062021114445
5;137;30062021114445
6;134;30062021114445
7;136;30062021114445
8;136;30062021114445
9;135;30062021114445
10;139;30062021114445
11;137;30062021114445
12;139;30062021114445
13;143;30062021114445
14;143;30062021114445
15;148;30062021114445
16;152;30062021114445
17;162;30062021114445
18;183;30062021114445
19;226;30062021114445
20;323;30062021114445
21;562;30062021114445
22;1023;30062021114445
23;1023;30062021114445
24;1023;30062021114445
25;1023;30062021114445
26;1023;30062021114445
27;1023;30062021114445
28;1023;30062021114445
29;1023;30062021114445
30;1023;30062021114445
31;1023;30062021114445
32;1023;30062021114445
33;998;30062021114445
34;773;30062021114445
35;581;30062021114445
36;445;30062021114445
37;357;30062021114445
38;298;30062021114445
39;259;30062021114445
40;235;30062021114445
41;215;30062021114445
42;205;30062021114445
43;198;30062021114445
44;196;30062021114445
45;195;30062021114445
46;191;30062021114445
47;190;30062021114445
48;191;30062021114445
49;188;30062021114445
50;188;30062021114445
51;187;30062021114445
52;187;30062021114445
53;191;30062021114445
54;189;30062021114445
55;189;30062021114445
56;189;30062021114445
57;190;30062021114445
58;194;30062021114445
59;196;30062021114445
60;199;30062021114445
61;201;30062021114445
62;200;30062021114445
63;204;30062021114445
64;206;30062021114445
65;202;30062021114445
66;205;30062021114445
67;205;30062021114445
68;201;30062021114445
69;202;30062021114445
70;198;30062021114445
71;196;30062021114445
72;196;30062021114445
73;190;30062021114445
74;191;30062021114445
75;185;30062021114445
76;184;30062021114445
77;184;30062021114445
78;181;30062021114445
79;177;30062021114445
80;176;30062021114445
81;172;30062021114445
82;174;30062021114445
83;170;30062021114445
84;168;30062021114445
85;169;30062021114445
86;167;30062021114445
87;166;30062021114445
88;168;30062021114445
89;163;30062021114445
90;164;30062021114445
91;163;30062021114445
92;161;30062021114445
93;162;30062021114445
94;157;30062021114445
95;157;30062021114445
96;157;30062021114445
97;154;30062021114445
98;154;30062021114445
99;153;30062021114445
100;149;30062021114445
101;153;30062021114445
102;150;30062021114445
103;149;30062021114445
104;149;30062021114445
105;146;30062021114445
106;149;30062021114445
107;145;30062021114445
108;145;30062021114445
109;146;30062021114445
110;143;30062021114445
111;144;30062021114445
112;145;30062021114445
113;141;30062021114445
114;142;30062021114445
115;143;30062021114445
116;140;30062021114445
117;145;30062021114445
118;140;30062021114445
119;141;30062021114445
120;139;30062021114445
121;137;30062021114445
122;139;30062021114445
123;139;30062021114445
124;137;30062021114445
125;139;30062021114445
126;136;30062021114445
127;137;30062021114445
128;139;30062021114445
129;136;30062021114445
130;136;30062021114445
131;137;30062021114445
132;134;30062021114445
133;139;30062021114445
134;134;30062021114445
135;135;30062021114445
136;136;30062021114445
137;133;30062021114445
138;135;30062021114445
139;134;30062021114445
140;132;30062021114445
141;135;30062021114445
142;133;30062021114445
143;132;30062021114445
144;134;30062021114445
145;131;30062021114445
146;135;30062021114445
147;134;30062021114445
148;132;30062021114445
149;132;30062021114445
150;131;30062021114445
151;133;30062021114445
152;133;30062021114445
153;131;30062021114445
154;133;30062021114445
155;131;30062021114445
156;131;30062021114445
157;131;30062021114445
158;130;30062021114445
159;131;30062021114445
160;132;30062021114445
161;131;30062021114445
162;132;30062021114445
163;132;30062021114445
164;130;30062021114445
165;133;30062021114445
166;131;30062021114445
167;131;30062021114445
168;132;30062021114445
169;129;30062021114445
170;131;30062021114445
171;132;30062021114445
172;130;30062021114445
173;131;30062021114445
174;131;30062021114445
175;130;30062021114445
176;131;30062021114445
177;130;30062021114445
178;132;30062021114445
179;130;30062021114445
180;128;30062021114445
181;131;30062021114445
182;132;30062021114445
183;130;30062021114445
184;132;30062021114445
185;128;30062021114445
186;131;30062021114445
187;131;30062021114445
188;130;30062021114445
189;131;30062021114445
190;130;30062021114445
191;130;30062021114445
192;133;30062021114445
193;130;30062021114445
194;130;30062021114445
195;130;30062021114445
196;130;30062021114445
197;131;30062021114445
198;131;30062021114445
199;130;30062021114445
200;0;30062021114445
0;0;30062021114446
1;151;30062021114446
2;133;30062021114446
3;131;30062021114446
4;132;30062021114446
5;133;30062021114446
6;132;30062021114446
7;134;30062021114446
8;135;30062021114446
9;133;30062021114446
10;137;30062021114446
11;135;30062021114446
12;134;30062021114446
13;141;30062021114446
14;140;30062021114446
15;144;30062021114446
16;150;30062021114446
17;158;30062021114446
18;182;30062021114446
19;223;30062021114446
20;320;30062021114446
21;559;30062021114446
22;1023;30062021114446
23;1023;30062021114446
24;1023;30062021114446
25;1023;30062021114446
26;1023;30062021114446
27;1023;30062021114446
28;1023;30062021114446
29;1023;30062021114446
30;1023;30062021114446
31;1023;30062021114446
32;1023;30062021114446
33;1008;30062021114446
34;775;30062021114446
35;589;30062021114446
36;447;30062021114446
37;357;30062021114446
38;297;30062021114446
39;258;30062021114446
40;234;30062021114446
41;214;30062021114446
42;205;30062021114446
43;199;30062021114446
44;192;30062021114446
45;191;30062021114446
46;189;30062021114446
47;190;30062021114446
48;189;30062021114446
49;188;30062021114446
50;189;30062021114446
51;186;30062021114446
52;185;30062021114446
53;185;30062021114446
54;187;30062021114446
55;187;30062021114446
56;189;30062021114446
57;188;30062021114446
58;194;30062021114446
59;195;30062021114446
60;196;30062021114446
61;199;30062021114446
62;199;30062021114446
63;200;30062021114446
64;203;30062021114446
65;198;30062021114446
66;205;30062021114446
67;201;30062021114446
68;201;30062021114446
69;199;30062021114446
70;196;30062021114446
71;196;30062021114446
72;194;30062021114446
73;190;30062021114446
74;189;30062021114446
75;186;30062021114446
76;183;30062021114446
77;182;30062021114446
78;179;30062021114446
79;178;30062021114446
80;175;30062021114446
81;171;30062021114446
82;174;30062021114446
83;169;30062021114446
84;167;30062021114446
85;167;30062021114446
86;165;30062021114446
87;164;30062021114446
88;166;30062021114446
89;160;30062021114446
90;162;30062021114446
91;161;30062021114446
92;157;30062021114446
93;160;30062021114446
94;157;30062021114446
95;155;30062021114446
96;155;30062021114446
97;153;30062021114446
98;152;30062021114446
99;149;30062021114446
100;148;30062021114446
101;150;30062021114446
102;147;30062021114446
103;146;30062021114446
104;148;30062021114446
105;143;30062021114446
106;148;30062021114446
107;145;30062021114446
108;143;30062021114446
109;144;30062021114446
110;140;30062021114446
111;141;30062021114446
112;142;30062021114446
113;139;30062021114446
114;140;30062021114446
115;141;30062021114446
116;137;30062021114446
117;141;30062021114446
118;138;30062021114446
119;139;30062021114446
120;137;30062021114446
121;135;30062021114446
122;137;30062021114446
123;136;30062021114446
124;135;30062021114446
125;136;30062021114446
126;133;30062021114446
127;135;30062021114446
128;136;30062021114446
129;132;30062021114446
130;133;30062021114446
131;135;30062021114446
132;133;30062021114446
133;136;30062021114446
134;133;30062021114446
135;132;30062021114446
136;134;30062021114446
137;130;30062021114446
138;132;30062021114446
139;130;30062021114446
140;131;30062021114446
141;134;30062021114446
142;131;30062021114446
143;130;30062021114446
144;132;30062021114446
145;129;30062021114446
146;132;30062021114446
147;130;30062021114446
148;129;30062021114446
149;130;30062021114446
150;130;30062021114446
151;130;30062021114446
152;130;30062021114446
153;128;30062021114446
154;131;30062021114446
155;129;30062021114446
156;129;30062021114446
157;130;30062021114446
158;129;30062021114446
159;128;30062021114446
160;130;30062021114446
161;128;30062021114446
162;129;30062021114446
163;130;30062021114446
164;129;30062021114446
165;130;30062021114446
166;129;30062021114446
167;129;30062021114446
168;131;30062021114446
169;128;30062021114446
170;129;30062021114446
171;128;30062021114446
172;129;30062021114446
173;129;30062021114446
174;128;30062021114446
175;127;30062021114446
176;130;30062021114446
177;128;30062021114446
178;130;30062021114446
179;128;30062021114446
180;129;30062021114446
181;130;30062021114446
182;129;30062021114446
183;127;30062021114446
184;129;30062021114446
185;126;30062021114446
186;129;30062021114446
187;128;30062021114446
188;127;30062021114446
189;128;30062021114446
190;127;30062021114446
191;128;30062021114446
192;131;30062021114446
193;127;30062021114446
194;128;30062021114446
195;129;30062021114446
196;127;30062021114446
197;129;30062021114446
198;128;30062021114446
199;128;30062021114446
200;0;30062021114446
0;0;30062021114447
1;152;30062021114447
2;134;30062021114447
3;132;30062021114447
4;132;30062021114447
5;133;30062021114447
6;132;30062021114447
7;134;30062021114447
8;134;30062021114447
9;134;30062021114447
10;137;30062021114447
11;135;30062021114447
12;136;30062021114447
13;140;30062021114447
14;140;30062021114447
15;145;30062021114447
16;149;30062021114447
17;159;30062021114447
18;184;30062021114447
19;224;30062021114447
20;322;30062021114447
21;561;30062021114447
22;1023;30062021114447
23;1023;30062021114447
24;1023;30062021114447
25;1023;30062021114447
26;1023;30062021114447
27;1023;30062021114447
28;1023;30062021114447
29;1023;30062021114447
30;1023;30062021114447
31;1023;30062021114447
32;1023;30062021114447
33;1011;30062021114447
34;777;30062021114447
35;593;30062021114447
36;451;30062021114447
37;362;30062021114447
38;303;30062021114447
39;259;30062021114447
40;235;30062021114447
41;214;30062021114447
42;206;30062021114447
43;197;30062021114447
44;194;30062021114447
45;194;30062021114447
46;191;30062021114447
47;190;30062021114447
48;192;30062021114447
49;188;30062021114447
50;190;30062021114447
51;187;30062021114447
52;185;30062021114447
53;187;30062021114447
54;187;30062021114447
55;186;30062021114447
56;188;30062021114447
57;190;30062021114447
58;195;30062021114447
59;196;30062021114447
60;197;30062021114447
61;199;30062021114447
62;198;30062021114447
63;201;30062021114447
64;203;30062021114447
65;200;30062021114447
66;204;30062021114447
67;201;30062021114447
68;200;30062021114447
69;199;30062021114447
70;197;30062021114447
71;196;30062021114447
72;197;30062021114447
73;190;30062021114447
74;192;30062021114447
75;185;30062021114447
76;184;30062021114447
77;184;30062021114447
78;178;30062021114447
79;177;30062021114447
80;174;30062021114447
81;171;30062021114447
82;171;30062021114447
83;169;30062021114447
84;168;30062021114447
85;167;30062021114447
86;164;30062021114447
87;166;30062021114447
88;164;30062021114447
89;161;30062021114447
90;163;30062021114447
91;160;30062021114447
92;158;30062021114447
93;159;30062021114447
94;157;30062021114447
95;155;30062021114447
96;156;30062021114447
97;152;30062021114447
98;152;30062021114447
99;151;30062021114447
100;149;30062021114447
101;150;30062021114447
102;148;30062021114447
103;147;30062021114447
104;147;30062021114447
105;144;30062021114447
106;147;30062021114447
107;144;30062021114447
108;143;30062021114447
109;144;30062021114447
110;141;30062021114447
111;140;30062021114447
112;143;30062021114447
113;139;30062021114447
114;141;30062021114447
115;141;30062021114447
116;139;30062021114447
117;141;30062021114447
118;137;30062021114447
119;139;30062021114447
120;137;30062021114447
121;137;30062021114447
122;137;30062021114447
123;136;30062021114447
124;135;30062021114447
125;137;30062021114447
126;134;30062021114447
127;134;30062021114447
128;136;30062021114447
129;134;30062021114447
130;135;30062021114447
131;135;30062021114447
132;132;30062021114447
133;138;30062021114447
134;132;30062021114447
135;133;30062021114447
136;134;30062021114447
137;130;30062021114447
138;133;30062021114447
139;132;30062021114447
140;130;30062021114447
141;132;30062021114447
142;130;30062021114447
143;131;30062021114447
144;133;30062021114447
145;129;30062021114447
146;133;30062021114447
147;131;30062021114447
148;130;30062021114447
149;130;30062021114447
150;130;30062021114447
151;130;30062021114447
152;129;30062021114447
153;129;30062021114447
154;132;30062021114447
155;129;30062021114447
156;128;30062021114447
157;130;30062021114447
158;128;30062021114447
159;128;30062021114447
160;130;30062021114447
161;130;30062021114447
162;130;30062021114447
163;130;30062021114447
164;129;30062021114447
165;130;30062021114447
166;128;30062021114447
167;129;30062021114447
168;130;30062021114447
169;127;30062021114447
170;129;30062021114447
171;129;30062021114447
172;129;30062021114447
173;130;30062021114447
174;129;30062021114447
175;127;30062021114447
176;129;30062021114447
177;128;30062021114447
178;131;30062021114447
179;128;30062021114447
180;129;30062021114447
181;130;30062021114447
182;129;30062021114447
183;128;30062021114447
184;129;30062021114447
185;126;30062021114447
186;130;30062021114447
187;128;30062021114447
188;126;30062021114447
189;129;30062021114447
190;127;30062021114447
191;128;30062021114447
192;131;30062021114447
193;127;30062021114447
194;127;30062021114447
195;128;30062021114447
196;127;30062021114447
197;128;30062021114447
198;129;30062021114447
199;128;30062021114447
200;0;30062021114447
0;0;30062021114448
1;151;30062021114448
2;134;30062021114448
3;133;30062021114448
4;134;30062021114448
5;134;30062021114448
6;133;30062021114448
7;135;30062021114448
8;136;30062021114448
9;135;30062021114448
10;138;30062021114448
11;137;30062021114448
12;136;30062021114448
13;141;30062021114448
14;142;30062021114448
15;145;30062021114448
16;151;30062021114448
17;158;30062021114448
18;182;30062021114448
19;225;30062021114448
20;320;30062021114448
21;568;30062021114448
22;1023;30062021114448
23;1023;30062021114448
24;1023;30062021114448
25;1023;30062021114448
26;1023;30062021114448
27;1023;30062021114448
28;1023;30062021114448
29;1023;30062021114448
30;1023;30062021114448
31;1023;30062021114448
32;1023;30062021114448
33;1018;30062021114448
34;785;30062021114448
35;600;30062021114448
36;450;30062021114448
37;361;30062021114448
38;299;30062021114448
39;262;30062021114448
40;235;30062021114448
41;214;30062021114448
42;209;30062021114448
43;199;30062021114448
44;196;30062021114448
45;194;30062021114448
46;192;30062021114448
47;190;30062021114448
48;191;30062021114448
49;187;30062021114448
50;190;30062021114448
51;187;30062021114448
52;187;30062021114448
53;189;30062021114448
54;188;30062021114448
55;189;30062021114448
56;192;30062021114448
57;191;30062021114448
58;196;30062021114448
59;195;30062021114448
60;196;30062021114448
61;199;30062021114448
62;200;30062021114448
63;203;30062021114448
64;205;30062021114448
65;199;30062021114448
66;204;30062021114448
67;204;30062021114448
68;200;30062021114448
69;201;30062021114448
70;196;30062021114448
71;196;30062021114448
72;197;30062021114448
73;189;30062021114448
74;192;30062021114448
75;186;30062021114448
76;185;30062021114448
77;184;30062021114448
78;180;30062021114448
79;177;30062021114448
80;176;30062021114448
81;172;30062021114448
82;173;30062021114448
83;170;30062021114448
84;169;30062021114448
85;170;30062021114448
86;165;30062021114448
87;166;30062021114448
88;165;30062021114448
89;162;30062021114448
90;164;30062021114448
91;161;30062021114448
92;158;30062021114448
93;160;30062021114448
94;157;30062021114448
95;155;30062021114448
96;157;30062021114448
97;153;30062021114448
98;153;30062021114448
99;151;30062021114448
100;151;30062021114448
101;151;30062021114448
102;148;30062021114448
103;148;30062021114448
104;148;30062021114448
105;145;30062021114448
106;147;30062021114448
107;143;30062021114448
108;143;30062021114448
109;145;30062021114448
110;142;30062021114448
111;142;30062021114448
112;143;30062021114448
113;141;30062021114448
114;141;30062021114448
115;142;30062021114448
116;138;30062021114448
117;143;30062021114448
118;138;30062021114448
119;137;30062021114448
120;137;30062021114448
121;136;30062021114448
122;138;30062021114448
123;136;30062021114448
124;136;30062021114448
125;138;30062021114448
126;135;30062021114448
127;136;30062021114448
128;138;30062021114448
129;134;30062021114448
130;135;30062021114448
131;135;30062021114448
132;133;30062021114448
133;136;30062021114448
134;132;30062021114448
135;132;30062021114448
136;134;30062021114448
137;131;30062021114448
138;135;30062021114448
139;132;30062021114448
140;131;30062021114448
141;133;30062021114448
142;131;30062021114448
143;131;30062021114448
144;132;30062021114448
145;130;30062021114448
146;133;30062021114448
147;131;30062021114448
148;130;30062021114448
149;131;30062021114448
150;130;30062021114448
151;130;30062021114448
152;131;30062021114448
153;129;30062021114448
154;131;30062021114448
155;130;30062021114448
156;129;30062021114448
157;129;30062021114448
158;130;30062021114448
159;130;30062021114448
160;131;30062021114448
161;129;30062021114448
162;130;30062021114448
163;130;30062021114448
164;129;30062021114448
165;131;30062021114448
166;128;30062021114448
167;129;30062021114448
168;130;30062021114448
169;128;30062021114448
170;130;30062021114448
171;129;30062021114448
172;128;30062021114448
173;130;30062021114448
174;128;30062021114448
175;129;30062021114448
176;129;30062021114448
177;128;30062021114448
178;130;30062021114448
179;129;30062021114448
180;128;30062021114448
181;130;30062021114448
182;130;30062021114448
183;129;30062021114448
184;129;30062021114448
185;128;30062021114448
186;131;30062021114448
187;129;30062021114448
188;127;30062021114448
189;129;30062021114448
190;129;30062021114448
191;128;30062021114448
192;131;30062021114448
193;128;30062021114448
194;128;30062021114448
195;129;30062021114448
196;128;30062021114448
197;129;30062021114448
198;129;30062021114448
199;128;30062021114448
200;0;30062021114448
0;0;30062021114448
1;152;30062021114448
2;133;30062021114448
3;132;30062021114448
4;134;30062021114448
5;135;30062021114448
6;132;30062021114448
7;134;30062021114448
8;136;30062021114448
9;133;30062021114448
10;138;30062021114448
11;135;30062021114448
12;136;30062021114448
13;142;30062021114448
14;141;30062021114448
15;146;30062021114448
16;150;30062021114448
17;159;30062021114448
18;184;30062021114448
19;226;30062021114448
20;323;30062021114448
21;563;30062021114448
22;1023;30062021114448
23;1023;30062021114448
24;1023;30062021114448
25;1023;30062021114448
26;1023;30062021114448
27;1023;30062021114448
28;1023;30062021114448
29;1023;30062021114448
30;1023;30062021114448
31;1023;30062021114448
32;1023;30062021114448
33;1014;30062021114448
34;788;30062021114448
35;599;30062021114448
36;453;30062021114448
37;365;30062021114448
38;300;30062021114448
39;261;30062021114448
40;235;30062021114448
41;216;30062021114448
42;207;30062021114448
43;198;30062021114448
44;196;30062021114448
45;194;30062021114448
46;192;30062021114448
47;191;30062021114448
48;191;30062021114448
49;188;30062021114448
50;191;30062021114448
51;186;30062021114448
52;187;30062021114448
53;188;30062021114448
54;187;30062021114448
55;190;30062021114448
56;190;30062021114448
57;190;30062021114448
58;194;30062021114448
59;193;30062021114448
60;195;30062021114448
61;202;30062021114448
62;200;30062021114448
63;203;30062021114448
64;207;30062021114448
65;199;30062021114448
66;202;30062021114448
67;202;30062021114448
68;200;30062021114448
69;202;30062021114448
70;199;30062021114448
71;196;30062021114448
72;196;30062021114448
73;190;30062021114448
74;191;30062021114448
75;185;30062021114448
76;184;30062021114448
77;184;30062021114448
78;181;30062021114448
79;180;30062021114448
80;177;30062021114448
81;171;30062021114448
82;173;30062021114448
83;170;30062021114448
84;169;30062021114448
85;169;30062021114448
86;166;30062021114448
87;166;30062021114448
88;167;30062021114448
89;162;30062021114448
90;165;30062021114448
91;162;30062021114448
92;159;30062021114448
93;160;30062021114448
94;157;30062021114448
95;154;30062021114448
96;158;30062021114448
97;153;30062021114448
98;152;30062021114448
99;151;30062021114448
100;150;30062021114448
101;152;30062021114448
102;148;30062021114448
103;148;30062021114448
104;148;30062021114448
105;144;30062021114448
106;147;30062021114448
107;144;30062021114448
108;144;30062021114448
109;144;30062021114448
110;142;30062021114448
111;142;30062021114448
112;145;30062021114448
113;140;30062021114448
114;140;30062021114448
115;141;30062021114448
116;140;30062021114448
117;142;30062021114448
118;137;30062021114448
119;139;30062021114448
120;138;30062021114448
121;136;30062021114448
122;138;30062021114448
123;138;30062021114448
124;136;30062021114448
125;138;30062021114448
126;134;30062021114448
127;135;30062021114448
128;138;30062021114448
129;136;30062021114448
130;134;30062021114448
131;136;30062021114448
132;134;30062021114448
133;137;30062021114448
134;133;30062021114448
135;133;30062021114448
136;134;30062021114448
137;131;30062021114448
138;133;30062021114448
139;133;30062021114448
140;131;30062021114448
141;134;30062021114448
142;131;30062021114448
143;132;30062021114448
144;133;30062021114448
145;130;30062021114448
146;133;30062021114448
147;132;30062021114448
148;131;30062021114448
149;132;30062021114448
150;131;30062021114448
151;131;30062021114448
152;131;30062021114448
153;129;30062021114448
154;131;30062021114448
155;129;30062021114448
156;129;30062021114448
157;130;30062021114448
158;130;30062021114448
159;130;30062021114448
160;131;30062021114448
161;130;30062021114448
162;130;30062021114448
163;131;30062021114448
164;130;30062021114448
165;131;30062021114448
166;129;30062021114448
167;130;30062021114448
168;131;30062021114448
169;128;30062021114448
170;130;30062021114448
171;130;30062021114448
172;129;30062021114448
173;130;30062021114448
174;127;30062021114448
175;128;30062021114448
176;130;30062021114448
177;128;30062021114448
178;131;30062021114448
179;130;30062021114448
180;128;30062021114448
181;130;30062021114448
182;130;30062021114448
183;129;30062021114448
184;130;30062021114448
185;127;30062021114448
186;131;30062021114448
187;131;30062021114448
188;128;30062021114448
189;128;30062021114448
190;128;30062021114448
191;129;30062021114448
192;132;30062021114448
193;128;30062021114448
194;129;30062021114448
195;129;30062021114448
196;128;30062021114448
197;131;30062021114448
198;128;30062021114448
199;129;30062021114448
200;0;30062021114448
0;0;30062021114449
1;154;30062021114449
2;136;30062021114449
3;133;30062021114449
4;135;30062021114449
5;136;30062021114449
6;134;30062021114449
7;136;30062021114449
8;138;30062021114449
9;135;30062021114449
10;140;30062021114449
11;137;30062021114449
12;139;30062021114449
13;143;30062021114449
14;142;30062021114449
15;147;30062021114449
16;151;30062021114449
17;159;30062021114449
18;184;30062021114449
19;225;30062021114449
20;322;30062021114449
21;559;30062021114449
22;1023;30062021114449
23;1023;30062021114449
24;1023;30062021114449
25;1023;30062021114449
26;1023;30062021114449
27;1023;30062021114449
28;1023;30062021114449
29;1023;30062021114449
30;1023;30062021114449
31;1023;30062021114449
32;1023;30062021114449
33;1016;30062021114449
34;785;30062021114449
35;594;30062021114449
36;452;30062021114449
37;364;30062021114449
38;303;30062021114449
39;264;30062021114449
40;237;30062021114449
41;216;30062021114449
42;207;30062021114449
43;198;30062021114449
44;195;30062021114449
45;195;30062021114449
46;190;30062021114449
47;191;30062021114449
48;193;30062021114449
49;189;30062021114449
50;190;30062021114449
51;188;30062021114449
52;187;30062021114449
53;190;30062021114449
54;188;30062021114449
55;189;30062021114449
56;191;30062021114449
57;190;30062021114449
58;196;30062021114449
59;196;30062021114449
60;199;30062021114449
61;201;30062021114449
62;202;30062021114449
63;204;30062021114449
64;207;30062021114449
65;203;30062021114449
66;207;30062021114449
67;204;30062021114449
68;201;30062021114449
69;203;30062021114449
70;197;30062021114449
71;196;30062021114449
72;198;30062021114449
73;193;30062021114449
74;192;30062021114449
75;187;30062021114449
76;186;30062021114449
77;184;30062021114449
78;180;30062021114449
79;180;30062021114449
80;179;30062021114449
81;173;30062021114449
82;174;30062021114449
83;169;30062021114449
84;169;30062021114449
85;168;30062021114449
86;167;30062021114449
87;167;30062021114449
88;167;30062021114449
89;163;30062021114449
90;164;30062021114449
91;161;30062021114449
92;160;30062021114449
93;161;30062021114449
94;157;30062021114449
95;158;30062021114449
96;157;30062021114449
97;155;30062021114449
98;154;30062021114449
99;153;30062021114449
100;151;30062021114449
101;152;30062021114449
102;149;30062021114449
103;149;30062021114449
104;150;30062021114449
105;146;30062021114449
106;149;30062021114449
107;146;30062021114449
108;144;30062021114449
109;146;30062021114449
110;144;30062021114449
111;144;30062021114449
112;145;30062021114449
113;141;30062021114449
114;142;30062021114449
115;143;30062021114449
116;141;30062021114449
117;143;30062021114449
118;140;30062021114449
119;141;30062021114449
120;139;30062021114449
121;137;30062021114449
122;139;30062021114449
123;138;30062021114449
124;137;30062021114449
125;139;30062021114449
126;137;30062021114449
127;137;30062021114449
128;137;30062021114449
129;136;30062021114449
130;135;30062021114449
131;136;30062021114449
132;134;30062021114449
133;138;30062021114449
134;134;30062021114449
135;135;30062021114449
136;135;30062021114449
137;134;30062021114449
138;135;30062021114449
139;134;30062021114449
140;132;30062021114449
141;134;30062021114449
142;134;30062021114449
143;132;30062021114449
144;134;30062021114449
145;131;30062021114449
146;135;30062021114449
147;133;30062021114449
148;131;30062021114449
149;132;30062021114449
150;132;30062021114449
151;132;30062021114449
152;132;30062021114449
153;131;30062021114449
154;133;30062021114449
155;131;30062021114449
156;131;30062021114449
157;131;30062021114449
158;130;30062021114449
159;131;30062021114449
160;133;30062021114449
161;131;30062021114449
162;132;30062021114449
163;132;30062021114449
164;130;30062021114449
165;132;30062021114449
166;131;30062021114449
167;132;30062021114449
168;132;30062021114449
169;129;30062021114449
170;131;30062021114449
171;131;30062021114449
172;130;30062021114449
173;133;30062021114449
174;131;30062021114449
175;130;30062021114449
176;131;30062021114449
177;129;30062021114449
178;132;30062021114449
179;129;30062021114449
180;130;30062021114449
181;131;30062021114449
182;131;30062021114449
183;130;30062021114449
184;130;30062021114449
185;129;30062021114449
186;131;30062021114449
187;130;30062021114449
188;128;30062021114449
189;129;30062021114449
190;130;30062021114449
191;130;30062021114449
192;133;30062021114449
193;129;30062021114449
194;129;30062021114449
195;131;30062021114449
196;129;30062021114449
197;131;30062021114449
198;130;30062021114449
199;129;30062021114449
200;0;30062021114449
0;0;30062021114450
1;152;30062021114450
2;135;30062021114450
3;132;30062021114450
4;134;30062021114450
5;135;30062021114450
6;132;30062021114450
7;135;30062021114450
8;135;30062021114450
9;134;30062021114450
10;138;30062021114450
11;136;30062021114450
12;137;30062021114450
13;141;30062021114450
14;141;30062021114450
15;146;30062021114450
16;152;30062021114450
17;161;30062021114450
18;184;30062021114450
19;226;30062021114450
20;324;30062021114450
21;564;30062021114450
22;1023;30062021114450
23;1023;30062021114450
24;1023;30062021114450
25;1023;30062021114450
26;1023;30062021114450
27;1023;30062021114450
28;1023;30062021114450
29;1023;30062021114450
30;1023;30062021114450
31;1023;30062021114450
32;1023;30062021114450
33;1023;30062021114450
34;793;30062021114450
35;602;30062021114450
36;459;30062021114450
37;366;30062021114450
38;302;30062021114450
39;264;30062021114450
40;235;30062021114450
41;215;30062021114450
42;208;30062021114450
43;202;30062021114450
44;194;30062021114450
45;195;30062021114450
46;192;30062021114450
47;192;30062021114450
48;190;30062021114450
49;187;30062021114450
50;190;30062021114450
51;188;30062021114450
52;186;30062021114450
53;188;30062021114450
54;187;30062021114450
55;189;30062021114450
56;192;30062021114450
57;191;30062021114450
58;198;30062021114450
59;198;30062021114450
60;198;30062021114450
61;200;30062021114450
62;200;30062021114450
63;204;30062021114450
64;207;30062021114450
65;201;30062021114450
66;205;30062021114450
67;205;30062021114450
68;202;30062021114450
69;202;30062021114450
70;198;30062021114450
71;197;30062021114450
72;196;30062021114450
73;190;30062021114450
74;190;30062021114450
75;186;30062021114450
76;185;30062021114450
77;182;30062021114450
78;181;30062021114450
79;180;30062021114450
80;179;30062021114450
81;173;30062021114450
82;174;30062021114450
83;170;30062021114450
84;170;30062021114450
85;169;30062021114450
86;166;30062021114450
87;165;30062021114450
88;166;30062021114450
89;161;30062021114450
90;164;30062021114450
91;163;30062021114450
92;160;30062021114450
93;161;30062021114450
94;157;30062021114450
95;154;30062021114450
96;157;30062021114450
97;153;30062021114450
98;152;30062021114450
99;150;30062021114450
100;150;30062021114450
101;151;30062021114450
102;148;30062021114450
103;147;30062021114450
104;148;30062021114450
105;147;30062021114450
106;148;30062021114450
107;144;30062021114450
108;143;30062021114450
109;145;30062021114450
110;142;30062021114450
111;142;30062021114450
112;144;30062021114450
113;140;30062021114450
114;142;30062021114450
115;141;30062021114450
116;140;30062021114450
117;142;30062021114450
118;138;30062021114450
119;141;30062021114450
120;139;30062021114450
121;137;30062021114450
122;139;30062021114450
123;138;30062021114450
124;136;30062021114450
125;137;30062021114450
126;135;30062021114450
127;136;30062021114450
128;138;30062021114450
129;136;30062021114450
130;136;30062021114450
131;135;30062021114450
132;133;30062021114450
133;137;30062021114450
134;133;30062021114450
135;133;30062021114450
136;135;30062021114450
137;132;30062021114450
138;134;30062021114450
139;133;30062021114450
140;132;30062021114450
141;135;30062021114450
142;132;30062021114450
143;132;30062021114450
144;133;30062021114450
145;129;30062021114450
146;133;30062021114450
147;132;30062021114450
148;131;30062021114450
149;131;30062021114450
150;131;30062021114450
151;132;30062021114450
152;132;30062021114450
153;130;30062021114450
154;132;30062021114450
155;130;30062021114450
156;130;30062021114450
157;130;30062021114450
158;130;30062021114450
159;130;30062021114450
160;131;30062021114450
161;130;30062021114450
162;132;30062021114450
163;130;30062021114450
164;129;30062021114450
165;132;30062021114450
166;130;30062021114450
167;130;30062021114450
168;131;30062021114450
169;127;30062021114450
170;131;30062021114450
171;130;30062021114450
172;129;30062021114450
173;131;30062021114450
174;129;30062021114450
175;128;30062021114450
176;131;30062021114450
177;128;30062021114450
178;131;30062021114450
179;130;30062021114450
180;129;30062021114450
181;130;30062021114450
182;130;30062021114450
183;129;30062021114450
184;130;30062021114450
185;127;30062021114450
186;131;30062021114450
187;130;30062021114450
188;127;30062021114450
189;130;30062021114450
190;129;30062021114450
191;129;30062021114450
192;132;30062021114450
193;129;30062021114450
194;129;30062021114450
195;129;30062021114450
196;127;30062021114450
197;130;30062021114450
198;130;30062021114450
199;128;30062021114450
200;0;30062021114450
0;0;30062021114450
1;152;30062021114450
2;134;30062021114450
3;132;30062021114450
4;133;30062021114450
5;134;30062021114450
6;133;30062021114450
7;135;30062021114450
8;136;30062021114450
9;134;30062021114450
10;138;30062021114450
11;136;30062021114450
12;136;30062021114450
13;141;30062021114450
14;141;30062021114450
15;146;30062021114450
16;151;30062021114450
17;160;30062021114450
18;182;30062021114450
19;226;30062021114450
20;323;30062021114450
21;562;30062021114450
22;1023;30062021114450
23;1023;30062021114450
24;1023;30062021114450
25;1023;30062021114450
26;1023;30062021114450
27;1023;30062021114450
28;1023;30062021114450
29;1023;30062021114450
30;1023;30062021114450
31;1023;30062021114450
32;1023;30062021114450
33;1023;30062021114450
34;799;30062021114450
35;611;30062021114450
36;461;30062021114450
37;367;30062021114450
38;304;30062021114450
39;264;30062021114450
40;237;30062021114450
41;215;30062021114450
42;206;30062021114450
43;199;30062021114450
44;195;30062021114450
45;194;30062021114450
46;191;30062021114450
47;189;30062021114450
48;192;30062021114450
49;188;30062021114450
50;191;30062021114450
51;186;30062021114450
52;186;30062021114450
53;191;30062021114450
54;187;30062021114450
55;189;30062021114450
56;190;30062021114450
57;191;30062021114450
58;196;30062021114450
59;196;30062021114450
60;198;30062021114450
61;200;30062021114450
62;200;30062021114450
63;203;30062021114450
64;203;30062021114450
65;201;30062021114450
66;205;30062021114450
67;205;30062021114450
68;200;30062021114450
69;201;30062021114450
70;200;30062021114450
71;196;30062021114450
72;195;30062021114450
73;191;30062021114450
74;192;30062021114450
75;187;30062021114450
76;185;30062021114450
77;183;30062021114450
78;180;30062021114450
79;179;30062021114450
80;178;30062021114450
81;173;30062021114450
82;174;30062021114450
83;170;30062021114450
84;168;30062021114450
85;168;30062021114450
86;166;30062021114450
87;167;30062021114450
88;167;30062021114450
89;162;30062021114450
90;164;30062021114450
91;160;30062021114450
92;158;30062021114450
93;160;30062021114450
94;158;30062021114450
95;156;30062021114450
96;158;30062021114450
97;154;30062021114450
98;152;30062021114450
99;151;30062021114450
100;150;30062021114450
101;152;30062021114450
102;149;30062021114450
103;147;30062021114450
104;148;30062021114450
105;145;30062021114450
106;147;30062021114450
107;145;30062021114450
108;144;30062021114450
109;146;30062021114450
110;141;30062021114450
111;143;30062021114450
112;144;30062021114450
113;140;30062021114450
114;141;30062021114450
115;141;30062021114450
116;140;30062021114450
117;142;30062021114450
118;140;30062021114450
119;139;30062021114450
120;138;30062021114450
121;137;30062021114450
122;138;30062021114450
123;138;30062021114450
124;136;30062021114450
125;138;30062021114450
126;135;30062021114450
127;135;30062021114450
128;137;30062021114450
129;136;30062021114450
130;135;30062021114450
131;136;30062021114450
132;133;30062021114450
133;138;30062021114450
134;133;30062021114450
135;132;30062021114450
136;135;30062021114450
137;131;30062021114450
138;135;30062021114450
139;133;30062021114450
140;130;30062021114450
141;133;30062021114450
142;132;30062021114450
143;132;30062021114450
144;134;30062021114450
145;130;30062021114450
146;133;30062021114450
147;132;30062021114450
148;131;30062021114450
149;130;30062021114450
150;131;30062021114450
151;131;30062021114450
152;131;30062021114450
153;130;30062021114450
154;134;30062021114450
155;130;30062021114450
156;129;30062021114450
157;129;30062021114450
158;130;30062021114450
159;129;30062021114450
160;130;30062021114450
161;129;30062021114450
162;131;30062021114450
163;130;30062021114450
164;130;30062021114450
165;131;30062021114450
166;129;30062021114450
167;129;30062021114450
168;131;30062021114450
169;129;30062021114450
170;130;30062021114450
171;129;30062021114450
172;130;30062021114450
173;130;30062021114450
174;128;30062021114450
175;128;30062021114450
176;129;30062021114450
177;128;30062021114450
178;131;30062021114450
179;130;30062021114450
180;128;30062021114450
181;131;30062021114450
182;130;30062021114450
183;128;30062021114450
184;130;30062021114450
185;126;30062021114450
186;130;30062021114450
187;129;30062021114450
188;128;30062021114450
189;130;30062021114450
190;128;30062021114450
191;128;30062021114450
192;132;30062021114450
193;128;30062021114450
194;129;30062021114450
195;129;30062021114450
196;128;30062021114450
197;129;30062021114450
198;130;30062021114450
199;128;30062021114450
200;0;30062021114450
0;0;30062021114451
1;152;30062021114451
2;133;30062021114451
3;132;30062021114451
4;133;30062021114451
5;135;30062021114451
6;133;30062021114451
7;135;30062021114451
8;137;30062021114451
9;134;30062021114451
10;138;30062021114451
11;135;30062021114451
12;136;30062021114451
13;141;30062021114451
14;142;30062021114451
15;146;30062021114451
16;150;30062021114451
17;160;30062021114451
18;185;30062021114451
19;225;30062021114451
20;320;30062021114451
21;563;30062021114451
22;1023;30062021114451
23;1023;30062021114451
24;1023;30062021114451
25;1023;30062021114451
26;1023;30062021114451
27;1023;30062021114451
28;1023;30062021114451
29;1023;30062021114451
30;1023;30062021114451
31;1023;30062021114451
32;1023;30062021114451
33;1023;30062021114451
34;796;30062021114451
35;602;30062021114451
36;460;30062021114451
37;367;30062021114451
38;306;30062021114451
39;263;30062021114451
40;239;30062021114451
41;216;30062021114451
42;209;30062021114451
43;200;30062021114451
44;196;30062021114451
45;196;30062021114451
46;191;30062021114451
47;191;30062021114451
48;192;30062021114451
49;188;30062021114451
50;190;30062021114451
51;188;30062021114451
52;186;30062021114451
53;189;30062021114451
54;186;30062021114451
55;189;30062021114451
56;191;30062021114451
57;192;30062021114451
58;196;30062021114451
59;195;30062021114451
60;195;30062021114451
61;199;30062021114451
62;202;30062021114451
63;203;30062021114451
64;203;30062021114451
65;201;30062021114451
66;205;30062021114451
67;205;30062021114451
68;200;30062021114451
69;201;30062021114451
70;198;30062021114451
71;196;30062021114451
72;197;30062021114451
73;190;30062021114451
74;192;30062021114451
75;186;30062021114451
76;185;30062021114451
77;184;30062021114451
78;180;30062021114451
79;179;30062021114451
80;176;30062021114451
81;172;30062021114451
82;174;30062021114451
83;169;30062021114451
84;169;30062021114451
85;169;30062021114451
86;165;30062021114451
87;166;30062021114451
88;164;30062021114451
89;162;30062021114451
90;163;30062021114451
91;162;30062021114451
92;158;30062021114451
93;160;30062021114451
94;159;30062021114451
95;155;30062021114451
96;157;30062021114451
97;154;30062021114451
98;152;30062021114451
99;152;30062021114451
100;149;30062021114451
101;151;30062021114451
102;148;30062021114451
103;148;30062021114451
104;148;30062021114451
105;145;30062021114451
106;149;30062021114451
107;145;30062021114451
108;145;30062021114451
109;145;30062021114451
110;141;30062021114451
111;143;30062021114451
112;144;30062021114451
113;141;30062021114451
114;140;30062021114451
115;142;30062021114451
116;140;30062021114451
117;142;30062021114451
118;139;30062021114451
119;139;30062021114451
120;138;30062021114451
121;138;30062021114451
122;138;30062021114451
123;137;30062021114451
124;136;30062021114451
125;137;30062021114451
126;134;30062021114451
127;135;30062021114451
128;137;30062021114451
129;134;30062021114451
130;134;30062021114451
131;136;30062021114451
132;134;30062021114451
133;138;30062021114451
134;133;30062021114451
135;134;30062021114451
136;135;30062021114451
137;132;30062021114451
138;134;30062021114451
139;132;30062021114451
140;131;30062021114451
141;134;30062021114451
142;132;30062021114451
143;130;30062021114451
144;132;30062021114451
145;130;30062021114451
146;133;30062021114451
147;132;30062021114451
148;130;30062021114451
149;131;30062021114451
150;131;30062021114451
151;130;30062021114451
152;130;30062021114451
153;130;30062021114451
154;132;30062021114451
155;130;30062021114451
156;130;30062021114451
157;130;30062021114451
158;129;30062021114451
159;130;30062021114451
160;130;30062021114451
161;129;30062021114451
162;131;30062021114451
163;131;30062021114451
164;129;30062021114451
165;132;30062021114451
166;130;30062021114451
167;129;30062021114451
168;131;30062021114451
169;129;30062021114451
170;131;30062021114451
171;130;30062021114451
172;129;30062021114451
173;130;30062021114451
174;128;30062021114451
175;128;30062021114451
176;130;30062021114451
177;128;30062021114451
178;131;30062021114451
179;129;30062021114451
180;129;30062021114451
181;130;30062021114451
182;130;30062021114451
183;129;30062021114451
184;130;30062021114451
185;127;30062021114451
186;130;30062021114451
187;129;30062021114451
188;127;30062021114451
189;129;30062021114451
190;128;30062021114451
191;128;30062021114451
192;131;30062021114451
193;128;30062021114451
194;128;30062021114451
195;129;30062021114451
196;128;30062021114451
197;130;30062021114451
198;130;30062021114451
199;127;30062021114451
200;0;30062021114451
