ind;val;datetime
0;0;04062021125931
1;173;04062021125931
2;173;04062021125931
3;169;04062021125931
4;170;04062021125931
5;170;04062021125931
6;169;04062021125931
7;170;04062021125931
8;170;04062021125931
9;166;04062021125931
10;170;04062021125931
11;168;04062021125931
12;169;04062021125931
13;175;04062021125931
14;170;04062021125931
15;174;04062021125931
16;175;04062021125931
17;178;04062021125931
18;195;04062021125931
19;219;04062021125931
20;281;04062021125931
21;454;04062021125931
22;891;04062021125931
23;1023;04062021125931
24;1023;04062021125931
25;1023;04062021125931
26;1023;04062021125931
27;1023;04062021125931
28;1023;04062021125931
29;1023;04062021125931
30;1023;04062021125931
31;1023;04062021125931
32;763;04062021125931
33;611;04062021125931
34;513;04062021125931
35;451;04062021125931
36;416;04062021125931
37;405;04062021125931
38;400;04062021125931
39;403;04062021125931
40;413;04062021125931
41;419;04062021125931
42;431;04062021125931
43;433;04062021125931
44;441;04062021125931
45;447;04062021125931
46;448;04062021125931
47;449;04062021125931
48;458;04062021125931
49;455;04062021125931
50;465;04062021125931
51;464;04062021125931
52;468;04062021125931
53;479;04062021125931
54;485;04062021125931
55;487;04062021125931
56;499;04062021125931
57;508;04062021125931
58;520;04062021125931
59;522;04062021125931
60;532;04062021125931
61;545;04062021125931
62;543;04062021125931
63;553;04062021125931
64;553;04062021125931
65;550;04062021125931
66;547;04062021125931
67;534;04062021125931
68;524;04062021125931
69;523;04062021125931
70;510;04062021125931
71;502;04062021125931
72;497;04062021125931
73;481;04062021125931
74;479;04062021125931
75;457;04062021125931
76;441;04062021125931
77;423;04062021125931
78;407;04062021125931
79;393;04062021125931
80;381;04062021125931
81;366;04062021125931
82;359;04062021125931
83;347;04062021125931
84;342;04062021125931
85;336;04062021125931
86;330;04062021125931
87;323;04062021125931
88;320;04062021125931
89;305;04062021125931
90;305;04062021125931
91;291;04062021125931
92;281;04062021125931
93;278;04062021125931
94;271;04062021125931
95;263;04062021125931
96;260;04062021125931
97;255;04062021125931
98;247;04062021125931
99;245;04062021125931
100;235;04062021125931
101;239;04062021125931
102;231;04062021125931
103;227;04062021125931
104;222;04062021125931
105;218;04062021125931
106;219;04062021125931
107;214;04062021125931
108;210;04062021125931
109;209;04062021125931
110;203;04062021125931
111;201;04062021125931
112;202;04062021125931
113;195;04062021125931
114;195;04062021125931
115;196;04062021125931
116;192;04062021125931
117;194;04062021125931
118;188;04062021125931
119;189;04062021125931
120;186;04062021125931
121;180;04062021125931
122;183;04062021125931
123;180;04062021125931
124;179;04062021125931
125;180;04062021125931
126;176;04062021125931
127;176;04062021125931
128;178;04062021125931
129;172;04062021125931
130;175;04062021125931
131;172;04062021125931
132;169;04062021125931
133;173;04062021125931
134;167;04062021125931
135;166;04062021125931
136;167;04062021125931
137;165;04062021125931
138;166;04062021125931
139;164;04062021125931
140;161;04062021125931
141;164;04062021125931
142;161;04062021125931
143;159;04062021125931
144;163;04062021125931
145;158;04062021125931
146;161;04062021125931
147;160;04062021125931
148;158;04062021125931
149;159;04062021125931
150;158;04062021125931
151;157;04062021125931
152;157;04062021125931
153;154;04062021125931
154;156;04062021125931
155;156;04062021125931
156;154;04062021125931
157;155;04062021125931
158;153;04062021125931
159;153;04062021125931
160;153;04062021125931
161;153;04062021125931
162;154;04062021125931
163;153;04062021125931
164;153;04062021125931
165;155;04062021125931
166;153;04062021125931
167;152;04062021125931
168;155;04062021125931
169;149;04062021125931
170;153;04062021125931
171;151;04062021125931
172;150;04062021125931
173;153;04062021125931
174;151;04062021125931
175;151;04062021125931
176;152;04062021125931
177;150;04062021125931
178;153;04062021125931
179;152;04062021125931
180;149;04062021125931
181;152;04062021125931
182;153;04062021125931
183;150;04062021125931
184;151;04062021125931
185;148;04062021125931
186;152;04062021125931
187;151;04062021125931
188;149;04062021125931
189;152;04062021125931
190;149;04062021125931
191;150;04062021125931
192;154;04062021125931
193;149;04062021125931
194;154;04062021125931
195;150;04062021125931
196;149;04062021125931
197;150;04062021125931
198;150;04062021125931
199;149;04062021125931
200;0;04062021125931
0;0;04062021125932
1;171;04062021125932
2;176;04062021125932
3;170;04062021125932
4;174;04062021125932
5;172;04062021125932
6;170;04062021125932
7;173;04062021125932
8;174;04062021125932
9;170;04062021125932
10;174;04062021125932
11;171;04062021125932
12;171;04062021125932
13;177;04062021125932
14;174;04062021125932
15;178;04062021125932
16;180;04062021125932
17;185;04062021125932
18;201;04062021125932
19;230;04062021125932
20;305;04062021125932
21;505;04062021125932
22;1007;04062021125932
23;1023;04062021125932
24;1023;04062021125932
25;1023;04062021125932
26;1023;04062021125932
27;1023;04062021125932
28;1023;04062021125932
29;1023;04062021125932
30;1023;04062021125932
31;1023;04062021125932
32;882;04062021125932
33;703;04062021125932
34;584;04062021125932
35;512;04062021125932
36;465;04062021125932
37;456;04062021125932
38;451;04062021125932
39;449;04062021125932
40;460;04062021125932
41;465;04062021125932
42;484;04062021125932
43;487;04062021125932
44;495;04062021125932
45;504;04062021125932
46;502;04062021125932
47;508;04062021125932
48;513;04062021125932
49;512;04062021125932
50;519;04062021125932
51;524;04062021125932
52;532;04062021125932
53;541;04062021125932
54;546;04062021125932
55;557;04062021125932
56;565;04062021125932
57;572;04062021125932
58;587;04062021125932
59;594;04062021125932
60;608;04062021125932
61;619;04062021125932
62;619;04062021125932
63;626;04062021125932
64;629;04062021125932
65;617;04062021125932
66;618;04062021125932
67;610;04062021125932
68;600;04062021125932
69;583;04062021125932
70;572;04062021125932
71;571;04062021125932
72;556;04062021125932
73;544;04062021125932
74;533;04062021125932
75;512;04062021125932
76;492;04062021125932
77;472;04062021125932
78;454;04062021125932
79;439;04062021125932
80;422;04062021125932
81;400;04062021125932
82;400;04062021125932
83;385;04062021125932
84;378;04062021125932
85;371;04062021125932
86;361;04062021125932
87;353;04062021125932
88;346;04062021125932
89;335;04062021125932
90;329;04062021125932
91;319;04062021125932
92;307;04062021125932
93;304;04062021125932
94;292;04062021125932
95;285;04062021125932
96;283;04062021125932
97;272;04062021125932
98;266;04062021125932
99;262;04062021125932
100;255;04062021125932
101;253;04062021125932
102;244;04062021125932
103;241;04062021125932
104;237;04062021125932
105;231;04062021125932
106;232;04062021125932
107;224;04062021125932
108;224;04062021125932
109;220;04062021125932
110;216;04062021125932
111;211;04062021125932
112;212;04062021125932
113;204;04062021125932
114;204;04062021125932
115;203;04062021125932
116;199;04062021125932
117;202;04062021125932
118;195;04062021125932
119;196;04062021125932
120;191;04062021125932
121;189;04062021125932
122;188;04062021125932
123;187;04062021125932
124;184;04062021125932
125;184;04062021125932
126;179;04062021125932
127;179;04062021125932
128;182;04062021125932
129;176;04062021125932
130;176;04062021125932
131;175;04062021125932
132;171;04062021125932
133;176;04062021125932
134;170;04062021125932
135;169;04062021125932
136;170;04062021125932
137;166;04062021125932
138;169;04062021125932
139;168;04062021125932
140;164;04062021125932
141;166;04062021125932
142;163;04062021125932
143;162;04062021125932
144;165;04062021125932
145;160;04062021125932
146;162;04062021125932
147;160;04062021125932
148;158;04062021125932
149;159;04062021125932
150;159;04062021125932
151;159;04062021125932
152;157;04062021125932
153;155;04062021125932
154;156;04062021125932
155;156;04062021125932
156;153;04062021125932
157;155;04062021125932
158;153;04062021125932
159;153;04062021125932
160;154;04062021125932
161;153;04062021125932
162;154;04062021125932
163;154;04062021125932
164;153;04062021125932
165;155;04062021125932
166;152;04062021125932
167;154;04062021125932
168;155;04062021125932
169;149;04062021125932
170;154;04062021125932
171;151;04062021125932
172;150;04062021125932
173;153;04062021125932
174;150;04062021125932
175;149;04062021125932
176;152;04062021125932
177;150;04062021125932
178;153;04062021125932
179;151;04062021125932
180;150;04062021125932
181;151;04062021125932
182;153;04062021125932
183;149;04062021125932
184;151;04062021125932
185;147;04062021125932
186;151;04062021125932
187;150;04062021125932
188;148;04062021125932
189;151;04062021125932
190;148;04062021125932
191;150;04062021125932
192;153;04062021125932
193;148;04062021125932
194;151;04062021125932
195;149;04062021125932
196;148;04062021125932
197;149;04062021125932
198;150;04062021125932
199;149;04062021125932
200;0;04062021125932
0;0;04062021125934
1;172;04062021125934
2;176;04062021125934
3;170;04062021125934
4;174;04062021125934
5;173;04062021125934
6;170;04062021125934
7;174;04062021125934
8;174;04062021125934
9;170;04062021125934
10;175;04062021125934
11;173;04062021125934
12;170;04062021125934
13;177;04062021125934
14;176;04062021125934
15;179;04062021125934
16;179;04062021125934
17;185;04062021125934
18;201;04062021125934
19;232;04062021125934
20;305;04062021125934
21;498;04062021125934
22;998;04062021125934
23;1023;04062021125934
24;1023;04062021125934
25;1023;04062021125934
26;1023;04062021125934
27;1023;04062021125934
28;1023;04062021125934
29;1023;04062021125934
30;1023;04062021125934
31;1023;04062021125934
32;871;04062021125934
33;693;04062021125934
34;579;04062021125934
35;502;04062021125934
36;463;04062021125934
37;449;04062021125934
38;449;04062021125934
39;450;04062021125934
40;456;04062021125934
41;463;04062021125934
42;479;04062021125934
43;480;04062021125934
44;491;04062021125934
45;496;04062021125934
46;499;04062021125934
47;504;04062021125934
48;507;04062021125934
49;509;04062021125934
50;518;04062021125934
51;523;04062021125934
52;521;04062021125934
53;535;04062021125934
54;542;04062021125934
55;547;04062021125934
56;555;04062021125934
57;573;04062021125934
58;575;04062021125934
59;587;04062021125934
60;600;04062021125934
61;613;04062021125934
62;612;04062021125934
63;617;04062021125934
64;620;04062021125934
65;610;04062021125934
66;609;04062021125934
67;605;04062021125934
68;589;04062021125934
69;582;04062021125934
70;571;04062021125934
71;560;04062021125934
72;559;04062021125934
73;541;04062021125934
74;530;04062021125934
75;505;04062021125934
76;487;04062021125934
77;470;04062021125934
78;452;04062021125934
79;437;04062021125934
80;419;04062021125934
81;401;04062021125934
82;397;04062021125934
83;383;04062021125934
84;378;04062021125934
85;366;04062021125934
86;361;04062021125934
87;354;04062021125934
88;346;04062021125934
89;330;04062021125934
90;327;04062021125934
91;314;04062021125934
92;302;04062021125934
93;302;04062021125934
94;294;04062021125934
95;284;04062021125934
96;281;04062021125934
97;272;04062021125934
98;266;04062021125934
99;259;04062021125934
100;255;04062021125934
101;253;04062021125934
102;247;04062021125934
103;238;04062021125934
104;237;04062021125934
105;229;04062021125934
106;230;04062021125934
107;223;04062021125934
108;221;04062021125934
109;221;04062021125934
110;213;04062021125934
111;211;04062021125934
112;212;04062021125934
113;205;04062021125934
114;203;04062021125934
115;204;04062021125934
116;201;04062021125934
117;202;04062021125934
118;195;04062021125934
119;195;04062021125934
120;192;04062021125934
121;188;04062021125934
122;187;04062021125934
123;186;04062021125934
124;183;04062021125934
125;185;04062021125934
126;181;04062021125934
127;180;04062021125934
128;181;04062021125934
129;178;04062021125934
130;177;04062021125934
131;176;04062021125934
132;172;04062021125934
133;179;04062021125934
134;171;04062021125934
135;170;04062021125934
136;172;04062021125934
137;166;04062021125934
138;168;04062021125934
139;165;04062021125934
140;163;04062021125934
141;167;04062021125934
142;164;04062021125934
143;161;04062021125934
144;165;04062021125934
145;159;04062021125934
146;163;04062021125934
147;161;04062021125934
148;158;04062021125934
149;159;04062021125934
150;159;04062021125934
151;158;04062021125934
152;157;04062021125934
153;155;04062021125934
154;158;04062021125934
155;157;04062021125934
156;156;04062021125934
157;156;04062021125934
158;153;04062021125934
159;154;04062021125934
160;155;04062021125934
161;152;04062021125934
162;155;04062021125934
163;155;04062021125934
164;154;04062021125934
165;155;04062021125934
166;152;04062021125934
167;153;04062021125934
168;155;04062021125934
169;149;04062021125934
170;154;04062021125934
171;152;04062021125934
172;151;04062021125934
173;154;04062021125934
174;152;04062021125934
175;150;04062021125934
176;152;04062021125934
177;150;04062021125934
178;153;04062021125934
179;151;04062021125934
180;150;04062021125934
181;152;04062021125934
182;151;04062021125934
183;150;04062021125934
184;150;04062021125934
185;148;04062021125934
186;152;04062021125934
187;150;04062021125934
188;148;04062021125934
189;151;04062021125934
190;149;04062021125934
191;151;04062021125934
192;154;04062021125934
193;149;04062021125934
194;152;04062021125934
195;150;04062021125934
196;149;04062021125934
197;151;04062021125934
198;150;04062021125934
199;148;04062021125934
200;0;04062021125934
0;0;04062021125935
1;171;04062021125935
2;174;04062021125935
3;172;04062021125935
4;173;04062021125935
5;173;04062021125935
6;171;04062021125935
7;174;04062021125935
8;174;04062021125935
9;171;04062021125935
10;173;04062021125935
11;170;04062021125935
12;171;04062021125935
13;176;04062021125935
14;174;04062021125935
15;177;04062021125935
16;178;04062021125935
17;183;04062021125935
18;204;04062021125935
19;231;04062021125935
20;300;04062021125935
21;502;04062021125935
22;996;04062021125935
23;1023;04062021125935
24;1023;04062021125935
25;1023;04062021125935
26;1023;04062021125935
27;1023;04062021125935
28;1023;04062021125935
29;1023;04062021125935
30;1023;04062021125935
31;1023;04062021125935
32;873;04062021125935
33;694;04062021125935
34;576;04062021125935
35;506;04062021125935
36;460;04062021125935
37;448;04062021125935
38;450;04062021125935
39;449;04062021125935
40;455;04062021125935
41;464;04062021125935
42;476;04062021125935
43;480;04062021125935
44;490;04062021125935
45;497;04062021125935
46;500;04062021125935
47;501;04062021125935
48;509;04062021125935
49;506;04062021125935
50;517;04062021125935
51;522;04062021125935
52;524;04062021125935
53;537;04062021125935
54;541;04062021125935
55;549;04062021125935
56;555;04062021125935
57;570;04062021125935
58;579;04062021125935
59;590;04062021125935
60;603;04062021125935
61;610;04062021125935
62;618;04062021125935
63;616;04062021125935
64;622;04062021125935
65;616;04062021125935
66;613;04062021125935
67;599;04062021125935
68;595;04062021125935
69;579;04062021125935
70;567;04062021125935
71;561;04062021125935
72;558;04062021125935
73;543;04062021125935
74;530;04062021125935
75;505;04062021125935
76;488;04062021125935
77;470;04062021125935
78;451;04062021125935
79;434;04062021125935
80;415;04062021125935
81;402;04062021125935
82;396;04062021125935
83;386;04062021125935
84;374;04062021125935
85;365;04062021125935
86;359;04062021125935
87;356;04062021125935
88;346;04062021125935
89;331;04062021125935
90;328;04062021125935
91;316;04062021125935
92;303;04062021125935
93;299;04062021125935
94;293;04062021125935
95;283;04062021125935
96;278;04062021125935
97;272;04062021125935
98;263;04062021125935
99;258;04062021125935
100;254;04062021125935
101;255;04062021125935
102;246;04062021125935
103;237;04062021125935
104;237;04062021125935
105;228;04062021125935
106;232;04062021125935
107;223;04062021125935
108;221;04062021125935
109;218;04062021125935
110;212;04062021125935
111;211;04062021125935
112;208;04062021125935
113;205;04062021125935
114;203;04062021125935
115;203;04062021125935
116;198;04062021125935
117;201;04062021125935
118;194;04062021125935
119;194;04062021125935
120;192;04062021125935
121;186;04062021125935
122;189;04062021125935
123;186;04062021125935
124;183;04062021125935
125;183;04062021125935
126;180;04062021125935
127;180;04062021125935
128;182;04062021125935
129;177;04062021125935
130;176;04062021125935
131;175;04062021125935
132;170;04062021125935
133;176;04062021125935
134;170;04062021125935
135;169;04062021125935
136;170;04062021125935
137;166;04062021125935
138;168;04062021125935
139;166;04062021125935
140;163;04062021125935
141;167;04062021125935
142;163;04062021125935
143;161;04062021125935
144;164;04062021125935
145;159;04062021125935
146;162;04062021125935
147;161;04062021125935
148;158;04062021125935
149;160;04062021125935
150;160;04062021125935
151;159;04062021125935
152;158;04062021125935
153;156;04062021125935
154;158;04062021125935
155;157;04062021125935
156;155;04062021125935
157;155;04062021125935
158;154;04062021125935
159;154;04062021125935
160;154;04062021125935
161;152;04062021125935
162;155;04062021125935
163;153;04062021125935
164;153;04062021125935
165;155;04062021125935
166;153;04062021125935
167;154;04062021125935
168;156;04062021125935
169;149;04062021125935
170;153;04062021125935
171;151;04062021125935
172;149;04062021125935
173;154;04062021125935
174;150;04062021125935
175;149;04062021125935
176;152;04062021125935
177;148;04062021125935
178;153;04062021125935
179;150;04062021125935
180;150;04062021125935
181;153;04062021125935
182;151;04062021125935
183;149;04062021125935
184;151;04062021125935
185;146;04062021125935
186;151;04062021125935
187;149;04062021125935
188;147;04062021125935
189;151;04062021125935
190;149;04062021125935
191;149;04062021125935
192;153;04062021125935
193;148;04062021125935
194;152;04062021125935
195;150;04062021125935
196;149;04062021125935
197;149;04062021125935
198;149;04062021125935
199;149;04062021125935
200;0;04062021125935
0;0;04062021125936
1;172;04062021125936
2;177;04062021125936
3;171;04062021125936
4;172;04062021125936
5;173;04062021125936
6;171;04062021125936
7;173;04062021125936
8;175;04062021125936
9;171;04062021125936
10;174;04062021125936
11;171;04062021125936
12;170;04062021125936
13;176;04062021125936
14;175;04062021125936
15;179;04062021125936
16;178;04062021125936
17;184;04062021125936
18;201;04062021125936
19;231;04062021125936
20;300;04062021125936
21;497;04062021125936
22;998;04062021125936
23;1023;04062021125936
24;1023;04062021125936
25;1023;04062021125936
26;1023;04062021125936
27;1023;04062021125936
28;1023;04062021125936
29;1023;04062021125936
30;1023;04062021125936
31;1023;04062021125936
32;876;04062021125936
33;692;04062021125936
34;575;04062021125936
35;510;04062021125936
36;461;04062021125936
37;450;04062021125936
38;447;04062021125936
39;453;04062021125936
40;457;04062021125936
41;463;04062021125936
42;482;04062021125936
43;480;04062021125936
44;490;04062021125936
45;498;04062021125936
46;497;04062021125936
47;502;04062021125936
48;508;04062021125936
49;503;04062021125936
50;515;04062021125936
51;518;04062021125936
52;524;04062021125936
53;536;04062021125936
54;544;04062021125936
55;546;04062021125936
56;558;04062021125936
57;567;04062021125936
58;579;04062021125936
59;588;04062021125936
60;597;04062021125936
61;613;04062021125936
62;613;04062021125936
63;623;04062021125936
64;621;04062021125936
65;610;04062021125936
66;615;04062021125936
67;598;04062021125936
68;592;04062021125936
69;580;04062021125936
70;569;04062021125936
71;562;04062021125936
72;556;04062021125936
73;542;04062021125936
74;529;04062021125936
75;504;04062021125936
76;488;04062021125936
77;470;04062021125936
78;452;04062021125936
79;431;04062021125936
80;417;04062021125936
81;403;04062021125936
82;395;04062021125936
83;380;04062021125936
84;375;04062021125936
85;364;04062021125936
86;354;04062021125936
87;351;04062021125936
88;347;04062021125936
89;333;04062021125936
90;328;04062021125936
91;315;04062021125936
92;302;04062021125936
93;301;04062021125936
94;290;04062021125936
95;283;04062021125936
96;282;04062021125936
97;268;04062021125936
98;265;04062021125936
99;257;04062021125936
100;250;04062021125936
101;253;04062021125936
102;245;04062021125936
103;239;04062021125936
104;236;04062021125936
105;230;04062021125936
106;231;04062021125936
107;226;04062021125936
108;220;04062021125936
109;219;04062021125936
110;213;04062021125936
111;211;04062021125936
112;209;04062021125936
113;203;04062021125936
114;203;04062021125936
115;204;04062021125936
116;201;04062021125936
117;201;04062021125936
118;194;04062021125936
119;195;04062021125936
120;189;04062021125936
121;190;04062021125936
122;188;04062021125936
123;186;04062021125936
124;184;04062021125936
125;185;04062021125936
126;179;04062021125936
127;180;04062021125936
128;181;04062021125936
129;176;04062021125936
130;176;04062021125936
131;173;04062021125936
132;171;04062021125936
133;177;04062021125936
134;169;04062021125936
135;169;04062021125936
136;171;04062021125936
137;167;04062021125936
138;168;04062021125936
139;166;04062021125936
140;164;04062021125936
141;166;04062021125936
142;161;04062021125936
143;161;04062021125936
144;162;04062021125936
145;160;04062021125936
146;164;04062021125936
147;161;04062021125936
148;160;04062021125936
149;159;04062021125936
150;159;04062021125936
151;157;04062021125936
152;157;04062021125936
153;155;04062021125936
154;157;04062021125936
155;156;04062021125936
156;154;04062021125936
157;155;04062021125936
158;154;04062021125936
159;153;04062021125936
160;155;04062021125936
161;154;04062021125936
162;153;04062021125936
163;154;04062021125936
164;154;04062021125936
165;156;04062021125936
166;152;04062021125936
167;154;04062021125936
168;155;04062021125936
169;149;04062021125936
170;154;04062021125936
171;152;04062021125936
172;148;04062021125936
173;153;04062021125936
174;150;04062021125936
175;150;04062021125936
176;153;04062021125936
177;150;04062021125936
178;153;04062021125936
179;151;04062021125936
180;150;04062021125936
181;151;04062021125936
182;152;04062021125936
183;149;04062021125936
184;151;04062021125936
185;147;04062021125936
186;152;04062021125936
187;152;04062021125936
188;149;04062021125936
189;151;04062021125936
190;148;04062021125936
191;149;04062021125936
192;154;04062021125936
193;148;04062021125936
194;152;04062021125936
195;150;04062021125936
196;148;04062021125936
197;149;04062021125936
198;151;04062021125936
199;148;04062021125936
200;0;04062021125936
0;0;04062021125937
1;172;04062021125937
2;174;04062021125937
3;172;04062021125937
4;174;04062021125937
5;171;04062021125937
6;171;04062021125937
7;172;04062021125937
8;174;04062021125937
9;169;04062021125937
10;172;04062021125937
11;172;04062021125937
12;171;04062021125937
13;176;04062021125937
14;173;04062021125937
15;178;04062021125937
16;180;04062021125937
17;182;04062021125937
18;201;04062021125937
19;229;04062021125937
20;298;04062021125937
21;500;04062021125937
22;993;04062021125937
23;1023;04062021125937
24;1023;04062021125937
25;1023;04062021125937
26;1023;04062021125937
27;1023;04062021125937
28;1023;04062021125937
29;1023;04062021125937
30;1023;04062021125937
31;1023;04062021125937
32;878;04062021125937
33;688;04062021125937
34;575;04062021125937
35;509;04062021125937
36;463;04062021125937
37;450;04062021125937
38;442;04062021125937
39;445;04062021125937
40;453;04062021125937
41;463;04062021125937
42;479;04062021125937
43;480;04062021125937
44;488;04062021125937
45;495;04062021125937
46;493;04062021125937
47;499;04062021125937
48;507;04062021125937
49;508;04062021125937
50;515;04062021125937
51;519;04062021125937
52;525;04062021125937
53;537;04062021125937
54;537;04062021125937
55;546;04062021125937
56;556;04062021125937
57;565;04062021125937
58;581;04062021125937
59;588;04062021125937
60;596;04062021125937
61;608;04062021125937
62;608;04062021125937
63;618;04062021125937
64;619;04062021125937
65;613;04062021125937
66;606;04062021125937
67;598;04062021125937
68;589;04062021125937
69;575;04062021125937
70;566;04062021125937
71;563;04062021125937
72;557;04062021125937
73;539;04062021125937
74;528;04062021125937
75;502;04062021125937
76;485;04062021125937
77;470;04062021125937
78;446;04062021125937
79;433;04062021125937
80;418;04062021125937
81;399;04062021125937
82;394;04062021125937
83;381;04062021125937
84;374;04062021125937
85;367;04062021125937
86;357;04062021125937
87;352;04062021125937
88;346;04062021125937
89;335;04062021125937
90;331;04062021125937
91;316;04062021125937
92;303;04062021125937
93;297;04062021125937
94;292;04062021125937
95;284;04062021125937
96;277;04062021125937
97;269;04062021125937
98;264;04062021125937
99;259;04062021125937
100;251;04062021125937
101;252;04062021125937
102;245;04062021125937
103;240;04062021125937
104;238;04062021125937
105;230;04062021125937
106;227;04062021125937
107;223;04062021125937
108;220;04062021125937
109;216;04062021125937
110;214;04062021125937
111;210;04062021125937
112;209;04062021125937
113;202;04062021125937
114;203;04062021125937
115;203;04062021125937
116;199;04062021125937
117;200;04062021125937
118;193;04062021125937
119;194;04062021125937
120;191;04062021125937
121;186;04062021125937
122;187;04062021125937
123;184;04062021125937
124;183;04062021125937
125;183;04062021125937
126;180;04062021125937
127;179;04062021125937
128;183;04062021125937
129;177;04062021125937
130;178;04062021125937
131;174;04062021125937
132;171;04062021125937
133;177;04062021125937
134;169;04062021125937
135;168;04062021125937
136;169;04062021125937
137;167;04062021125937
138;168;04062021125937
139;166;04062021125937
140;164;04062021125937
141;165;04062021125937
142;162;04062021125937
143;161;04062021125937
144;164;04062021125937
145;158;04062021125937
146;161;04062021125937
147;161;04062021125937
148;157;04062021125937
149;159;04062021125937
150;159;04062021125937
151;159;04062021125937
152;157;04062021125937
153;155;04062021125937
154;157;04062021125937
155;156;04062021125937
156;154;04062021125937
157;153;04062021125937
158;153;04062021125937
159;152;04062021125937
160;154;04062021125937
161;152;04062021125937
162;155;04062021125937
163;153;04062021125937
164;152;04062021125937
165;154;04062021125937
166;152;04062021125937
167;152;04062021125937
168;156;04062021125937
169;149;04062021125937
170;153;04062021125937
171;151;04062021125937
172;150;04062021125937
173;153;04062021125937
174;151;04062021125937
175;149;04062021125937
176;153;04062021125937
177;149;04062021125937
178;153;04062021125937
179;151;04062021125937
180;149;04062021125937
181;152;04062021125937
182;152;04062021125937
183;150;04062021125937
184;150;04062021125937
185;146;04062021125937
186;151;04062021125937
187;150;04062021125937
188;148;04062021125937
189;150;04062021125937
190;148;04062021125937
191;150;04062021125937
192;153;04062021125937
193;148;04062021125937
194;150;04062021125937
195;150;04062021125937
196;147;04062021125937
197;149;04062021125937
198;148;04062021125937
199;147;04062021125937
200;0;04062021125937
