ind;val;datetime
0;0;30062021115205
1;152;30062021115205
2;143;30062021115205
3;142;30062021115205
4;144;30062021115205
5;146;30062021115205
6;145;30062021115205
7;147;30062021115205
8;149;30062021115205
9;149;30062021115205
10;153;30062021115205
11;154;30062021115205
12;155;30062021115205
13;163;30062021115205
14;166;30062021115205
15;178;30062021115205
16;192;30062021115205
17;219;30062021115205
18;278;30062021115205
19;400;30062021115205
20;668;30062021115205
21;1023;30062021115205
22;1023;30062021115205
23;1023;30062021115205
24;1023;30062021115205
25;1023;30062021115205
26;1023;30062021115205
27;1023;30062021115205
28;1023;30062021115205
29;1023;30062021115205
30;1023;30062021115205
31;1023;30062021115205
32;1023;30062021115205
33;1023;30062021115205
34;1023;30062021115205
35;1023;30062021115205
36;1023;30062021115205
37;920;30062021115205
38;742;30062021115205
39;608;30062021115205
40;514;30062021115205
41;449;30062021115205
42;416;30062021115205
43;387;30062021115205
44;372;30062021115205
45;359;30062021115205
46;351;30062021115205
47;347;30062021115205
48;346;30062021115205
49;345;30062021115205
50;347;30062021115205
51;348;30062021115205
52;345;30062021115205
53;354;30062021115205
54;363;30062021115205
55;365;30062021115205
56;372;30062021115205
57;380;30062021115205
58;390;30062021115205
59;398;30062021115205
60;406;30062021115205
61;413;30062021115205
62;419;30062021115205
63;426;30062021115205
64;429;30062021115205
65;430;30062021115205
66;437;30062021115205
67;434;30062021115205
68;431;30062021115205
69;423;30062021115205
70;415;30062021115205
71;411;30062021115205
72;406;30062021115205
73;392;30062021115205
74;387;30062021115205
75;371;30062021115205
76;363;30062021115205
77;356;30062021115205
78;346;30062021115205
79;336;30062021115205
80;325;30062021115205
81;313;30062021115205
82;311;30062021115205
83;302;30062021115205
84;297;30062021115205
85;292;30062021115205
86;288;30062021115205
87;286;30062021115205
88;285;30062021115205
89;276;30062021115205
90;274;30062021115205
91;267;30062021115205
92;263;30062021115205
93;259;30062021115205
94;250;30062021115205
95;245;30062021115205
96;242;30062021115205
97;236;30062021115205
98;231;30062021115205
99;225;30062021115205
100;223;30062021115205
101;222;30062021115205
102;215;30062021115205
103;213;30062021115205
104;209;30062021115205
105;204;30062021115205
106;205;30062021115205
107;197;30062021115205
108;196;30062021115205
109;197;30062021115205
110;192;30062021115205
111;188;30062021115205
112;189;30062021115205
113;183;30062021115205
114;183;30062021115205
115;182;30062021115205
116;179;30062021115205
117;181;30062021115205
118;175;30062021115205
119;174;30062021115205
120;172;30062021115205
121;169;30062021115205
122;170;30062021115205
123;168;30062021115205
124;164;30062021115205
125;164;30062021115205
126;161;30062021115205
127;160;30062021115205
128;161;30062021115205
129;157;30062021115205
130;158;30062021115205
131;158;30062021115205
132;153;30062021115205
133;156;30062021115205
134;152;30062021115205
135;151;30062021115205
136;152;30062021115205
137;148;30062021115205
138;149;30062021115205
139;148;30062021115205
140;145;30062021115205
141;147;30062021115205
142;145;30062021115205
143;144;30062021115205
144;144;30062021115205
145;141;30062021115205
146;144;30062021115205
147;142;30062021115205
148;140;30062021115205
149;140;30062021115205
150;139;30062021115205
151;139;30062021115205
152;139;30062021115205
153;138;30062021115205
154;139;30062021115205
155;137;30062021115205
156;136;30062021115205
157;137;30062021115205
158;136;30062021115205
159;136;30062021115205
160;137;30062021115205
161;135;30062021115205
162;137;30062021115205
163;136;30062021115205
164;133;30062021115205
165;137;30062021115205
166;134;30062021115205
167;135;30062021115205
168;134;30062021115205
169;132;30062021115205
170;134;30062021115205
171;133;30062021115205
172;131;30062021115205
173;134;30062021115205
174;132;30062021115205
175;132;30062021115205
176;133;30062021115205
177;131;30062021115205
178;133;30062021115205
179;132;30062021115205
180;131;30062021115205
181;133;30062021115205
182;132;30062021115205
183;130;30062021115205
184;131;30062021115205
185;129;30062021115205
186;132;30062021115205
187;130;30062021115205
188;129;30062021115205
189;132;30062021115205
190;130;30062021115205
191;130;30062021115205
192;133;30062021115205
193;130;30062021115205
194;131;30062021115205
195;130;30062021115205
196;129;30062021115205
197;131;30062021115205
198;131;30062021115205
199;129;30062021115205
200;0;30062021115205
0;0;30062021115206
1;152;30062021115206
2;144;30062021115206
3;143;30062021115206
4;145;30062021115206
5;146;30062021115206
6;144;30062021115206
7;148;30062021115206
8;148;30062021115206
9;147;30062021115206
10;153;30062021115206
11;153;30062021115206
12;156;30062021115206
13;163;30062021115206
14;168;30062021115206
15;178;30062021115206
16;193;30062021115206
17;222;30062021115206
18;280;30062021115206
19;401;30062021115206
20;669;30062021115206
21;1023;30062021115206
22;1023;30062021115206
23;1023;30062021115206
24;1023;30062021115206
25;1023;30062021115206
26;1023;30062021115206
27;1023;30062021115206
28;1023;30062021115206
29;1023;30062021115206
30;1023;30062021115206
31;1023;30062021115206
32;1023;30062021115206
33;1023;30062021115206
34;1023;30062021115206
35;1023;30062021115206
36;1023;30062021115206
37;930;30062021115206
38;743;30062021115206
39;611;30062021115206
40;518;30062021115206
41;454;30062021115206
42;418;30062021115206
43;387;30062021115206
44;371;30062021115206
45;358;30062021115206
46;351;30062021115206
47;349;30062021115206
48;346;30062021115206
49;343;30062021115206
50;350;30062021115206
51;349;30062021115206
52;349;30062021115206
53;356;30062021115206
54;360;30062021115206
55;366;30062021115206
56;374;30062021115206
57;378;30062021115206
58;395;30062021115206
59;399;30062021115206
60;405;30062021115206
61;417;30062021115206
62;418;30062021115206
63;429;30062021115206
64;435;30062021115206
65;434;30062021115206
66;436;30062021115206
67;437;30062021115206
68;428;30062021115206
69;431;30062021115206
70;417;30062021115206
71;412;30062021115206
72;406;30062021115206
73;390;30062021115206
74;387;30062021115206
75;367;30062021115206
76;363;30062021115206
77;357;30062021115206
78;344;30062021115206
79;333;30062021115206
80;326;30062021115206
81;313;30062021115206
82;311;30062021115206
83;301;30062021115206
84;298;30062021115206
85;294;30062021115206
86;291;30062021115206
87;287;30062021115206
88;283;30062021115206
89;276;30062021115206
90;275;30062021115206
91;273;30062021115206
92;263;30062021115206
93;260;30062021115206
94;252;30062021115206
95;245;30062021115206
96;243;30062021115206
97;236;30062021115206
98;233;30062021115206
99;227;30062021115206
100;222;30062021115206
101;221;30062021115206
102;216;30062021115206
103;215;30062021115206
104;212;30062021115206
105;206;30062021115206
106;205;30062021115206
107;199;30062021115206
108;197;30062021115206
109;198;30062021115206
110;193;30062021115206
111;189;30062021115206
112;189;30062021115206
113;183;30062021115206
114;184;30062021115206
115;183;30062021115206
116;178;30062021115206
117;182;30062021115206
118;176;30062021115206
119;175;30062021115206
120;173;30062021115206
121;169;30062021115206
122;170;30062021115206
123;169;30062021115206
124;166;30062021115206
125;167;30062021115206
126;162;30062021115206
127;162;30062021115206
128;161;30062021115206
129;157;30062021115206
130;159;30062021115206
131;157;30062021115206
132;154;30062021115206
133;157;30062021115206
134;152;30062021115206
135;151;30062021115206
136;152;30062021115206
137;148;30062021115206
138;149;30062021115206
139;147;30062021115206
140;146;30062021115206
141;147;30062021115206
142;145;30062021115206
143;145;30062021115206
144;144;30062021115206
145;141;30062021115206
146;144;30062021115206
147;142;30062021115206
148;140;30062021115206
149;140;30062021115206
150;139;30062021115206
151;140;30062021115206
152;140;30062021115206
153;137;30062021115206
154;140;30062021115206
155;136;30062021115206
156;137;30062021115206
157;136;30062021115206
158;135;30062021115206
159;135;30062021115206
160;136;30062021115206
161;135;30062021115206
162;137;30062021115206
163;135;30062021115206
164;134;30062021115206
165;136;30062021115206
166;134;30062021115206
167;136;30062021115206
168;134;30062021115206
169;132;30062021115206
170;134;30062021115206
171;133;30062021115206
172;132;30062021115206
173;134;30062021115206
174;132;30062021115206
175;131;30062021115206
176;134;30062021115206
177;132;30062021115206
178;133;30062021115206
179;131;30062021115206
180;131;30062021115206
181;133;30062021115206
182;133;30062021115206
183;130;30062021115206
184;131;30062021115206
185;129;30062021115206
186;133;30062021115206
187;131;30062021115206
188;129;30062021115206
189;131;30062021115206
190;130;30062021115206
191;131;30062021115206
192;133;30062021115206
193;131;30062021115206
194;131;30062021115206
195;130;30062021115206
196;130;30062021115206
197;132;30062021115206
198;131;30062021115206
199;129;30062021115206
200;0;30062021115206
0;0;30062021115206
1;152;30062021115206
2;144;30062021115206
3;142;30062021115206
4;144;30062021115206
5;146;30062021115206
6;145;30062021115206
7;147;30062021115206
8;150;30062021115206
9;149;30062021115206
10;154;30062021115206
11;153;30062021115206
12;156;30062021115206
13;163;30062021115206
14;167;30062021115206
15;177;30062021115206
16;194;30062021115206
17;218;30062021115206
18;281;30062021115206
19;406;30062021115206
20;670;30062021115206
21;1023;30062021115206
22;1023;30062021115206
23;1023;30062021115206
24;1023;30062021115206
25;1023;30062021115206
26;1023;30062021115206
27;1023;30062021115206
28;1023;30062021115206
29;1023;30062021115206
30;1023;30062021115206
31;1023;30062021115206
32;1023;30062021115206
33;1023;30062021115206
34;1023;30062021115206
35;1023;30062021115206
36;1023;30062021115206
37;929;30062021115206
38;752;30062021115206
39;612;30062021115206
40;520;30062021115206
41;454;30062021115206
42;422;30062021115206
43;386;30062021115206
44;371;30062021115206
45;360;30062021115206
46;352;30062021115206
47;348;30062021115206
48;350;30062021115206
49;345;30062021115206
50;345;30062021115206
51;347;30062021115206
52;350;30062021115206
53;359;30062021115206
54;359;30062021115206
55;364;30062021115206
56;372;30062021115206
57;381;30062021115206
58;391;30062021115206
59;396;30062021115206
60;411;30062021115206
61;417;30062021115206
62;418;30062021115206
63;426;30062021115206
64;435;30062021115206
65;432;30062021115206
66;435;30062021115206
67;436;30062021115206
68;433;30062021115206
69;428;30062021115206
70;421;30062021115206
71;413;30062021115206
72;407;30062021115206
73;394;30062021115206
74;387;30062021115206
75;374;30062021115206
76;364;30062021115206
77;359;30062021115206
78;346;30062021115206
79;337;30062021115206
80;327;30062021115206
81;315;30062021115206
82;309;30062021115206
83;302;30062021115206
84;298;30062021115206
85;293;30062021115206
86;287;30062021115206
87;284;30062021115206
88;285;30062021115206
89;280;30062021115206
90;276;30062021115206
91;269;30062021115206
92;260;30062021115206
93;258;30062021115206
94;252;30062021115206
95;248;30062021115206
96;244;30062021115206
97;238;30062021115206
98;232;30062021115206
99;229;30062021115206
100;223;30062021115206
101;223;30062021115206
102;216;30062021115206
103;213;30062021115206
104;210;30062021115206
105;204;30062021115206
106;209;30062021115206
107;200;30062021115206
108;198;30062021115206
109;195;30062021115206
110;191;30062021115206
111;189;30062021115206
112;191;30062021115206
113;183;30062021115206
114;183;30062021115206
115;183;30062021115206
116;178;30062021115206
117;180;30062021115206
118;177;30062021115206
119;175;30062021115206
120;172;30062021115206
121;170;30062021115206
122;171;30062021115206
123;169;30062021115206
124;166;30062021115206
125;165;30062021115206
126;163;30062021115206
127;161;30062021115206
128;162;30062021115206
129;157;30062021115206
130;159;30062021115206
131;156;30062021115206
132;153;30062021115206
133;156;30062021115206
134;151;30062021115206
135;151;30062021115206
136;153;30062021115206
137;148;30062021115206
138;150;30062021115206
139;147;30062021115206
140;146;30062021115206
141;148;30062021115206
142;145;30062021115206
143;143;30062021115206
144;144;30062021115206
145;141;30062021115206
146;144;30062021115206
147;143;30062021115206
148;140;30062021115206
149;139;30062021115206
150;139;30062021115206
151;140;30062021115206
152;140;30062021115206
153;137;30062021115206
154;140;30062021115206
155;137;30062021115206
156;136;30062021115206
157;137;30062021115206
158;135;30062021115206
159;135;30062021115206
160;136;30062021115206
161;135;30062021115206
162;137;30062021115206
163;136;30062021115206
164;135;30062021115206
165;136;30062021115206
166;135;30062021115206
167;134;30062021115206
168;134;30062021115206
169;132;30062021115206
170;134;30062021115206
171;133;30062021115206
172;132;30062021115206
173;134;30062021115206
174;132;30062021115206
175;132;30062021115206
176;134;30062021115206
177;131;30062021115206
178;133;30062021115206
179;132;30062021115206
180;131;30062021115206
181;132;30062021115206
182;132;30062021115206
183;131;30062021115206
184;132;30062021115206
185;129;30062021115206
186;133;30062021115206
187;132;30062021115206
188;129;30062021115206
189;131;30062021115206
190;129;30062021115206
191;131;30062021115206
192;134;30062021115206
193;130;30062021115206
194;131;30062021115206
195;130;30062021115206
196;130;30062021115206
197;131;30062021115206
198;131;30062021115206
199;129;30062021115206
200;0;30062021115206
0;0;30062021115207
1;152;30062021115207
2;144;30062021115207
3;143;30062021115207
4;143;30062021115207
5;146;30062021115207
6;143;30062021115207
7;146;30062021115207
8;148;30062021115207
9;148;30062021115207
10;153;30062021115207
11;153;30062021115207
12;156;30062021115207
13;163;30062021115207
14;166;30062021115207
15;176;30062021115207
16;190;30062021115207
17;218;30062021115207
18;280;30062021115207
19;404;30062021115207
20;670;30062021115207
21;1023;30062021115207
22;1023;30062021115207
23;1023;30062021115207
24;1023;30062021115207
25;1023;30062021115207
26;1023;30062021115207
27;1023;30062021115207
28;1023;30062021115207
29;1023;30062021115207
30;1023;30062021115207
31;1023;30062021115207
32;1023;30062021115207
33;1023;30062021115207
34;1023;30062021115207
35;1023;30062021115207
36;1023;30062021115207
37;927;30062021115207
38;751;30062021115207
39;617;30062021115207
40;522;30062021115207
41;455;30062021115207
42;417;30062021115207
43;385;30062021115207
44;369;30062021115207
45;359;30062021115207
46;354;30062021115207
47;347;30062021115207
48;347;30062021115207
49;347;30062021115207
50;345;30062021115207
51;346;30062021115207
52;347;30062021115207
53;359;30062021115207
54;366;30062021115207
55;362;30062021115207
56;373;30062021115207
57;381;30062021115207
58;392;30062021115207
59;395;30062021115207
60;407;30062021115207
61;417;30062021115207
62;417;30062021115207
63;431;30062021115207
64;433;30062021115207
65;435;30062021115207
66;436;30062021115207
67;435;30062021115207
68;429;30062021115207
69;426;30062021115207
70;418;30062021115207
71;413;30062021115207
72;404;30062021115207
73;391;30062021115207
74;386;30062021115207
75;372;30062021115207
76;364;30062021115207
77;358;30062021115207
78;346;30062021115207
79;334;30062021115207
80;323;30062021115207
81;316;30062021115207
82;311;30062021115207
83;303;30062021115207
84;298;30062021115207
85;295;30062021115207
86;287;30062021115207
87;287;30062021115207
88;285;30062021115207
89;276;30062021115207
90;277;30062021115207
91;269;30062021115207
92;260;30062021115207
93;258;30062021115207
94;251;30062021115207
95;247;30062021115207
96;242;30062021115207
97;235;30062021115207
98;232;30062021115207
99;230;30062021115207
100;223;30062021115207
101;224;30062021115207
102;217;30062021115207
103;212;30062021115207
104;210;30062021115207
105;205;30062021115207
106;207;30062021115207
107;201;30062021115207
108;198;30062021115207
109;196;30062021115207
110;192;30062021115207
111;189;30062021115207
112;187;30062021115207
113;181;30062021115207
114;182;30062021115207
115;181;30062021115207
116;178;30062021115207
117;180;30062021115207
118;175;30062021115207
119;174;30062021115207
120;172;30062021115207
121;170;30062021115207
122;170;30062021115207
123;168;30062021115207
124;165;30062021115207
125;164;30062021115207
126;161;30062021115207
127;160;30062021115207
128;161;30062021115207
129;158;30062021115207
130;157;30062021115207
131;156;30062021115207
132;154;30062021115207
133;156;30062021115207
134;152;30062021115207
135;150;30062021115207
136;151;30062021115207
137;148;30062021115207
138;148;30062021115207
139;147;30062021115207
140;144;30062021115207
141;146;30062021115207
142;144;30062021115207
143;143;30062021115207
144;146;30062021115207
145;141;30062021115207
146;144;30062021115207
147;142;30062021115207
148;140;30062021115207
149;139;30062021115207
150;140;30062021115207
151;138;30062021115207
152;139;30062021115207
153;137;30062021115207
154;139;30062021115207
155;137;30062021115207
156;137;30062021115207
157;138;30062021115207
158;136;30062021115207
159;135;30062021115207
160;137;30062021115207
161;134;30062021115207
162;136;30062021115207
163;135;30062021115207
164;133;30062021115207
165;136;30062021115207
166;134;30062021115207
167;134;30062021115207
168;135;30062021115207
169;132;30062021115207
170;135;30062021115207
171;133;30062021115207
172;134;30062021115207
173;133;30062021115207
174;132;30062021115207
175;131;30062021115207
176;134;30062021115207
177;132;30062021115207
178;133;30062021115207
179;132;30062021115207
180;131;30062021115207
181;133;30062021115207
182;132;30062021115207
183;130;30062021115207
184;132;30062021115207
185;129;30062021115207
186;132;30062021115207
187;131;30062021115207
188;129;30062021115207
189;131;30062021115207
190;131;30062021115207
191;130;30062021115207
192;133;30062021115207
193;130;30062021115207
194;130;30062021115207
195;130;30062021115207
196;130;30062021115207
197;131;30062021115207
198;130;30062021115207
199;129;30062021115207
200;0;30062021115207
0;0;30062021115208
1;152;30062021115208
2;143;30062021115208
3;143;30062021115208
4;143;30062021115208
5;145;30062021115208
6;143;30062021115208
7;147;30062021115208
8;150;30062021115208
9;147;30062021115208
10;153;30062021115208
11;153;30062021115208
12;156;30062021115208
13;163;30062021115208
14;167;30062021115208
15;178;30062021115208
16;192;30062021115208
17;219;30062021115208
18;278;30062021115208
19;403;30062021115208
20;668;30062021115208
21;1023;30062021115208
22;1023;30062021115208
23;1023;30062021115208
24;1023;30062021115208
25;1023;30062021115208
26;1023;30062021115208
27;1023;30062021115208
28;1023;30062021115208
29;1023;30062021115208
30;1023;30062021115208
31;1023;30062021115208
32;1023;30062021115208
33;1023;30062021115208
34;1023;30062021115208
35;1023;30062021115208
36;1023;30062021115208
37;925;30062021115208
38;749;30062021115208
39;616;30062021115208
40;520;30062021115208
41;453;30062021115208
42;419;30062021115208
43;389;30062021115208
44;372;30062021115208
45;361;30062021115208
46;351;30062021115208
47;349;30062021115208
48;347;30062021115208
49;341;30062021115208
50;348;30062021115208
51;348;30062021115208
52;349;30062021115208
53;358;30062021115208
54;361;30062021115208
55;363;30062021115208
56;371;30062021115208
57;380;30062021115208
58;391;30062021115208
59;394;30062021115208
60;407;30062021115208
61;414;30062021115208
62;417;30062021115208
63;425;30062021115208
64;433;30062021115208
65;430;30062021115208
66;438;30062021115208
67;432;30062021115208
68;428;30062021115208
69;425;30062021115208
70;416;30062021115208
71;411;30062021115208
72;406;30062021115208
73;393;30062021115208
74;390;30062021115208
75;372;30062021115208
76;364;30062021115208
77;359;30062021115208
78;345;30062021115208
79;336;30062021115208
80;327;30062021115208
81;316;30062021115208
82;314;30062021115208
83;301;30062021115208
84;296;30062021115208
85;292;30062021115208
86;287;30062021115208
87;285;30062021115208
88;284;30062021115208
89;276;30062021115208
90;276;30062021115208
91;270;30062021115208
92;262;30062021115208
93;259;30062021115208
94;252;30062021115208
95;247;30062021115208
96;243;30062021115208
97;236;30062021115208
98;232;30062021115208
99;228;30062021115208
100;223;30062021115208
101;224;30062021115208
102;215;30062021115208
103;211;30062021115208
104;210;30062021115208
105;205;30062021115208
106;208;30062021115208
107;199;30062021115208
108;199;30062021115208
109;197;30062021115208
110;192;30062021115208
111;188;30062021115208
112;188;30062021115208
113;184;30062021115208
114;182;30062021115208
115;181;30062021115208
116;176;30062021115208
117;178;30062021115208
118;175;30062021115208
119;175;30062021115208
120;173;30062021115208
121;169;30062021115208
122;170;30062021115208
123;169;30062021115208
124;165;30062021115208
125;165;30062021115208
126;161;30062021115208
127;161;30062021115208
128;163;30062021115208
129;158;30062021115208
130;156;30062021115208
131;157;30062021115208
132;153;30062021115208
133;157;30062021115208
134;152;30062021115208
135;151;30062021115208
136;153;30062021115208
137;147;30062021115208
138;150;30062021115208
139;147;30062021115208
140;146;30062021115208
141;147;30062021115208
142;143;30062021115208
143;143;30062021115208
144;144;30062021115208
145;140;30062021115208
146;144;30062021115208
147;142;30062021115208
148;140;30062021115208
149;141;30062021115208
150;139;30062021115208
151;138;30062021115208
152;139;30062021115208
153;137;30062021115208
154;139;30062021115208
155;138;30062021115208
156;136;30062021115208
157;136;30062021115208
158;135;30062021115208
159;136;30062021115208
160;136;30062021115208
161;134;30062021115208
162;136;30062021115208
163;135;30062021115208
164;134;30062021115208
165;135;30062021115208
166;133;30062021115208
167;134;30062021115208
168;136;30062021115208
169;132;30062021115208
170;134;30062021115208
171;133;30062021115208
172;131;30062021115208
173;133;30062021115208
174;132;30062021115208
175;130;30062021115208
176;133;30062021115208
177;131;30062021115208
178;133;30062021115208
179;132;30062021115208
180;130;30062021115208
181;133;30062021115208
182;132;30062021115208
183;130;30062021115208
184;132;30062021115208
185;129;30062021115208
186;132;30062021115208
187;131;30062021115208
188;129;30062021115208
189;131;30062021115208
190;130;30062021115208
191;130;30062021115208
192;133;30062021115208
193;129;30062021115208
194;131;30062021115208
195;130;30062021115208
196;129;30062021115208
197;131;30062021115208
198;130;30062021115208
199;129;30062021115208
200;0;30062021115208
0;0;30062021115209
1;152;30062021115209
2;144;30062021115209
3;143;30062021115209
4;143;30062021115209
5;146;30062021115209
6;145;30062021115209
7;147;30062021115209
8;148;30062021115209
9;148;30062021115209
10;152;30062021115209
11;153;30062021115209
12;155;30062021115209
13;163;30062021115209
14;167;30062021115209
15;178;30062021115209
16;192;30062021115209
17;218;30062021115209
18;280;30062021115209
19;402;30062021115209
20;669;30062021115209
21;1023;30062021115209
22;1023;30062021115209
23;1023;30062021115209
24;1023;30062021115209
25;1023;30062021115209
26;1023;30062021115209
27;1023;30062021115209
28;1023;30062021115209
29;1023;30062021115209
30;1023;30062021115209
31;1023;30062021115209
32;1023;30062021115209
33;1023;30062021115209
34;1023;30062021115209
35;1023;30062021115209
36;1023;30062021115209
37;932;30062021115209
38;752;30062021115209
39;614;30062021115209
40;519;30062021115209
41;453;30062021115209
42;419;30062021115209
43;386;30062021115209
44;371;30062021115209
45;359;30062021115209
46;349;30062021115209
47;350;30062021115209
48;347;30062021115209
49;344;30062021115209
50;349;30062021115209
51;350;30062021115209
52;351;30062021115209
53;357;30062021115209
54;357;30062021115209
55;364;30062021115209
56;373;30062021115209
57;380;30062021115209
58;390;30062021115209
59;397;30062021115209
60;407;30062021115209
61;417;30062021115209
62;419;30062021115209
63;425;30062021115209
64;434;30062021115209
65;432;30062021115209
66;434;30062021115209
67;431;30062021115209
68;425;30062021115209
69;428;30062021115209
70;415;30062021115209
71;413;30062021115209
72;403;30062021115209
73;391;30062021115209
74;386;30062021115209
75;370;30062021115209
76;363;30062021115209
77;357;30062021115209
78;345;30062021115209
79;334;30062021115209
80;327;30062021115209
81;316;30062021115209
82;310;30062021115209
83;299;30062021115209
84;297;30062021115209
85;294;30062021115209
86;288;30062021115209
87;288;30062021115209
88;285;30062021115209
89;278;30062021115209
90;275;30062021115209
91;270;30062021115209
92;262;30062021115209
93;259;30062021115209
94;254;30062021115209
95;246;30062021115209
96;240;30062021115209
97;236;30062021115209
98;232;30062021115209
99;228;30062021115209
100;224;30062021115209
101;222;30062021115209
102;217;30062021115209
103;211;30062021115209
104;211;30062021115209
105;205;30062021115209
106;206;30062021115209
107;200;30062021115209
108;199;30062021115209
109;196;30062021115209
110;191;30062021115209
111;190;30062021115209
112;191;30062021115209
113;183;30062021115209
114;182;30062021115209
115;182;30062021115209
116;180;30062021115209
117;181;30062021115209
118;175;30062021115209
119;174;30062021115209
120;172;30062021115209
121;168;30062021115209
122;169;30062021115209
123;168;30062021115209
124;165;30062021115209
125;164;30062021115209
126;161;30062021115209
127;162;30062021115209
128;162;30062021115209
129;158;30062021115209
130;157;30062021115209
131;157;30062021115209
132;154;30062021115209
133;157;30062021115209
134;151;30062021115209
135;151;30062021115209
136;151;30062021115209
137;147;30062021115209
138;149;30062021115209
139;147;30062021115209
140;146;30062021115209
141;146;30062021115209
142;144;30062021115209
143;143;30062021115209
144;145;30062021115209
145;142;30062021115209
146;143;30062021115209
147;141;30062021115209
148;140;30062021115209
149;140;30062021115209
150;139;30062021115209
151;138;30062021115209
152;140;30062021115209
153;137;30062021115209
154;140;30062021115209
155;137;30062021115209
156;136;30062021115209
157;137;30062021115209
158;135;30062021115209
159;135;30062021115209
160;136;30062021115209
161;134;30062021115209
162;136;30062021115209
163;136;30062021115209
164;134;30062021115209
165;136;30062021115209
166;135;30062021115209
167;134;30062021115209
168;136;30062021115209
169;133;30062021115209
170;135;30062021115209
171;134;30062021115209
172;133;30062021115209
173;133;30062021115209
174;133;30062021115209
175;132;30062021115209
176;133;30062021115209
177;131;30062021115209
178;133;30062021115209
179;133;30062021115209
180;132;30062021115209
181;133;30062021115209
182;132;30062021115209
183;132;30062021115209
184;132;30062021115209
185;128;30062021115209
186;133;30062021115209
187;131;30062021115209
188;130;30062021115209
189;131;30062021115209
190;129;30062021115209
191;130;30062021115209
192;134;30062021115209
193;131;30062021115209
194;131;30062021115209
195;132;30062021115209
196;130;30062021115209
197;131;30062021115209
198;131;30062021115209
199;130;30062021115209
200;0;30062021115209
0;0;30062021115209
1;152;30062021115209
2;143;30062021115209
3;143;30062021115209
4;142;30062021115209
5;145;30062021115209
6;144;30062021115209
7;147;30062021115209
8;150;30062021115209
9;150;30062021115209
10;153;30062021115209
11;154;30062021115209
12;156;30062021115209
13;162;30062021115209
14;167;30062021115209
15;177;30062021115209
16;193;30062021115209
17;219;30062021115209
18;279;30062021115209
19;400;30062021115209
20;668;30062021115209
21;1023;30062021115209
22;1023;30062021115209
23;1023;30062021115209
24;1023;30062021115209
25;1023;30062021115209
26;1023;30062021115209
27;1023;30062021115209
28;1023;30062021115209
29;1023;30062021115209
30;1023;30062021115209
31;1023;30062021115209
32;1023;30062021115209
33;1023;30062021115209
34;1023;30062021115209
35;1023;30062021115209
36;1023;30062021115209
37;932;30062021115209
38;753;30062021115209
39;620;30062021115209
40;519;30062021115209
41;452;30062021115209
42;418;30062021115209
43;391;30062021115209
44;369;30062021115209
45;359;30062021115209
46;348;30062021115209
47;349;30062021115209
48;347;30062021115209
49;344;30062021115209
50;347;30062021115209
51;348;30062021115209
52;348;30062021115209
53;355;30062021115209
54;357;30062021115209
55;364;30062021115209
56;374;30062021115209
57;380;30062021115209
58;390;30062021115209
59;396;30062021115209
60;406;30062021115209
61;415;30062021115209
62;420;30062021115209
63;427;30062021115209
64;434;30062021115209
65;431;30062021115209
66;433;30062021115209
67;436;30062021115209
68;428;30062021115209
69;425;30062021115209
70;418;30062021115209
71;414;30062021115209
72;402;30062021115209
73;391;30062021115209
74;386;30062021115209
75;370;30062021115209
76;365;30062021115209
77;357;30062021115209
78;344;30062021115209
79;333;30062021115209
80;326;30062021115209
81;313;30062021115209
82;308;30062021115209
83;302;30062021115209
84;292;30062021115209
85;291;30062021115209
86;291;30062021115209
87;285;30062021115209
88;286;30062021115209
89;277;30062021115209
90;278;30062021115209
91;271;30062021115209
92;261;30062021115209
93;257;30062021115209
94;252;30062021115209
95;243;30062021115209
96;241;30062021115209
97;235;30062021115209
98;233;30062021115209
99;227;30062021115209
100;224;30062021115209
101;221;30062021115209
102;218;30062021115209
103;213;30062021115209
104;210;30062021115209
105;204;30062021115209
106;207;30062021115209
107;200;30062021115209
108;196;30062021115209
109;195;30062021115209
110;191;30062021115209
111;189;30062021115209
112;188;30062021115209
113;184;30062021115209
114;183;30062021115209
115;181;30062021115209
116;179;30062021115209
117;179;30062021115209
118;175;30062021115209
119;173;30062021115209
120;171;30062021115209
121;168;30062021115209
122;170;30062021115209
123;168;30062021115209
124;165;30062021115209
125;166;30062021115209
126;161;30062021115209
127;160;30062021115209
128;160;30062021115209
129;157;30062021115209
130;157;30062021115209
131;156;30062021115209
132;154;30062021115209
133;156;30062021115209
134;152;30062021115209
135;150;30062021115209
136;152;30062021115209
137;148;30062021115209
138;149;30062021115209
139;147;30062021115209
140;145;30062021115209
141;147;30062021115209
142;143;30062021115209
143;143;30062021115209
144;145;30062021115209
145;141;30062021115209
146;144;30062021115209
147;142;30062021115209
148;140;30062021115209
149;140;30062021115209
150;138;30062021115209
151;138;30062021115209
152;139;30062021115209
153;136;30062021115209
154;138;30062021115209
155;137;30062021115209
156;137;30062021115209
157;137;30062021115209
158;136;30062021115209
159;135;30062021115209
160;137;30062021115209
161;135;30062021115209
162;136;30062021115209
163;135;30062021115209
164;134;30062021115209
165;136;30062021115209
166;134;30062021115209
167;134;30062021115209
168;136;30062021115209
169;132;30062021115209
170;134;30062021115209
171;133;30062021115209
172;133;30062021115209
173;134;30062021115209
174;133;30062021115209
175;131;30062021115209
176;134;30062021115209
177;131;30062021115209
178;133;30062021115209
179;131;30062021115209
180;132;30062021115209
181;133;30062021115209
182;131;30062021115209
183;130;30062021115209
184;132;30062021115209
185;130;30062021115209
186;133;30062021115209
187;132;30062021115209
188;129;30062021115209
189;131;30062021115209
190;129;30062021115209
191;130;30062021115209
192;133;30062021115209
193;130;30062021115209
194;131;30062021115209
195;131;30062021115209
196;130;30062021115209
197;131;30062021115209
198;130;30062021115209
199;128;30062021115209
200;0;30062021115209
0;0;30062021115210
1;152;30062021115210
2;143;30062021115210
3;144;30062021115210
4;143;30062021115210
5;145;30062021115210
6;144;30062021115210
7;148;30062021115210
8;149;30062021115210
9;148;30062021115210
10;153;30062021115210
11;153;30062021115210
12;155;30062021115210
13;162;30062021115210
14;166;30062021115210
15;177;30062021115210
16;191;30062021115210
17;219;30062021115210
18;278;30062021115210
19;402;30062021115210
20;667;30062021115210
21;1023;30062021115210
22;1023;30062021115210
23;1023;30062021115210
24;1023;30062021115210
25;1023;30062021115210
26;1023;30062021115210
27;1023;30062021115210
28;1023;30062021115210
29;1023;30062021115210
30;1023;30062021115210
31;1023;30062021115210
32;1023;30062021115210
33;1023;30062021115210
34;1023;30062021115210
35;1023;30062021115210
36;1023;30062021115210
37;929;30062021115210
38;756;30062021115210
39;616;30062021115210
40;520;30062021115210
41;456;30062021115210
42;417;30062021115210
43;387;30062021115210
44;369;30062021115210
45;361;30062021115210
46;351;30062021115210
47;345;30062021115210
48;345;30062021115210
49;341;30062021115210
50;347;30062021115210
51;349;30062021115210
52;348;30062021115210
53;356;30062021115210
54;362;30062021115210
55;365;30062021115210
56;372;30062021115210
57;381;30062021115210
58;391;30062021115210
59;397;30062021115210
60;406;30062021115210
61;415;30062021115210
62;418;30062021115210
63;426;30062021115210
64;435;30062021115210
65;428;30062021115210
66;434;30062021115210
67;433;30062021115210
68;430;30062021115210
69;423;30062021115210
70;413;30062021115210
71;410;30062021115210
72;406;30062021115210
73;391;30062021115210
74;385;30062021115210
75;370;30062021115210
76;365;30062021115210
77;356;30062021115210
78;345;30062021115210
79;335;30062021115210
80;326;30062021115210
81;317;30062021115210
82;310;30062021115210
83;302;30062021115210
84;297;30062021115210
85;292;30062021115210
86;289;30062021115210
87;285;30062021115210
88;286;30062021115210
89;277;30062021115210
90;276;30062021115210
91;267;30062021115210
92;262;30062021115210
93;256;30062021115210
94;254;30062021115210
95;244;30062021115210
96;244;30062021115210
97;234;30062021115210
98;233;30062021115210
99;227;30062021115210
100;220;30062021115210
101;222;30062021115210
102;216;30062021115210
103;212;30062021115210
104;209;30062021115210
105;207;30062021115210
106;204;30062021115210
107;199;30062021115210
108;196;30062021115210
109;196;30062021115210
110;190;30062021115210
111;190;30062021115210
112;188;30062021115210
113;182;30062021115210
114;182;30062021115210
115;183;30062021115210
116;179;30062021115210
117;180;30062021115210
118;175;30062021115210
119;174;30062021115210
120;173;30062021115210
121;170;30062021115210
122;169;30062021115210
123;168;30062021115210
124;165;30062021115210
125;166;30062021115210
126;162;30062021115210
127;160;30062021115210
128;162;30062021115210
129;157;30062021115210
130;158;30062021115210
131;157;30062021115210
132;154;30062021115210
133;156;30062021115210
134;151;30062021115210
135;150;30062021115210
136;151;30062021115210
137;148;30062021115210
138;149;30062021115210
139;148;30062021115210
140;145;30062021115210
141;147;30062021115210
142;145;30062021115210
143;142;30062021115210
144;143;30062021115210
145;141;30062021115210
146;144;30062021115210
147;142;30062021115210
148;140;30062021115210
149;140;30062021115210
150;139;30062021115210
151;139;30062021115210
152;139;30062021115210
153;138;30062021115210
154;138;30062021115210
155;136;30062021115210
156;135;30062021115210
157;137;30062021115210
158;135;30062021115210
159;135;30062021115210
160;138;30062021115210
161;135;30062021115210
162;136;30062021115210
163;136;30062021115210
164;134;30062021115210
165;135;30062021115210
166;134;30062021115210
167;134;30062021115210
168;135;30062021115210
169;132;30062021115210
170;134;30062021115210
171;133;30062021115210
172;132;30062021115210
173;133;30062021115210
174;132;30062021115210
175;131;30062021115210
176;133;30062021115210
177;130;30062021115210
178;133;30062021115210
179;132;30062021115210
180;131;30062021115210
181;133;30062021115210
182;132;30062021115210
183;130;30062021115210
184;132;30062021115210
185;129;30062021115210
186;134;30062021115210
187;131;30062021115210
188;130;30062021115210
189;131;30062021115210
190;129;30062021115210
191;131;30062021115210
192;134;30062021115210
193;129;30062021115210
194;130;30062021115210
195;131;30062021115210
196;130;30062021115210
197;130;30062021115210
198;131;30062021115210
199;130;30062021115210
200;0;30062021115210
0;0;30062021115211
1;152;30062021115211
2;144;30062021115211
3;143;30062021115211
4;145;30062021115211
5;146;30062021115211
6;144;30062021115211
7;147;30062021115211
8;150;30062021115211
9;148;30062021115211
10;154;30062021115211
11;153;30062021115211
12;156;30062021115211
13;162;30062021115211
14;166;30062021115211
15;177;30062021115211
16;191;30062021115211
17;217;30062021115211
18;281;30062021115211
19;401;30062021115211
20;671;30062021115211
21;1023;30062021115211
22;1023;30062021115211
23;1023;30062021115211
24;1023;30062021115211
25;1023;30062021115211
26;1023;30062021115211
27;1023;30062021115211
28;1023;30062021115211
29;1023;30062021115211
30;1023;30062021115211
31;1023;30062021115211
32;1023;30062021115211
33;1023;30062021115211
34;1023;30062021115211
35;1023;30062021115211
36;1023;30062021115211
37;934;30062021115211
38;750;30062021115211
39;615;30062021115211
40;521;30062021115211
41;452;30062021115211
42;418;30062021115211
43;387;30062021115211
44;373;30062021115211
45;356;30062021115211
46;353;30062021115211
47;350;30062021115211
48;348;30062021115211
49;348;30062021115211
50;346;30062021115211
51;348;30062021115211
52;349;30062021115211
53;357;30062021115211
54;359;30062021115211
55;364;30062021115211
56;377;30062021115211
57;380;30062021115211
58;391;30062021115211
59;395;30062021115211
60;407;30062021115211
61;417;30062021115211
62;421;30062021115211
63;428;30062021115211
64;430;30062021115211
65;428;30062021115211
66;439;30062021115211
67;430;30062021115211
68;429;30062021115211
69;428;30062021115211
70;419;30062021115211
71;412;30062021115211
72;402;30062021115211
73;392;30062021115211
74;383;30062021115211
75;372;30062021115211
76;367;30062021115211
77;354;30062021115211
78;347;30062021115211
79;336;30062021115211
80;325;30062021115211
81;316;30062021115211
82;309;30062021115211
83;301;30062021115211
84;297;30062021115211
85;295;30062021115211
86;285;30062021115211
87;288;30062021115211
88;286;30062021115211
89;278;30062021115211
90;274;30062021115211
91;269;30062021115211
92;262;30062021115211
93;258;30062021115211
94;251;30062021115211
95;247;30062021115211
96;246;30062021115211
97;238;30062021115211
98;232;30062021115211
99;228;30062021115211
100;224;30062021115211
101;221;30062021115211
102;217;30062021115211
103;212;30062021115211
104;211;30062021115211
105;206;30062021115211
106;205;30062021115211
107;199;30062021115211
108;196;30062021115211
109;196;30062021115211
110;191;30062021115211
111;189;30062021115211
112;189;30062021115211
113;182;30062021115211
114;182;30062021115211
115;181;30062021115211
116;178;30062021115211
117;181;30062021115211
118;176;30062021115211
119;173;30062021115211
120;171;30062021115211
121;170;30062021115211
122;170;30062021115211
123;168;30062021115211
124;167;30062021115211
125;166;30062021115211
126;160;30062021115211
127;160;30062021115211
128;161;30062021115211
129;157;30062021115211
130;156;30062021115211
131;157;30062021115211
132;154;30062021115211
133;157;30062021115211
134;150;30062021115211
135;152;30062021115211
136;153;30062021115211
137;147;30062021115211
138;149;30062021115211
139;148;30062021115211
140;145;30062021115211
141;148;30062021115211
142;144;30062021115211
143;143;30062021115211
144;144;30062021115211
145;141;30062021115211
146;143;30062021115211
147;142;30062021115211
148;140;30062021115211
149;141;30062021115211
150;140;30062021115211
151;140;30062021115211
152;139;30062021115211
153;137;30062021115211
154;139;30062021115211
155;137;30062021115211
156;137;30062021115211
157;136;30062021115211
158;135;30062021115211
159;136;30062021115211
160;136;30062021115211
161;135;30062021115211
162;137;30062021115211
163;135;30062021115211
164;134;30062021115211
165;135;30062021115211
166;134;30062021115211
167;133;30062021115211
168;135;30062021115211
169;132;30062021115211
170;135;30062021115211
171;134;30062021115211
172;132;30062021115211
173;134;30062021115211
174;132;30062021115211
175;132;30062021115211
176;132;30062021115211
177;131;30062021115211
178;133;30062021115211
179;132;30062021115211
180;131;30062021115211
181;133;30062021115211
182;132;30062021115211
183;131;30062021115211
184;133;30062021115211
185;129;30062021115211
186;132;30062021115211
187;131;30062021115211
188;129;30062021115211
189;131;30062021115211
190;129;30062021115211
191;130;30062021115211
192;134;30062021115211
193;130;30062021115211
194;131;30062021115211
195;131;30062021115211
196;130;30062021115211
197;131;30062021115211
198;131;30062021115211
199;130;30062021115211
200;0;30062021115211
0;0;30062021115212
1;153;30062021115212
2;144;30062021115212
3;141;30062021115212
4;143;30062021115212
5;146;30062021115212
6;143;30062021115212
7;147;30062021115212
8;149;30062021115212
9;149;30062021115212
10;152;30062021115212
11;154;30062021115212
12;156;30062021115212
13;163;30062021115212
14;165;30062021115212
15;178;30062021115212
16;192;30062021115212
17;219;30062021115212
18;280;30062021115212
19;400;30062021115212
20;665;30062021115212
21;1023;30062021115212
22;1023;30062021115212
23;1023;30062021115212
24;1023;30062021115212
25;1023;30062021115212
26;1023;30062021115212
27;1023;30062021115212
28;1023;30062021115212
29;1023;30062021115212
30;1023;30062021115212
31;1023;30062021115212
32;1023;30062021115212
33;1023;30062021115212
34;1023;30062021115212
35;1023;30062021115212
36;1023;30062021115212
37;930;30062021115212
38;751;30062021115212
39;618;30062021115212
40;520;30062021115212
41;460;30062021115212
42;421;30062021115212
43;386;30062021115212
44;370;30062021115212
45;359;30062021115212
46;350;30062021115212
47;349;30062021115212
48;345;30062021115212
49;344;30062021115212
50;347;30062021115212
51;346;30062021115212
52;347;30062021115212
53;351;30062021115212
54;358;30062021115212
55;363;30062021115212
56;373;30062021115212
57;379;30062021115212
58;387;30062021115212
59;394;30062021115212
60;403;30062021115212
61;411;30062021115212
62;418;30062021115212
63;427;30062021115212
64;428;30062021115212
65;430;30062021115212
66;431;30062021115212
67;433;30062021115212
68;426;30062021115212
69;425;30062021115212
70;414;30062021115212
71;409;30062021115212
72;400;30062021115212
73;389;30062021115212
74;388;30062021115212
75;370;30062021115212
76;365;30062021115212
77;355;30062021115212
78;343;30062021115212
79;338;30062021115212
80;326;30062021115212
81;315;30062021115212
82;308;30062021115212
83;301;30062021115212
84;298;30062021115212
85;291;30062021115212
86;286;30062021115212
87;283;30062021115212
88;283;30062021115212
89;274;30062021115212
90;274;30062021115212
91;270;30062021115212
92;260;30062021115212
93;259;30062021115212
94;254;30062021115212
95;245;30062021115212
96;242;30062021115212
97;235;30062021115212
98;231;30062021115212
99;227;30062021115212
100;223;30062021115212
101;222;30062021115212
102;214;30062021115212
103;213;30062021115212
104;207;30062021115212
105;205;30062021115212
106;205;30062021115212
107;198;30062021115212
108;196;30062021115212
109;196;30062021115212
110;190;30062021115212
111;188;30062021115212
112;190;30062021115212
113;183;30062021115212
114;183;30062021115212
115;183;30062021115212
116;177;30062021115212
117;180;30062021115212
118;174;30062021115212
119;174;30062021115212
120;171;30062021115212
121;169;30062021115212
122;169;30062021115212
123;168;30062021115212
124;166;30062021115212
125;165;30062021115212
126;161;30062021115212
127;161;30062021115212
128;162;30062021115212
129;155;30062021115212
130;156;30062021115212
131;157;30062021115212
132;154;30062021115212
133;156;30062021115212
134;152;30062021115212
135;150;30062021115212
136;151;30062021115212
137;148;30062021115212
138;149;30062021115212
139;149;30062021115212
140;146;30062021115212
141;147;30062021115212
142;144;30062021115212
143;143;30062021115212
144;144;30062021115212
145;140;30062021115212
146;143;30062021115212
147;142;30062021115212
148;140;30062021115212
149;141;30062021115212
150;139;30062021115212
151;139;30062021115212
152;139;30062021115212
153;137;30062021115212
154;140;30062021115212
155;138;30062021115212
156;136;30062021115212
157;136;30062021115212
158;135;30062021115212
159;134;30062021115212
160;137;30062021115212
161;135;30062021115212
162;137;30062021115212
163;136;30062021115212
164;134;30062021115212
165;136;30062021115212
166;133;30062021115212
167;134;30062021115212
168;135;30062021115212
169;131;30062021115212
170;134;30062021115212
171;134;30062021115212
172;131;30062021115212
173;134;30062021115212
174;133;30062021115212
175;132;30062021115212
176;134;30062021115212
177;131;30062021115212
178;133;30062021115212
179;131;30062021115212
180;131;30062021115212
181;132;30062021115212
182;133;30062021115212
183;131;30062021115212
184;132;30062021115212
185;129;30062021115212
186;133;30062021115212
187;132;30062021115212
188;130;30062021115212
189;131;30062021115212
190;130;30062021115212
191;129;30062021115212
192;133;30062021115212
193;130;30062021115212
194;130;30062021115212
195;130;30062021115212
196;130;30062021115212
197;131;30062021115212
198;132;30062021115212
199;129;30062021115212
200;0;30062021115212
