ind;val;datetime
0;0;29062021165622
1;143;29062021165622
2;125;29062021165622
3;124;29062021165622
4;124;29062021165622
5;126;29062021165622
6;124;29062021165622
7;125;29062021165622
8;126;29062021165622
9;125;29062021165622
10;129;29062021165622
11;127;29062021165622
12;127;29062021165622
13;130;29062021165622
14;130;29062021165622
15;135;29062021165622
16;138;29062021165622
17;143;29062021165622
18;161;29062021165622
19;192;29062021165622
20;271;29062021165622
21;477;29062021165622
22;974;29062021165622
23;1023;29062021165622
24;1023;29062021165622
25;1023;29062021165622
26;1023;29062021165622
27;1023;29062021165622
28;1023;29062021165622
29;1023;29062021165622
30;1023;29062021165622
31;1023;29062021165622
32;1023;29062021165622
33;1023;29062021165622
34;1023;29062021165622
35;867;29062021165622
36;674;29062021165622
37;537;29062021165622
38;439;29062021165622
39;372;29062021165622
40;320;29062021165622
41;283;29062021165622
42;266;29062021165622
43;249;29062021165622
44;240;29062021165622
45;233;29062021165622
46;227;29062021165622
47;225;29062021165622
48;226;29062021165622
49;225;29062021165622
50;227;29062021165622
51;227;29062021165622
52;226;29062021165622
53;233;29062021165622
54;235;29062021165622
55;238;29062021165622
56;244;29062021165622
57;247;29062021165622
58;252;29062021165622
59;257;29062021165622
60;264;29062021165622
61;267;29062021165622
62;269;29062021165622
63;273;29062021165622
64;277;29062021165622
65;278;29062021165622
66;282;29062021165622
67;280;29062021165622
68;279;29062021165622
69;278;29062021165622
70;271;29062021165622
71;272;29062021165622
72;267;29062021165622
73;257;29062021165622
74;256;29062021165622
75;248;29062021165622
76;246;29062021165622
77;241;29062021165622
78;232;29062021165622
79;229;29062021165622
80;224;29062021165622
81;216;29062021165622
82;215;29062021165622
83;209;29062021165622
84;205;29062021165622
85;205;29062021165622
86;203;29062021165622
87;202;29062021165622
88;202;29062021165622
89;197;29062021165622
90;200;29062021165622
91;194;29062021165622
92;190;29062021165622
93;188;29062021165622
94;184;29062021165622
95;180;29062021165622
96;180;29062021165622
97;176;29062021165622
98;175;29062021165622
99;172;29062021165622
100;167;29062021165622
101;170;29062021165622
102;166;29062021165622
103;164;29062021165622
104;163;29062021165622
105;160;29062021165622
106;162;29062021165622
107;157;29062021165622
108;156;29062021165622
109;156;29062021165622
110;152;29062021165622
111;152;29062021165622
112;152;29062021165622
113;148;29062021165622
114;148;29062021165622
115;149;29062021165622
116;145;29062021165622
117;148;29062021165622
118;144;29062021165622
119;144;29062021165622
120;143;29062021165622
121;141;29062021165622
122;141;29062021165622
123;140;29062021165622
124;139;29062021165622
125;140;29062021165622
126;137;29062021165622
127;137;29062021165622
128;138;29062021165622
129;135;29062021165622
130;137;29062021165622
131;135;29062021165622
132;133;29062021165622
133;136;29062021165622
134;131;29062021165622
135;130;29062021165622
136;133;29062021165622
137;131;29062021165622
138;131;29062021165622
139;130;29062021165622
140;128;29062021165622
141;131;29062021165622
142;128;29062021165622
143;128;29062021165622
144;130;29062021165622
145;126;29062021165622
146;130;29062021165622
147;127;29062021165622
148;126;29062021165622
149;126;29062021165622
150;126;29062021165622
151;125;29062021165622
152;126;29062021165622
153;124;29062021165622
154;126;29062021165622
155;124;29062021165622
156;124;29062021165622
157;124;29062021165622
158;123;29062021165622
159;123;29062021165622
160;125;29062021165622
161;122;29062021165622
162;125;29062021165622
163;124;29062021165622
164;123;29062021165622
165;125;29062021165622
166;123;29062021165622
167;123;29062021165622
168;124;29062021165622
169;121;29062021165622
170;124;29062021165622
171;123;29062021165622
172;122;29062021165622
173;123;29062021165622
174;122;29062021165622
175;121;29062021165622
176;122;29062021165622
177;121;29062021165622
178;123;29062021165622
179;123;29062021165622
180;122;29062021165622
181;122;29062021165622
182;122;29062021165622
183;121;29062021165622
184;122;29062021165622
185;120;29062021165622
186;123;29062021165622
187;122;29062021165622
188;120;29062021165622
189;122;29062021165622
190;121;29062021165622
191;121;29062021165622
192;123;29062021165622
193;120;29062021165622
194;121;29062021165622
195;121;29062021165622
196;120;29062021165622
197;122;29062021165622
198;122;29062021165622
199;121;29062021165622
200;0;29062021165622
0;0;29062021165622
1;143;29062021165622
2;125;29062021165622
3;122;29062021165622
4;124;29062021165622
5;125;29062021165622
6;123;29062021165622
7;125;29062021165622
8;126;29062021165622
9;125;29062021165622
10;128;29062021165622
11;126;29062021165622
12;127;29062021165622
13;131;29062021165622
14;130;29062021165622
15;134;29062021165622
16;139;29062021165622
17;142;29062021165622
18;161;29062021165622
19;192;29062021165622
20;268;29062021165622
21;473;29062021165622
22;966;29062021165622
23;1023;29062021165622
24;1023;29062021165622
25;1023;29062021165622
26;1023;29062021165622
27;1023;29062021165622
28;1023;29062021165622
29;1023;29062021165622
30;1023;29062021165622
31;1023;29062021165622
32;1023;29062021165622
33;1023;29062021165622
34;1023;29062021165622
35;886;29062021165622
36;687;29062021165622
37;549;29062021165622
38;448;29062021165622
39;374;29062021165622
40;321;29062021165622
41;287;29062021165622
42;267;29062021165622
43;251;29062021165622
44;240;29062021165622
45;233;29062021165622
46;226;29062021165622
47;227;29062021165622
48;228;29062021165622
49;226;29062021165622
50;228;29062021165622
51;228;29062021165622
52;228;29062021165622
53;233;29062021165622
54;236;29062021165622
55;240;29062021165622
56;241;29062021165622
57;246;29062021165622
58;254;29062021165622
59;255;29062021165622
60;262;29062021165622
61;268;29062021165622
62;267;29062021165622
63;275;29062021165622
64;280;29062021165622
65;278;29062021165622
66;282;29062021165622
67;279;29062021165622
68;280;29062021165622
69;279;29062021165622
70;274;29062021165622
71;271;29062021165622
72;269;29062021165622
73;260;29062021165622
74;258;29062021165622
75;249;29062021165622
76;245;29062021165622
77;241;29062021165622
78;235;29062021165622
79;229;29062021165622
80;223;29062021165622
81;217;29062021165622
82;215;29062021165622
83;209;29062021165622
84;208;29062021165622
85;208;29062021165622
86;201;29062021165622
87;202;29062021165622
88;202;29062021165622
89;199;29062021165622
90;198;29062021165622
91;194;29062021165622
92;189;29062021165622
93;188;29062021165622
94;186;29062021165622
95;181;29062021165622
96;180;29062021165622
97;176;29062021165622
98;175;29062021165622
99;174;29062021165622
100;169;29062021165622
101;168;29062021165622
102;164;29062021165622
103;164;29062021165622
104;163;29062021165622
105;159;29062021165622
106;162;29062021165622
107;156;29062021165622
108;156;29062021165622
109;155;29062021165622
110;152;29062021165622
111;151;29062021165622
112;152;29062021165622
113;147;29062021165622
114;149;29062021165622
115;148;29062021165622
116;146;29062021165622
117;146;29062021165622
118;144;29062021165622
119;143;29062021165622
120;142;29062021165622
121;141;29062021165622
122;140;29062021165622
123;140;29062021165622
124;137;29062021165622
125;139;29062021165622
126;136;29062021165622
127;135;29062021165622
128;136;29062021165622
129;134;29062021165622
130;136;29062021165622
131;134;29062021165622
132;131;29062021165622
133;136;29062021165622
134;132;29062021165622
135;130;29062021165622
136;132;29062021165622
137;129;29062021165622
138;131;29062021165622
139;129;29062021165622
140;128;29062021165622
141;130;29062021165622
142;127;29062021165622
143;126;29062021165622
144;129;29062021165622
145;125;29062021165622
146;128;29062021165622
147;127;29062021165622
148;124;29062021165622
149;125;29062021165622
150;125;29062021165622
151;125;29062021165622
152;125;29062021165622
153;124;29062021165622
154;126;29062021165622
155;124;29062021165622
156;123;29062021165622
157;125;29062021165622
158;123;29062021165622
159;122;29062021165622
160;125;29062021165622
161;123;29062021165622
162;124;29062021165622
163;123;29062021165622
164;123;29062021165622
165;124;29062021165622
166;122;29062021165622
167;123;29062021165622
168;124;29062021165622
169;120;29062021165622
170;122;29062021165622
171;122;29062021165622
172;120;29062021165622
173;122;29062021165622
174;122;29062021165622
175;120;29062021165622
176;123;29062021165622
177;121;29062021165622
178;123;29062021165622
179;121;29062021165622
180;120;29062021165622
181;122;29062021165622
182;122;29062021165622
183;121;29062021165622
184;122;29062021165622
185;119;29062021165622
186;122;29062021165622
187;122;29062021165622
188;120;29062021165622
189;121;29062021165622
190;120;29062021165622
191;120;29062021165622
192;124;29062021165622
193;120;29062021165622
194;121;29062021165622
195;121;29062021165622
196;121;29062021165622
197;121;29062021165622
198;121;29062021165622
199;119;29062021165622
200;0;29062021165622
0;0;29062021165623
1;143;29062021165623
2;124;29062021165623
3;123;29062021165623
4;124;29062021165623
5;125;29062021165623
6;124;29062021165623
7;125;29062021165623
8;125;29062021165623
9;124;29062021165623
10;127;29062021165623
11;126;29062021165623
12;127;29062021165623
13;131;29062021165623
14;130;29062021165623
15;136;29062021165623
16;138;29062021165623
17;144;29062021165623
18;162;29062021165623
19;193;29062021165623
20;269;29062021165623
21;471;29062021165623
22;973;29062021165623
23;1023;29062021165623
24;1023;29062021165623
25;1023;29062021165623
26;1023;29062021165623
27;1023;29062021165623
28;1023;29062021165623
29;1023;29062021165623
30;1023;29062021165623
31;1023;29062021165623
32;1023;29062021165623
33;1023;29062021165623
34;1023;29062021165623
35;878;29062021165623
36;678;29062021165623
37;544;29062021165623
38;443;29062021165623
39;371;29062021165623
40;321;29062021165623
41;285;29062021165623
42;266;29062021165623
43;249;29062021165623
44;238;29062021165623
45;232;29062021165623
46;227;29062021165623
47;226;29062021165623
48;224;29062021165623
49;224;29062021165623
50;228;29062021165623
51;227;29062021165623
52;228;29062021165623
53;234;29062021165623
54;233;29062021165623
55;236;29062021165623
56;243;29062021165623
57;245;29062021165623
58;254;29062021165623
59;256;29062021165623
60;259;29062021165623
61;266;29062021165623
62;268;29062021165623
63;276;29062021165623
64;279;29062021165623
65;275;29062021165623
66;280;29062021165623
67;279;29062021165623
68;280;29062021165623
69;279;29062021165623
70;270;29062021165623
71;268;29062021165623
72;270;29062021165623
73;258;29062021165623
74;256;29062021165623
75;248;29062021165623
76;246;29062021165623
77;240;29062021165623
78;234;29062021165623
79;229;29062021165623
80;226;29062021165623
81;216;29062021165623
82;215;29062021165623
83;210;29062021165623
84;208;29062021165623
85;208;29062021165623
86;202;29062021165623
87;201;29062021165623
88;201;29062021165623
89;196;29062021165623
90;197;29062021165623
91;193;29062021165623
92;190;29062021165623
93;188;29062021165623
94;184;29062021165623
95;181;29062021165623
96;179;29062021165623
97;176;29062021165623
98;173;29062021165623
99;171;29062021165623
100;168;29062021165623
101;168;29062021165623
102;163;29062021165623
103;163;29062021165623
104;162;29062021165623
105;158;29062021165623
106;161;29062021165623
107;156;29062021165623
108;155;29062021165623
109;154;29062021165623
110;151;29062021165623
111;149;29062021165623
112;153;29062021165623
113;147;29062021165623
114;148;29062021165623
115;147;29062021165623
116;144;29062021165623
117;148;29062021165623
118;144;29062021165623
119;143;29062021165623
120;141;29062021165623
121;140;29062021165623
122;140;29062021165623
123;140;29062021165623
124;138;29062021165623
125;139;29062021165623
126;136;29062021165623
127;135;29062021165623
128;137;29062021165623
129;135;29062021165623
130;134;29062021165623
131;134;29062021165623
132;132;29062021165623
133;135;29062021165623
134;130;29062021165623
135;131;29062021165623
136;133;29062021165623
137;129;29062021165623
138;130;29062021165623
139;128;29062021165623
140;127;29062021165623
141;129;29062021165623
142;127;29062021165623
143;127;29062021165623
144;128;29062021165623
145;125;29062021165623
146;128;29062021165623
147;125;29062021165623
148;124;29062021165623
149;125;29062021165623
150;124;29062021165623
151;125;29062021165623
152;125;29062021165623
153;124;29062021165623
154;125;29062021165623
155;124;29062021165623
156;123;29062021165623
157;123;29062021165623
158;123;29062021165623
159;123;29062021165623
160;124;29062021165623
161;123;29062021165623
162;124;29062021165623
163;123;29062021165623
164;122;29062021165623
165;124;29062021165623
166;122;29062021165623
167;122;29062021165623
168;124;29062021165623
169;120;29062021165623
170;123;29062021165623
171;122;29062021165623
172;121;29062021165623
173;122;29062021165623
174;121;29062021165623
175;121;29062021165623
176;121;29062021165623
177;120;29062021165623
178;123;29062021165623
179;121;29062021165623
180;121;29062021165623
181;122;29062021165623
182;121;29062021165623
183;120;29062021165623
184;122;29062021165623
185;119;29062021165623
186;123;29062021165623
187;120;29062021165623
188;119;29062021165623
189;121;29062021165623
190;121;29062021165623
191;120;29062021165623
192;123;29062021165623
193;120;29062021165623
194;121;29062021165623
195;120;29062021165623
196;119;29062021165623
197;122;29062021165623
198;121;29062021165623
199;121;29062021165623
200;0;29062021165623
0;0;29062021165623
1;143;29062021165623
2;125;29062021165623
3;124;29062021165623
4;124;29062021165623
5;126;29062021165623
6;123;29062021165623
7;125;29062021165623
8;126;29062021165623
9;125;29062021165623
10;127;29062021165623
11;126;29062021165623
12;126;29062021165623
13;130;29062021165623
14;131;29062021165623
15;135;29062021165623
16;138;29062021165623
17;144;29062021165623
18;160;29062021165623
19;192;29062021165623
20;268;29062021165623
21;468;29062021165623
22;957;29062021165623
23;1023;29062021165623
24;1023;29062021165623
25;1023;29062021165623
26;1023;29062021165623
27;1023;29062021165623
28;1023;29062021165623
29;1023;29062021165623
30;1023;29062021165623
31;1023;29062021165623
32;1023;29062021165623
33;1023;29062021165623
34;1023;29062021165623
35;890;29062021165623
36;691;29062021165623
37;548;29062021165623
38;448;29062021165623
39;378;29062021165623
40;324;29062021165623
41;286;29062021165623
42;267;29062021165623
43;248;29062021165623
44;239;29062021165623
45;234;29062021165623
46;230;29062021165623
47;225;29062021165623
48;226;29062021165623
49;222;29062021165623
50;228;29062021165623
51;226;29062021165623
52;227;29062021165623
53;233;29062021165623
54;235;29062021165623
55;239;29062021165623
56;241;29062021165623
57;244;29062021165623
58;253;29062021165623
59;254;29062021165623
60;261;29062021165623
61;267;29062021165623
62;268;29062021165623
63;275;29062021165623
64;279;29062021165623
65;277;29062021165623
66;283;29062021165623
67;281;29062021165623
68;279;29062021165623
69;280;29062021165623
70;273;29062021165623
71;269;29062021165623
72;268;29062021165623
73;258;29062021165623
74;259;29062021165623
75;247;29062021165623
76;246;29062021165623
77;242;29062021165623
78;233;29062021165623
79;230;29062021165623
80;223;29062021165623
81;215;29062021165623
82;216;29062021165623
83;210;29062021165623
84;209;29062021165623
85;206;29062021165623
86;204;29062021165623
87;202;29062021165623
88;203;29062021165623
89;197;29062021165623
90;196;29062021165623
91;194;29062021165623
92;189;29062021165623
93;189;29062021165623
94;185;29062021165623
95;180;29062021165623
96;181;29062021165623
97;176;29062021165623
98;174;29062021165623
99;171;29062021165623
100;167;29062021165623
101;169;29062021165623
102;165;29062021165623
103;163;29062021165623
104;165;29062021165623
105;159;29062021165623
106;161;29062021165623
107;157;29062021165623
108;154;29062021165623
109;156;29062021165623
110;150;29062021165623
111;149;29062021165623
112;152;29062021165623
113;146;29062021165623
114;148;29062021165623
115;148;29062021165623
116;144;29062021165623
117;147;29062021165623
118;145;29062021165623
119;144;29062021165623
120;141;29062021165623
121;140;29062021165623
122;141;29062021165623
123;139;29062021165623
124;137;29062021165623
125;138;29062021165623
126;135;29062021165623
127;136;29062021165623
128;136;29062021165623
129;134;29062021165623
130;134;29062021165623
131;135;29062021165623
132;132;29062021165623
133;136;29062021165623
134;132;29062021165623
135;131;29062021165623
136;132;29062021165623
137;128;29062021165623
138;130;29062021165623
139;129;29062021165623
140;128;29062021165623
141;128;29062021165623
142;126;29062021165623
143;127;29062021165623
144;129;29062021165623
145;124;29062021165623
146;128;29062021165623
147;127;29062021165623
148;124;29062021165623
149;125;29062021165623
150;125;29062021165623
151;125;29062021165623
152;125;29062021165623
153;124;29062021165623
154;125;29062021165623
155;123;29062021165623
156;123;29062021165623
157;123;29062021165623
158;121;29062021165623
159;123;29062021165623
160;124;29062021165623
161;122;29062021165623
162;123;29062021165623
163;124;29062021165623
164;121;29062021165623
165;124;29062021165623
166;122;29062021165623
167;122;29062021165623
168;123;29062021165623
169;120;29062021165623
170;123;29062021165623
171;123;29062021165623
172;121;29062021165623
173;122;29062021165623
174;121;29062021165623
175;120;29062021165623
176;123;29062021165623
177;119;29062021165623
178;122;29062021165623
179;121;29062021165623
180;121;29062021165623
181;122;29062021165623
182;122;29062021165623
183;121;29062021165623
184;122;29062021165623
185;119;29062021165623
186;121;29062021165623
187;121;29062021165623
188;119;29062021165623
189;120;29062021165623
190;120;29062021165623
191;120;29062021165623
192;124;29062021165623
193;120;29062021165623
194;121;29062021165623
195;121;29062021165623
196;120;29062021165623
197;121;29062021165623
198;120;29062021165623
199;120;29062021165623
200;0;29062021165623
0;0;29062021165623
1;143;29062021165623
2;124;29062021165623
3;124;29062021165623
4;124;29062021165623
5;125;29062021165623
6;123;29062021165623
7;125;29062021165623
8;127;29062021165623
9;125;29062021165623
10;128;29062021165623
11;126;29062021165623
12;127;29062021165623
13;132;29062021165623
14;130;29062021165623
15;135;29062021165623
16;137;29062021165623
17;143;29062021165623
18;161;29062021165623
19;191;29062021165623
20;267;29062021165623
21;473;29062021165623
22;965;29062021165623
23;1023;29062021165623
24;1023;29062021165623
25;1023;29062021165623
26;1023;29062021165623
27;1023;29062021165623
28;1023;29062021165623
29;1023;29062021165623
30;1023;29062021165623
31;1023;29062021165623
32;1023;29062021165623
33;1023;29062021165623
34;1023;29062021165623
35;884;29062021165623
36;682;29062021165623
37;545;29062021165623
38;444;29062021165623
39;371;29062021165623
40;325;29062021165623
41;287;29062021165623
42;268;29062021165623
43;251;29062021165623
44;239;29062021165623
45;233;29062021165623
46;227;29062021165623
47;223;29062021165623
48;226;29062021165623
49;223;29062021165623
50;227;29062021165623
51;227;29062021165623
52;229;29062021165623
53;232;29062021165623
54;235;29062021165623
55;238;29062021165623
56;243;29062021165623
57;246;29062021165623
58;255;29062021165623
59;256;29062021165623
60;260;29062021165623
61;267;29062021165623
62;269;29062021165623
63;273;29062021165623
64;278;29062021165623
65;276;29062021165623
66;280;29062021165623
67;280;29062021165623
68;276;29062021165623
69;277;29062021165623
70;271;29062021165623
71;268;29062021165623
72;270;29062021165623
73;260;29062021165623
74;258;29062021165623
75;249;29062021165623
76;244;29062021165623
77;241;29062021165623
78;234;29062021165623
79;229;29062021165623
80;225;29062021165623
81;216;29062021165623
82;216;29062021165623
83;208;29062021165623
84;208;29062021165623
85;204;29062021165623
86;202;29062021165623
87;201;29062021165623
88;206;29062021165623
89;197;29062021165623
90;198;29062021165623
91;194;29062021165623
92;189;29062021165623
93;189;29062021165623
94;183;29062021165623
95;181;29062021165623
96;181;29062021165623
97;175;29062021165623
98;174;29062021165623
99;171;29062021165623
100;168;29062021165623
101;170;29062021165623
102;166;29062021165623
103;162;29062021165623
104;162;29062021165623
105;158;29062021165623
106;159;29062021165623
107;158;29062021165623
108;154;29062021165623
109;156;29062021165623
110;152;29062021165623
111;151;29062021165623
112;151;29062021165623
113;147;29062021165623
114;149;29062021165623
115;147;29062021165623
116;145;29062021165623
117;148;29062021165623
118;143;29062021165623
119;145;29062021165623
120;141;29062021165623
121;139;29062021165623
122;141;29062021165623
123;139;29062021165623
124;138;29062021165623
125;139;29062021165623
126;136;29062021165623
127;136;29062021165623
128;138;29062021165623
129;133;29062021165623
130;135;29062021165623
131;135;29062021165623
132;133;29062021165623
133;135;29062021165623
134;132;29062021165623
135;130;29062021165623
136;132;29062021165623
137;130;29062021165623
138;131;29062021165623
139;129;29062021165623
140;128;29062021165623
141;130;29062021165623
142;127;29062021165623
143;126;29062021165623
144;128;29062021165623
145;126;29062021165623
146;129;29062021165623
147;126;29062021165623
148;125;29062021165623
149;126;29062021165623
150;125;29062021165623
151;126;29062021165623
152;126;29062021165623
153;123;29062021165623
154;125;29062021165623
155;124;29062021165623
156;124;29062021165623
157;125;29062021165623
158;124;29062021165623
159;123;29062021165623
160;124;29062021165623
161;123;29062021165623
162;125;29062021165623
163;124;29062021165623
164;124;29062021165623
165;124;29062021165623
166;123;29062021165623
167;123;29062021165623
168;124;29062021165623
169;121;29062021165623
170;123;29062021165623
171;122;29062021165623
172;121;29062021165623
173;123;29062021165623
174;122;29062021165623
175;121;29062021165623
176;122;29062021165623
177;121;29062021165623
178;122;29062021165623
179;121;29062021165623
180;121;29062021165623
181;122;29062021165623
182;122;29062021165623
183;120;29062021165623
184;122;29062021165623
185;119;29062021165623
186;123;29062021165623
187;122;29062021165623
188;120;29062021165623
189;121;29062021165623
190;120;29062021165623
191;120;29062021165623
192;123;29062021165623
193;121;29062021165623
194;121;29062021165623
195;121;29062021165623
196;120;29062021165623
197;122;29062021165623
198;121;29062021165623
199;119;29062021165623
200;0;29062021165623
0;0;29062021165624
1;143;29062021165624
2;124;29062021165624
3;123;29062021165624
4;122;29062021165624
5;125;29062021165624
6;123;29062021165624
7;125;29062021165624
8;126;29062021165624
9;125;29062021165624
10;128;29062021165624
11;126;29062021165624
12;127;29062021165624
13;131;29062021165624
14;130;29062021165624
15;133;29062021165624
16;139;29062021165624
17;144;29062021165624
18;161;29062021165624
19;193;29062021165624
20;268;29062021165624
21;468;29062021165624
22;957;29062021165624
23;1023;29062021165624
24;1023;29062021165624
25;1023;29062021165624
26;1023;29062021165624
27;1023;29062021165624
28;1023;29062021165624
29;1023;29062021165624
30;1023;29062021165624
31;1023;29062021165624
32;1023;29062021165624
33;1023;29062021165624
34;1023;29062021165624
35;897;29062021165624
36;693;29062021165624
37;550;29062021165624
38;449;29062021165624
39;378;29062021165624
40;325;29062021165624
41;289;29062021165624
42;268;29062021165624
43;252;29062021165624
44;239;29062021165624
45;236;29062021165624
46;227;29062021165624
47;226;29062021165624
48;227;29062021165624
49;223;29062021165624
50;230;29062021165624
51;228;29062021165624
52;228;29062021165624
53;232;29062021165624
54;232;29062021165624
55;239;29062021165624
56;242;29062021165624
57;245;29062021165624
58;254;29062021165624
59;254;29062021165624
60;258;29062021165624
61;267;29062021165624
62;268;29062021165624
63;276;29062021165624
64;281;29062021165624
65;277;29062021165624
66;282;29062021165624
67;284;29062021165624
68;279;29062021165624
69;280;29062021165624
70;272;29062021165624
71;272;29062021165624
72;270;29062021165624
73;261;29062021165624
74;259;29062021165624
75;249;29062021165624
76;244;29062021165624
77;239;29062021165624
78;233;29062021165624
79;228;29062021165624
80;224;29062021165624
81;216;29062021165624
82;215;29062021165624
83;208;29062021165624
84;209;29062021165624
85;205;29062021165624
86;204;29062021165624
87;204;29062021165624
88;201;29062021165624
89;194;29062021165624
90;197;29062021165624
91;195;29062021165624
92;189;29062021165624
93;190;29062021165624
94;184;29062021165624
95;179;29062021165624
96;179;29062021165624
97;175;29062021165624
98;173;29062021165624
99;172;29062021165624
100;168;29062021165624
101;169;29062021165624
102;167;29062021165624
103;163;29062021165624
104;161;29062021165624
105;158;29062021165624
106;161;29062021165624
107;155;29062021165624
108;155;29062021165624
109;156;29062021165624
110;151;29062021165624
111;152;29062021165624
112;152;29062021165624
113;148;29062021165624
114;148;29062021165624
115;146;29062021165624
116;143;29062021165624
117;147;29062021165624
118;142;29062021165624
119;143;29062021165624
120;142;29062021165624
121;140;29062021165624
122;140;29062021165624
123;140;29062021165624
124;137;29062021165624
125;137;29062021165624
126;136;29062021165624
127;135;29062021165624
128;137;29062021165624
129;134;29062021165624
130;135;29062021165624
131;135;29062021165624
132;131;29062021165624
133;134;29062021165624
134;130;29062021165624
135;130;29062021165624
136;132;29062021165624
137;128;29062021165624
138;130;29062021165624
139;129;29062021165624
140;126;29062021165624
141;128;29062021165624
142;127;29062021165624
143;127;29062021165624
144;128;29062021165624
145;125;29062021165624
146;127;29062021165624
147;127;29062021165624
148;124;29062021165624
149;125;29062021165624
150;124;29062021165624
151;125;29062021165624
152;126;29062021165624
153;124;29062021165624
154;125;29062021165624
155;123;29062021165624
156;122;29062021165624
157;124;29062021165624
158;122;29062021165624
159;122;29062021165624
160;124;29062021165624
161;123;29062021165624
162;124;29062021165624
163;122;29062021165624
164;121;29062021165624
165;124;29062021165624
166;122;29062021165624
167;122;29062021165624
168;122;29062021165624
169;121;29062021165624
170;123;29062021165624
171;122;29062021165624
172;121;29062021165624
173;122;29062021165624
174;121;29062021165624
175;119;29062021165624
176;122;29062021165624
177;120;29062021165624
178;122;29062021165624
179;121;29062021165624
180;120;29062021165624
181;122;29062021165624
182;121;29062021165624
183;120;29062021165624
184;121;29062021165624
185;119;29062021165624
186;122;29062021165624
187;120;29062021165624
188;119;29062021165624
189;121;29062021165624
190;119;29062021165624
191;120;29062021165624
192;122;29062021165624
193;120;29062021165624
194;120;29062021165624
195;121;29062021165624
196;119;29062021165624
197;121;29062021165624
198;121;29062021165624
199;120;29062021165624
200;0;29062021165624
0;0;29062021165624
1;143;29062021165624
2;125;29062021165624
3;124;29062021165624
4;125;29062021165624
5;125;29062021165624
6;124;29062021165624
7;127;29062021165624
8;127;29062021165624
9;124;29062021165624
10;129;29062021165624
11;127;29062021165624
12;127;29062021165624
13;130;29062021165624
14;130;29062021165624
15;134;29062021165624
16;138;29062021165624
17;145;29062021165624
18;162;29062021165624
19;192;29062021165624
20;265;29062021165624
21;471;29062021165624
22;960;29062021165624
23;1023;29062021165624
24;1023;29062021165624
25;1023;29062021165624
26;1023;29062021165624
27;1023;29062021165624
28;1023;29062021165624
29;1023;29062021165624
30;1023;29062021165624
31;1023;29062021165624
32;1023;29062021165624
33;1023;29062021165624
34;1023;29062021165624
35;885;29062021165624
36;688;29062021165624
37;544;29062021165624
38;443;29062021165624
39;376;29062021165624
40;322;29062021165624
41;287;29062021165624
42;270;29062021165624
43;248;29062021165624
44;241;29062021165624
45;234;29062021165624
46;228;29062021165624
47;228;29062021165624
48;228;29062021165624
49;223;29062021165624
50;229;29062021165624
51;228;29062021165624
52;228;29062021165624
53;234;29062021165624
54;235;29062021165624
55;236;29062021165624
56;241;29062021165624
57;244;29062021165624
58;253;29062021165624
59;255;29062021165624
60;260;29062021165624
61;270;29062021165624
62;269;29062021165624
63;274;29062021165624
64;278;29062021165624
65;278;29062021165624
66;282;29062021165624
67;283;29062021165624
68;280;29062021165624
69;280;29062021165624
70;272;29062021165624
71;268;29062021165624
72;268;29062021165624
73;260;29062021165624
74;257;29062021165624
75;249;29062021165624
76;247;29062021165624
77;241;29062021165624
78;234;29062021165624
79;231;29062021165624
80;223;29062021165624
81;217;29062021165624
82;216;29062021165624
83;211;29062021165624
84;206;29062021165624
85;208;29062021165624
86;201;29062021165624
87;204;29062021165624
88;201;29062021165624
89;195;29062021165624
90;197;29062021165624
91;197;29062021165624
92;190;29062021165624
93;188;29062021165624
94;185;29062021165624
95;181;29062021165624
96;181;29062021165624
97;177;29062021165624
98;173;29062021165624
99;172;29062021165624
100;168;29062021165624
101;170;29062021165624
102;164;29062021165624
103;164;29062021165624
104;163;29062021165624
105;160;29062021165624
106;161;29062021165624
107;157;29062021165624
108;154;29062021165624
109;154;29062021165624
110;151;29062021165624
111;152;29062021165624
112;152;29062021165624
113;147;29062021165624
114;148;29062021165624
115;147;29062021165624
116;146;29062021165624
117;147;29062021165624
118;143;29062021165624
119;145;29062021165624
120;142;29062021165624
121;141;29062021165624
122;141;29062021165624
123;139;29062021165624
124;138;29062021165624
125;138;29062021165624
126;137;29062021165624
127;137;29062021165624
128;137;29062021165624
129;135;29062021165624
130;134;29062021165624
131;136;29062021165624
132;132;29062021165624
133;135;29062021165624
134;131;29062021165624
135;131;29062021165624
136;132;29062021165624
137;129;29062021165624
138;130;29062021165624
139;130;29062021165624
140;128;29062021165624
141;130;29062021165624
142;128;29062021165624
143;128;29062021165624
144;127;29062021165624
145;125;29062021165624
146;128;29062021165624
147;127;29062021165624
148;125;29062021165624
149;125;29062021165624
150;125;29062021165624
151;125;29062021165624
152;126;29062021165624
153;124;29062021165624
154;125;29062021165624
155;123;29062021165624
156;123;29062021165624
157;125;29062021165624
158;124;29062021165624
159;124;29062021165624
160;124;29062021165624
161;122;29062021165624
162;124;29062021165624
163;123;29062021165624
164;122;29062021165624
165;125;29062021165624
166;123;29062021165624
167;123;29062021165624
168;123;29062021165624
169;121;29062021165624
170;124;29062021165624
171;122;29062021165624
172;121;29062021165624
173;122;29062021165624
174;121;29062021165624
175;121;29062021165624
176;122;29062021165624
177;120;29062021165624
178;123;29062021165624
179;122;29062021165624
180;121;29062021165624
181;122;29062021165624
182;121;29062021165624
183;121;29062021165624
184;122;29062021165624
185;118;29062021165624
186;122;29062021165624
187;122;29062021165624
188;119;29062021165624
189;121;29062021165624
190;120;29062021165624
191;120;29062021165624
192;123;29062021165624
193;121;29062021165624
194;120;29062021165624
195;121;29062021165624
196;120;29062021165624
197;122;29062021165624
198;120;29062021165624
199;120;29062021165624
200;0;29062021165624
0;0;29062021165624
1;143;29062021165624
2;125;29062021165624
3;122;29062021165624
4;123;29062021165624
5;125;29062021165624
6;123;29062021165624
7;125;29062021165624
8;125;29062021165624
9;124;29062021165624
10;126;29062021165624
11;126;29062021165624
12;126;29062021165624
13;131;29062021165624
14;130;29062021165624
15;135;29062021165624
16;138;29062021165624
17;142;29062021165624
18;162;29062021165624
19;192;29062021165624
20;267;29062021165624
21;466;29062021165624
22;953;29062021165624
23;1023;29062021165624
24;1023;29062021165624
25;1023;29062021165624
26;1023;29062021165624
27;1023;29062021165624
28;1023;29062021165624
29;1023;29062021165624
30;1023;29062021165624
31;1023;29062021165624
32;1023;29062021165624
33;1023;29062021165624
34;1023;29062021165624
35;896;29062021165624
36;697;29062021165624
37;559;29062021165624
38;448;29062021165624
39;379;29062021165624
40;325;29062021165624
41;291;29062021165624
42;269;29062021165624
43;252;29062021165624
44;241;29062021165624
45;232;29062021165624
46;230;29062021165624
47;227;29062021165624
48;229;29062021165624
49;224;29062021165624
50;225;29062021165624
51;226;29062021165624
52;226;29062021165624
53;233;29062021165624
54;235;29062021165624
55;238;29062021165624
56;242;29062021165624
57;246;29062021165624
58;253;29062021165624
59;257;29062021165624
60;259;29062021165624
61;267;29062021165624
62;269;29062021165624
63;274;29062021165624
64;279;29062021165624
65;278;29062021165624
66;283;29062021165624
67;283;29062021165624
68;278;29062021165624
69;275;29062021165624
70;272;29062021165624
71;270;29062021165624
72;266;29062021165624
73;259;29062021165624
74;259;29062021165624
75;250;29062021165624
76;248;29062021165624
77;241;29062021165624
78;233;29062021165624
79;227;29062021165624
80;223;29062021165624
81;215;29062021165624
82;217;29062021165624
83;209;29062021165624
84;208;29062021165624
85;204;29062021165624
86;201;29062021165624
87;203;29062021165624
88;203;29062021165624
89;195;29062021165624
90;197;29062021165624
91;194;29062021165624
92;190;29062021165624
93;189;29062021165624
94;184;29062021165624
95;180;29062021165624
96;180;29062021165624
97;175;29062021165624
98;175;29062021165624
99;171;29062021165624
100;167;29062021165624
101;170;29062021165624
102;165;29062021165624
103;162;29062021165624
104;162;29062021165624
105;159;29062021165624
106;161;29062021165624
107;157;29062021165624
108;157;29062021165624
109;154;29062021165624
110;151;29062021165624
111;150;29062021165624
112;152;29062021165624
113;146;29062021165624
114;147;29062021165624
115;148;29062021165624
116;146;29062021165624
117;148;29062021165624
118;142;29062021165624
119;143;29062021165624
120;141;29062021165624
121;139;29062021165624
122;141;29062021165624
123;140;29062021165624
124;136;29062021165624
125;140;29062021165624
126;136;29062021165624
127;136;29062021165624
128;137;29062021165624
129;133;29062021165624
130;135;29062021165624
131;134;29062021165624
132;132;29062021165624
133;135;29062021165624
134;131;29062021165624
135;130;29062021165624
136;132;29062021165624
137;129;29062021165624
138;130;29062021165624
139;129;29062021165624
140;128;29062021165624
141;129;29062021165624
142;126;29062021165624
143;127;29062021165624
144;128;29062021165624
145;125;29062021165624
146;128;29062021165624
147;126;29062021165624
148;125;29062021165624
149;125;29062021165624
150;124;29062021165624
151;125;29062021165624
152;125;29062021165624
153;123;29062021165624
154;125;29062021165624
155;122;29062021165624
156;124;29062021165624
157;123;29062021165624
158;122;29062021165624
159;123;29062021165624
160;124;29062021165624
161;122;29062021165624
162;124;29062021165624
163;123;29062021165624
164;122;29062021165624
165;124;29062021165624
166;122;29062021165624
167;122;29062021165624
168;123;29062021165624
169;120;29062021165624
170;122;29062021165624
171;121;29062021165624
172;121;29062021165624
173;122;29062021165624
174;120;29062021165624
175;120;29062021165624
176;123;29062021165624
177;120;29062021165624
178;122;29062021165624
179;121;29062021165624
180;120;29062021165624
181;122;29062021165624
182;121;29062021165624
183;120;29062021165624
184;121;29062021165624
185;119;29062021165624
186;122;29062021165624
187;121;29062021165624
188;118;29062021165624
189;121;29062021165624
190;119;29062021165624
191;119;29062021165624
192;122;29062021165624
193;120;29062021165624
194;120;29062021165624
195;121;29062021165624
196;119;29062021165624
197;121;29062021165624
198;120;29062021165624
199;119;29062021165624
200;0;29062021165624
0;0;29062021165625
1;143;29062021165625
2;124;29062021165625
3;124;29062021165625
4;125;29062021165625
5;126;29062021165625
6;124;29062021165625
7;125;29062021165625
8;127;29062021165625
9;124;29062021165625
10;128;29062021165625
11;126;29062021165625
12;128;29062021165625
13;131;29062021165625
14;131;29062021165625
15;134;29062021165625
16;138;29062021165625
17;144;29062021165625
18;161;29062021165625
19;193;29062021165625
20;268;29062021165625
21;471;29062021165625
22;956;29062021165625
23;1023;29062021165625
24;1023;29062021165625
25;1023;29062021165625
26;1023;29062021165625
27;1023;29062021165625
28;1023;29062021165625
29;1023;29062021165625
30;1023;29062021165625
31;1023;29062021165625
32;1023;29062021165625
33;1023;29062021165625
34;1023;29062021165625
35;888;29062021165625
36;691;29062021165625
37;553;29062021165625
38;446;29062021165625
39;374;29062021165625
40;327;29062021165625
41;288;29062021165625
42;268;29062021165625
43;249;29062021165625
44;243;29062021165625
45;231;29062021165625
46;228;29062021165625
47;224;29062021165625
48;226;29062021165625
49;222;29062021165625
50;226;29062021165625
51;228;29062021165625
52;226;29062021165625
53;236;29062021165625
54;236;29062021165625
55;239;29062021165625
56;243;29062021165625
57;246;29062021165625
58;254;29062021165625
59;256;29062021165625
60;260;29062021165625
61;267;29062021165625
62;272;29062021165625
63;275;29062021165625
64;278;29062021165625
65;279;29062021165625
66;280;29062021165625
67;278;29062021165625
68;279;29062021165625
69;280;29062021165625
70;273;29062021165625
71;272;29062021165625
72;268;29062021165625
73;257;29062021165625
74;260;29062021165625
75;248;29062021165625
76;245;29062021165625
77;242;29062021165625
78;233;29062021165625
79;227;29062021165625
80;223;29062021165625
81;217;29062021165625
82;214;29062021165625
83;211;29062021165625
84;208;29062021165625
85;206;29062021165625
86;204;29062021165625
87;202;29062021165625
88;201;29062021165625
89;196;29062021165625
90;197;29062021165625
91;194;29062021165625
92;189;29062021165625
93;189;29062021165625
94;184;29062021165625
95;180;29062021165625
96;181;29062021165625
97;176;29062021165625
98;174;29062021165625
99;171;29062021165625
100;170;29062021165625
101;169;29062021165625
102;166;29062021165625
103;162;29062021165625
104;162;29062021165625
105;160;29062021165625
106;161;29062021165625
107;155;29062021165625
108;156;29062021165625
109;155;29062021165625
110;151;29062021165625
111;151;29062021165625
112;152;29062021165625
113;147;29062021165625
114;148;29062021165625
115;148;29062021165625
116;146;29062021165625
117;148;29062021165625
118;144;29062021165625
119;144;29062021165625
120;143;29062021165625
121;140;29062021165625
122;141;29062021165625
123;139;29062021165625
124;138;29062021165625
125;140;29062021165625
126;137;29062021165625
127;136;29062021165625
128;137;29062021165625
129;135;29062021165625
130;135;29062021165625
131;135;29062021165625
132;132;29062021165625
133;135;29062021165625
134;131;29062021165625
135;131;29062021165625
136;132;29062021165625
137;130;29062021165625
138;130;29062021165625
139;130;29062021165625
140;127;29062021165625
141;129;29062021165625
142;126;29062021165625
143;126;29062021165625
144;128;29062021165625
145;125;29062021165625
146;129;29062021165625
147;127;29062021165625
148;126;29062021165625
149;126;29062021165625
150;125;29062021165625
151;125;29062021165625
152;125;29062021165625
153;123;29062021165625
154;125;29062021165625
155;124;29062021165625
156;124;29062021165625
157;124;29062021165625
158;122;29062021165625
159;123;29062021165625
160;123;29062021165625
161;123;29062021165625
162;124;29062021165625
163;123;29062021165625
164;122;29062021165625
165;124;29062021165625
166;122;29062021165625
167;123;29062021165625
168;123;29062021165625
169;120;29062021165625
170;122;29062021165625
171;122;29062021165625
172;121;29062021165625
173;122;29062021165625
174;122;29062021165625
175;121;29062021165625
176;124;29062021165625
177;121;29062021165625
178;123;29062021165625
179;121;29062021165625
180;120;29062021165625
181;122;29062021165625
182;123;29062021165625
183;120;29062021165625
184;122;29062021165625
185;120;29062021165625
186;123;29062021165625
187;121;29062021165625
188;119;29062021165625
189;122;29062021165625
190;120;29062021165625
191;119;29062021165625
192;124;29062021165625
193;121;29062021165625
194;121;29062021165625
195;121;29062021165625
196;120;29062021165625
197;121;29062021165625
198;121;29062021165625
199;119;29062021165625
200;0;29062021165625
0;0;29062021165625
1;142;29062021165625
2;124;29062021165625
3;122;29062021165625
4;124;29062021165625
5;125;29062021165625
6;123;29062021165625
7;125;29062021165625
8;126;29062021165625
9;124;29062021165625
10;127;29062021165625
11;126;29062021165625
12;127;29062021165625
13;130;29062021165625
14;129;29062021165625
15;134;29062021165625
16;138;29062021165625
17;143;29062021165625
18;161;29062021165625
19;193;29062021165625
20;267;29062021165625
21;465;29062021165625
22;946;29062021165625
23;1023;29062021165625
24;1023;29062021165625
25;1023;29062021165625
26;1023;29062021165625
27;1023;29062021165625
28;1023;29062021165625
29;1023;29062021165625
30;1023;29062021165625
31;1023;29062021165625
32;1023;29062021165625
33;1023;29062021165625
34;1023;29062021165625
35;898;29062021165625
36;700;29062021165625
37;554;29062021165625
38;451;29062021165625
39;381;29062021165625
40;327;29062021165625
41;291;29062021165625
42;268;29062021165625
43;249;29062021165625
44;240;29062021165625
45;231;29062021165625
46;228;29062021165625
47;226;29062021165625
48;229;29062021165625
49;224;29062021165625
50;228;29062021165625
51;227;29062021165625
52;226;29062021165625
53;235;29062021165625
54;233;29062021165625
55;237;29062021165625
56;241;29062021165625
57;247;29062021165625
58;255;29062021165625
59;255;29062021165625
60;261;29062021165625
61;268;29062021165625
62;269;29062021165625
63;275;29062021165625
64;279;29062021165625
65;276;29062021165625
66;282;29062021165625
67;279;29062021165625
68;278;29062021165625
69;277;29062021165625
70;274;29062021165625
71;272;29062021165625
72;270;29062021165625
73;261;29062021165625
74;259;29062021165625
75;249;29062021165625
76;246;29062021165625
77;244;29062021165625
78;235;29062021165625
79;228;29062021165625
80;223;29062021165625
81;216;29062021165625
82;217;29062021165625
83;211;29062021165625
84;209;29062021165625
85;205;29062021165625
86;202;29062021165625
87;202;29062021165625
88;204;29062021165625
89;197;29062021165625
90;198;29062021165625
91;195;29062021165625
92;187;29062021165625
93;189;29062021165625
94;184;29062021165625
95;180;29062021165625
96;180;29062021165625
97;175;29062021165625
98;174;29062021165625
99;170;29062021165625
100;168;29062021165625
101;170;29062021165625
102;166;29062021165625
103;163;29062021165625
104;163;29062021165625
105;160;29062021165625
106;161;29062021165625
107;156;29062021165625
108;155;29062021165625
109;155;29062021165625
110;152;29062021165625
111;152;29062021165625
112;152;29062021165625
113;147;29062021165625
114;146;29062021165625
115;147;29062021165625
116;144;29062021165625
117;148;29062021165625
118;143;29062021165625
119;143;29062021165625
120;142;29062021165625
121;139;29062021165625
122;140;29062021165625
123;139;29062021165625
124;137;29062021165625
125;139;29062021165625
126;136;29062021165625
127;137;29062021165625
128;138;29062021165625
129;134;29062021165625
130;133;29062021165625
131;133;29062021165625
132;132;29062021165625
133;135;29062021165625
134;131;29062021165625
135;130;29062021165625
136;133;29062021165625
137;129;29062021165625
138;130;29062021165625
139;128;29062021165625
140;127;29062021165625
141;129;29062021165625
142;127;29062021165625
143;127;29062021165625
144;128;29062021165625
145;124;29062021165625
146;128;29062021165625
147;126;29062021165625
148;124;29062021165625
149;124;29062021165625
150;124;29062021165625
151;126;29062021165625
152;126;29062021165625
153;123;29062021165625
154;125;29062021165625
155;123;29062021165625
156;123;29062021165625
157;124;29062021165625
158;123;29062021165625
159;122;29062021165625
160;125;29062021165625
161;122;29062021165625
162;123;29062021165625
163;123;29062021165625
164;123;29062021165625
165;125;29062021165625
166;122;29062021165625
167;122;29062021165625
168;124;29062021165625
169;121;29062021165625
170;123;29062021165625
171;123;29062021165625
172;121;29062021165625
173;122;29062021165625
174;121;29062021165625
175;121;29062021165625
176;122;29062021165625
177;120;29062021165625
178;123;29062021165625
179;121;29062021165625
180;120;29062021165625
181;122;29062021165625
182;121;29062021165625
183;120;29062021165625
184;121;29062021165625
185;119;29062021165625
186;122;29062021165625
187;121;29062021165625
188;119;29062021165625
189;121;29062021165625
190;120;29062021165625
191;120;29062021165625
192;123;29062021165625
193;120;29062021165625
194;120;29062021165625
195;119;29062021165625
196;119;29062021165625
197;121;29062021165625
198;121;29062021165625
199;119;29062021165625
200;0;29062021165625
0;0;29062021165625
1;143;29062021165625
2;125;29062021165625
3;124;29062021165625
4;124;29062021165625
5;126;29062021165625
6;124;29062021165625
7;125;29062021165625
8;127;29062021165625
9;124;29062021165625
10;128;29062021165625
11;126;29062021165625
12;128;29062021165625
13;131;29062021165625
14;129;29062021165625
15;134;29062021165625
16;138;29062021165625
17;143;29062021165625
18;161;29062021165625
19;193;29062021165625
20;271;29062021165625
21;463;29062021165625
22;954;29062021165625
23;1023;29062021165625
24;1023;29062021165625
25;1023;29062021165625
26;1023;29062021165625
27;1023;29062021165625
28;1023;29062021165625
29;1023;29062021165625
30;1023;29062021165625
31;1023;29062021165625
32;1023;29062021165625
33;1023;29062021165625
34;1023;29062021165625
35;891;29062021165625
36;692;29062021165625
37;553;29062021165625
38;447;29062021165625
39;374;29062021165625
40;326;29062021165625
41;291;29062021165625
42;267;29062021165625
43;250;29062021165625
44;238;29062021165625
45;233;29062021165625
46;230;29062021165625
47;226;29062021165625
48;226;29062021165625
49;222;29062021165625
50;230;29062021165625
51;227;29062021165625
52;229;29062021165625
53;235;29062021165625
54;234;29062021165625
55;239;29062021165625
56;243;29062021165625
57;245;29062021165625
58;252;29062021165625
59;256;29062021165625
60;259;29062021165625
61;267;29062021165625
62;270;29062021165625
63;273;29062021165625
64;280;29062021165625
65;277;29062021165625
66;281;29062021165625
67;281;29062021165625
68;278;29062021165625
69;281;29062021165625
70;275;29062021165625
71;269;29062021165625
72;266;29062021165625
73;263;29062021165625
74;257;29062021165625
75;248;29062021165625
76;245;29062021165625
77;243;29062021165625
78;234;29062021165625
79;226;29062021165625
80;222;29062021165625
81;217;29062021165625
82;217;29062021165625
83;209;29062021165625
84;206;29062021165625
85;206;29062021165625
86;202;29062021165625
87;203;29062021165625
88;202;29062021165625
89;196;29062021165625
90;197;29062021165625
91;194;29062021165625
92;188;29062021165625
93;189;29062021165625
94;185;29062021165625
95;182;29062021165625
96;179;29062021165625
97;175;29062021165625
98;175;29062021165625
99;172;29062021165625
100;168;29062021165625
101;169;29062021165625
102;164;29062021165625
103;164;29062021165625
104;163;29062021165625
105;160;29062021165625
106;162;29062021165625
107;157;29062021165625
108;154;29062021165625
109;155;29062021165625
110;151;29062021165625
111;151;29062021165625
112;152;29062021165625
113;147;29062021165625
114;149;29062021165625
115;148;29062021165625
116;146;29062021165625
117;147;29062021165625
118;143;29062021165625
119;144;29062021165625
120;142;29062021165625
121;140;29062021165625
122;143;29062021165625
123;140;29062021165625
124;137;29062021165625
125;138;29062021165625
126;138;29062021165625
127;136;29062021165625
128;137;29062021165625
129;134;29062021165625
130;134;29062021165625
131;135;29062021165625
132;132;29062021165625
133;136;29062021165625
134;132;29062021165625
135;131;29062021165625
136;131;29062021165625
137;129;29062021165625
138;131;29062021165625
139;129;29062021165625
140;127;29062021165625
141;130;29062021165625
142;127;29062021165625
143;127;29062021165625
144;129;29062021165625
145;126;29062021165625
146;127;29062021165625
147;126;29062021165625
148;124;29062021165625
149;126;29062021165625
150;125;29062021165625
151;125;29062021165625
152;126;29062021165625
153;123;29062021165625
154;126;29062021165625
155;124;29062021165625
156;123;29062021165625
157;124;29062021165625
158;123;29062021165625
159;121;29062021165625
160;123;29062021165625
161;123;29062021165625
162;124;29062021165625
163;124;29062021165625
164;122;29062021165625
165;124;29062021165625
166;123;29062021165625
167;123;29062021165625
168;123;29062021165625
169;120;29062021165625
170;123;29062021165625
171;121;29062021165625
172;122;29062021165625
173;122;29062021165625
174;121;29062021165625
175;121;29062021165625
176;122;29062021165625
177;120;29062021165625
178;122;29062021165625
179;121;29062021165625
180;121;29062021165625
181;123;29062021165625
182;122;29062021165625
183;121;29062021165625
184;121;29062021165625
185;118;29062021165625
186;121;29062021165625
187;122;29062021165625
188;119;29062021165625
189;121;29062021165625
190;120;29062021165625
191;120;29062021165625
192;124;29062021165625
193;121;29062021165625
194;120;29062021165625
195;120;29062021165625
196;119;29062021165625
197;121;29062021165625
198;121;29062021165625
199;119;29062021165625
200;0;29062021165625
0;0;29062021165626
1;142;29062021165626
2;124;29062021165626
3;124;29062021165626
4;124;29062021165626
5;126;29062021165626
6;123;29062021165626
7;124;29062021165626
8;125;29062021165626
9;124;29062021165626
10;128;29062021165626
11;124;29062021165626
12;126;29062021165626
13;130;29062021165626
14;130;29062021165626
15;133;29062021165626
16;137;29062021165626
17;142;29062021165626
18;159;29062021165626
19;191;29062021165626
20;266;29062021165626
21;461;29062021165626
22;946;29062021165626
23;1023;29062021165626
24;1023;29062021165626
25;1023;29062021165626
26;1023;29062021165626
27;1023;29062021165626
28;1023;29062021165626
29;1023;29062021165626
30;1023;29062021165626
31;1023;29062021165626
32;1023;29062021165626
33;1023;29062021165626
34;1023;29062021165626
35;902;29062021165626
36;702;29062021165626
37;556;29062021165626
38;452;29062021165626
39;380;29062021165626
40;325;29062021165626
41;288;29062021165626
42;269;29062021165626
43;250;29062021165626
44;241;29062021165626
45;233;29062021165626
46;227;29062021165626
47;226;29062021165626
48;227;29062021165626
49;223;29062021165626
50;229;29062021165626
51;227;29062021165626
52;227;29062021165626
53;232;29062021165626
54;234;29062021165626
55;237;29062021165626
56;243;29062021165626
57;243;29062021165626
58;254;29062021165626
59;257;29062021165626
60;262;29062021165626
61;266;29062021165626
62;267;29062021165626
63;275;29062021165626
64;277;29062021165626
65;278;29062021165626
66;283;29062021165626
67;281;29062021165626
68;279;29062021165626
69;278;29062021165626
70;272;29062021165626
71;268;29062021165626
72;271;29062021165626
73;261;29062021165626
74;255;29062021165626
75;247;29062021165626
76;244;29062021165626
77;242;29062021165626
78;233;29062021165626
79;227;29062021165626
80;225;29062021165626
81;215;29062021165626
82;215;29062021165626
83;211;29062021165626
84;209;29062021165626
85;207;29062021165626
86;204;29062021165626
87;201;29062021165626
88;202;29062021165626
89;196;29062021165626
90;195;29062021165626
91;193;29062021165626
92;190;29062021165626
93;188;29062021165626
94;184;29062021165626
95;182;29062021165626
96;181;29062021165626
97;174;29062021165626
98;176;29062021165626
99;171;29062021165626
100;169;29062021165626
101;168;29062021165626
102;165;29062021165626
103;165;29062021165626
104;162;29062021165626
105;160;29062021165626
106;161;29062021165626
107;156;29062021165626
108;154;29062021165626
109;155;29062021165626
110;152;29062021165626
111;150;29062021165626
112;150;29062021165626
113;147;29062021165626
114;148;29062021165626
115;147;29062021165626
116;144;29062021165626
117;147;29062021165626
118;143;29062021165626
119;144;29062021165626
120;140;29062021165626
121;139;29062021165626
122;141;29062021165626
123;139;29062021165626
124;138;29062021165626
125;139;29062021165626
126;136;29062021165626
127;134;29062021165626
128;137;29062021165626
129;133;29062021165626
130;134;29062021165626
131;134;29062021165626
132;131;29062021165626
133;136;29062021165626
134;132;29062021165626
135;130;29062021165626
136;132;29062021165626
137;128;29062021165626
138;130;29062021165626
139;130;29062021165626
140;128;29062021165626
141;129;29062021165626
142;127;29062021165626
143;126;29062021165626
144;128;29062021165626
145;125;29062021165626
146;128;29062021165626
147;126;29062021165626
148;125;29062021165626
149;125;29062021165626
150;125;29062021165626
151;125;29062021165626
152;125;29062021165626
153;122;29062021165626
154;124;29062021165626
155;123;29062021165626
156;122;29062021165626
157;123;29062021165626
158;122;29062021165626
159;122;29062021165626
160;124;29062021165626
161;122;29062021165626
162;124;29062021165626
163;123;29062021165626
164;122;29062021165626
165;124;29062021165626
166;122;29062021165626
167;122;29062021165626
168;123;29062021165626
169;119;29062021165626
170;123;29062021165626
171;122;29062021165626
172;121;29062021165626
173;122;29062021165626
174;122;29062021165626
175;120;29062021165626
176;122;29062021165626
177;119;29062021165626
178;122;29062021165626
179;121;29062021165626
180;121;29062021165626
181;121;29062021165626
182;121;29062021165626
183;120;29062021165626
184;121;29062021165626
185;118;29062021165626
186;121;29062021165626
187;120;29062021165626
188;119;29062021165626
189;121;29062021165626
190;120;29062021165626
191;120;29062021165626
192;123;29062021165626
193;120;29062021165626
194;120;29062021165626
195;120;29062021165626
196;118;29062021165626
197;121;29062021165626
198;121;29062021165626
199;118;29062021165626
200;0;29062021165626
0;0;29062021165626
1;142;29062021165626
2;125;29062021165626
3;125;29062021165626
4;125;29062021165626
5;126;29062021165626
6;124;29062021165626
7;125;29062021165626
8;126;29062021165626
9;125;29062021165626
10;129;29062021165626
11;127;29062021165626
12;128;29062021165626
13;132;29062021165626
14;132;29062021165626
15;136;29062021165626
16;138;29062021165626
17;143;29062021165626
18;161;29062021165626
19;192;29062021165626
20;270;29062021165626
21;465;29062021165626
22;947;29062021165626
23;1023;29062021165626
24;1023;29062021165626
25;1023;29062021165626
26;1023;29062021165626
27;1023;29062021165626
28;1023;29062021165626
29;1023;29062021165626
30;1023;29062021165626
31;1023;29062021165626
32;1023;29062021165626
33;1023;29062021165626
34;1023;29062021165626
35;893;29062021165626
36;695;29062021165626
37;550;29062021165626
38;450;29062021165626
39;374;29062021165626
40;327;29062021165626
41;289;29062021165626
42;270;29062021165626
43;251;29062021165626
44;240;29062021165626
45;236;29062021165626
46;228;29062021165626
47;224;29062021165626
48;225;29062021165626
49;223;29062021165626
50;227;29062021165626
51;227;29062021165626
52;228;29062021165626
53;231;29062021165626
54;236;29062021165626
55;237;29062021165626
56;243;29062021165626
57;246;29062021165626
58;253;29062021165626
59;255;29062021165626
60;261;29062021165626
61;268;29062021165626
62;270;29062021165626
63;274;29062021165626
64;278;29062021165626
65;274;29062021165626
66;280;29062021165626
67;281;29062021165626
68;279;29062021165626
69;276;29062021165626
70;271;29062021165626
71;270;29062021165626
72;269;29062021165626
73;259;29062021165626
74;256;29062021165626
75;250;29062021165626
76;244;29062021165626
77;240;29062021165626
78;232;29062021165626
79;229;29062021165626
80;225;29062021165626
81;217;29062021165626
82;216;29062021165626
83;211;29062021165626
84;208;29062021165626
85;205;29062021165626
86;204;29062021165626
87;202;29062021165626
88;203;29062021165626
89;197;29062021165626
90;196;29062021165626
91;193;29062021165626
92;190;29062021165626
93;189;29062021165626
94;184;29062021165626
95;181;29062021165626
96;180;29062021165626
97;175;29062021165626
98;174;29062021165626
99;171;29062021165626
100;170;29062021165626
101;169;29062021165626
102;165;29062021165626
103;162;29062021165626
104;164;29062021165626
105;161;29062021165626
106;162;29062021165626
107;157;29062021165626
108;156;29062021165626
109;156;29062021165626
110;152;29062021165626
111;152;29062021165626
112;153;29062021165626
113;147;29062021165626
114;148;29062021165626
115;149;29062021165626
116;146;29062021165626
117;148;29062021165626
118;143;29062021165626
119;143;29062021165626
120;142;29062021165626
121;141;29062021165626
122;141;29062021165626
123;140;29062021165626
124;138;29062021165626
125;139;29062021165626
126;136;29062021165626
127;137;29062021165626
128;137;29062021165626
129;135;29062021165626
130;135;29062021165626
131;136;29062021165626
132;133;29062021165626
133;136;29062021165626
134;131;29062021165626
135;132;29062021165626
136;133;29062021165626
137;130;29062021165626
138;131;29062021165626
139;129;29062021165626
140;128;29062021165626
141;130;29062021165626
142;129;29062021165626
143;128;29062021165626
144;129;29062021165626
145;125;29062021165626
146;129;29062021165626
147;127;29062021165626
148;125;29062021165626
149;126;29062021165626
150;125;29062021165626
151;125;29062021165626
152;125;29062021165626
153;123;29062021165626
154;125;29062021165626
155;123;29062021165626
156;123;29062021165626
157;125;29062021165626
158;123;29062021165626
159;124;29062021165626
160;125;29062021165626
161;123;29062021165626
162;124;29062021165626
163;123;29062021165626
164;123;29062021165626
165;125;29062021165626
166;123;29062021165626
167;124;29062021165626
168;124;29062021165626
169;121;29062021165626
170;124;29062021165626
171;124;29062021165626
172;122;29062021165626
173;123;29062021165626
174;121;29062021165626
175;120;29062021165626
176;122;29062021165626
177;121;29062021165626
178;122;29062021165626
179;122;29062021165626
180;121;29062021165626
181;123;29062021165626
182;122;29062021165626
183;121;29062021165626
184;122;29062021165626
185;120;29062021165626
186;123;29062021165626
187;121;29062021165626
188;120;29062021165626
189;121;29062021165626
190;120;29062021165626
191;122;29062021165626
192;123;29062021165626
193;120;29062021165626
194;120;29062021165626
195;121;29062021165626
196;120;29062021165626
197;121;29062021165626
198;121;29062021165626
199;120;29062021165626
200;0;29062021165626
0;0;29062021165626
1;143;29062021165626
2;124;29062021165626
3;123;29062021165626
4;124;29062021165626
5;125;29062021165626
6;123;29062021165626
7;124;29062021165626
8;126;29062021165626
9;124;29062021165626
10;128;29062021165626
11;126;29062021165626
12;126;29062021165626
13;130;29062021165626
14;130;29062021165626
15;134;29062021165626
16;137;29062021165626
17;144;29062021165626
18;161;29062021165626
19;194;29062021165626
20;267;29062021165626
21;462;29062021165626
22;947;29062021165626
23;1023;29062021165626
24;1023;29062021165626
25;1023;29062021165626
26;1023;29062021165626
27;1023;29062021165626
28;1023;29062021165626
29;1023;29062021165626
30;1023;29062021165626
31;1023;29062021165626
32;1023;29062021165626
33;1023;29062021165626
34;1023;29062021165626
35;906;29062021165626
36;703;29062021165626
37;557;29062021165626
38;458;29062021165626
39;383;29062021165626
40;329;29062021165626
41;291;29062021165626
42;272;29062021165626
43;252;29062021165626
44;240;29062021165626
45;233;29062021165626
46;229;29062021165626
47;225;29062021165626
48;225;29062021165626
49;223;29062021165626
50;227;29062021165626
51;229;29062021165626
52;225;29062021165626
53;232;29062021165626
54;235;29062021165626
55;239;29062021165626
56;242;29062021165626
57;246;29062021165626
58;253;29062021165626
59;256;29062021165626
60;262;29062021165626
61;267;29062021165626
62;268;29062021165626
63;274;29062021165626
64;278;29062021165626
65;279;29062021165626
66;280;29062021165626
67;281;29062021165626
68;278;29062021165626
69;277;29062021165626
70;272;29062021165626
71;270;29062021165626
72;266;29062021165626
73;260;29062021165626
74;258;29062021165626
75;247;29062021165626
76;247;29062021165626
77;242;29062021165626
78;232;29062021165626
79;229;29062021165626
80;225;29062021165626
81;215;29062021165626
82;215;29062021165626
83;210;29062021165626
84;207;29062021165626
85;205;29062021165626
86;204;29062021165626
87;204;29062021165626
88;201;29062021165626
89;196;29062021165626
90;197;29062021165626
91;191;29062021165626
92;187;29062021165626
93;188;29062021165626
94;184;29062021165626
95;182;29062021165626
96;180;29062021165626
97;175;29062021165626
98;174;29062021165626
99;171;29062021165626
100;167;29062021165626
101;170;29062021165626
102;166;29062021165626
103;163;29062021165626
104;163;29062021165626
105;158;29062021165626
106;162;29062021165626
107;157;29062021165626
108;154;29062021165626
109;156;29062021165626
110;150;29062021165626
111;151;29062021165626
112;151;29062021165626
113;146;29062021165626
114;149;29062021165626
115;148;29062021165626
116;144;29062021165626
117;148;29062021165626
118;143;29062021165626
119;144;29062021165626
120;141;29062021165626
121;139;29062021165626
122;140;29062021165626
123;139;29062021165626
124;136;29062021165626
125;140;29062021165626
126;135;29062021165626
127;136;29062021165626
128;137;29062021165626
129;134;29062021165626
130;134;29062021165626
131;134;29062021165626
132;132;29062021165626
133;135;29062021165626
134;130;29062021165626
135;130;29062021165626
136;132;29062021165626
137;129;29062021165626
138;131;29062021165626
139;129;29062021165626
140;128;29062021165626
141;129;29062021165626
142;128;29062021165626
143;127;29062021165626
144;128;29062021165626
145;125;29062021165626
146;127;29062021165626
147;127;29062021165626
148;125;29062021165626
149;125;29062021165626
150;124;29062021165626
151;125;29062021165626
152;126;29062021165626
153;123;29062021165626
154;126;29062021165626
155;124;29062021165626
156;122;29062021165626
157;123;29062021165626
158;122;29062021165626
159;122;29062021165626
160;125;29062021165626
161;123;29062021165626
162;124;29062021165626
163;123;29062021165626
164;122;29062021165626
165;125;29062021165626
166;122;29062021165626
167;122;29062021165626
168;123;29062021165626
169;120;29062021165626
170;123;29062021165626
171;122;29062021165626
172;120;29062021165626
173;123;29062021165626
174;121;29062021165626
175;121;29062021165626
176;122;29062021165626
177;119;29062021165626
178;121;29062021165626
179;122;29062021165626
180;121;29062021165626
181;122;29062021165626
182;121;29062021165626
183;120;29062021165626
184;122;29062021165626
185;120;29062021165626
186;122;29062021165626
187;121;29062021165626
188;120;29062021165626
189;121;29062021165626
190;120;29062021165626
191;119;29062021165626
192;123;29062021165626
193;119;29062021165626
194;120;29062021165626
195;120;29062021165626
196;120;29062021165626
197;121;29062021165626
198;120;29062021165626
199;120;29062021165626
200;0;29062021165626
0;0;29062021165627
1;142;29062021165627
2;124;29062021165627
3;123;29062021165627
4;125;29062021165627
5;126;29062021165627
6;124;29062021165627
7;126;29062021165627
8;127;29062021165627
9;125;29062021165627
10;127;29062021165627
11;127;29062021165627
12;127;29062021165627
13;131;29062021165627
14;131;29062021165627
15;135;29062021165627
16;139;29062021165627
17;143;29062021165627
18;159;29062021165627
19;194;29062021165627
20;269;29062021165627
21;461;29062021165627
22;959;29062021165627
23;1023;29062021165627
24;1023;29062021165627
25;1023;29062021165627
26;1023;29062021165627
27;1023;29062021165627
28;1023;29062021165627
29;1023;29062021165627
30;1023;29062021165627
31;1023;29062021165627
32;1023;29062021165627
33;1023;29062021165627
34;1023;29062021165627
35;890;29062021165627
36;693;29062021165627
37;547;29062021165627
38;448;29062021165627
39;379;29062021165627
40;325;29062021165627
41;288;29062021165627
42;269;29062021165627
43;250;29062021165627
44;241;29062021165627
45;235;29062021165627
46;228;29062021165627
47;225;29062021165627
48;224;29062021165627
49;224;29062021165627
50;226;29062021165627
51;226;29062021165627
52;229;29062021165627
53;233;29062021165627
54;234;29062021165627
55;237;29062021165627
56;239;29062021165627
57;243;29062021165627
58;253;29062021165627
59;255;29062021165627
60;259;29062021165627
61;269;29062021165627
62;270;29062021165627
63;276;29062021165627
64;280;29062021165627
65;276;29062021165627
66;283;29062021165627
67;280;29062021165627
68;277;29062021165627
69;280;29062021165627
70;273;29062021165627
71;272;29062021165627
72;268;29062021165627
73;259;29062021165627
74;258;29062021165627
75;248;29062021165627
76;245;29062021165627
77;240;29062021165627
78;232;29062021165627
79;230;29062021165627
80;224;29062021165627
81;218;29062021165627
82;216;29062021165627
83;210;29062021165627
84;210;29062021165627
85;205;29062021165627
86;203;29062021165627
87;203;29062021165627
88;202;29062021165627
89;197;29062021165627
90;198;29062021165627
91;195;29062021165627
92;190;29062021165627
93;189;29062021165627
94;186;29062021165627
95;181;29062021165627
96;182;29062021165627
97;178;29062021165627
98;175;29062021165627
99;173;29062021165627
100;168;29062021165627
101;170;29062021165627
102;166;29062021165627
103;164;29062021165627
104;163;29062021165627
105;160;29062021165627
106;162;29062021165627
107;156;29062021165627
108;156;29062021165627
109;156;29062021165627
110;151;29062021165627
111;151;29062021165627
112;152;29062021165627
113;146;29062021165627
114;148;29062021165627
115;147;29062021165627
116;146;29062021165627
117;147;29062021165627
118;145;29062021165627
119;144;29062021165627
120;144;29062021165627
121;140;29062021165627
122;141;29062021165627
123;139;29062021165627
124;137;29062021165627
125;139;29062021165627
126;136;29062021165627
127;136;29062021165627
128;139;29062021165627
129;135;29062021165627
130;134;29062021165627
131;134;29062021165627
132;133;29062021165627
133;135;29062021165627
134;131;29062021165627
135;130;29062021165627
136;133;29062021165627
137;130;29062021165627
138;131;29062021165627
139;131;29062021165627
140;128;29062021165627
141;130;29062021165627
142;127;29062021165627
143;127;29062021165627
144;129;29062021165627
145;125;29062021165627
146;129;29062021165627
147;127;29062021165627
148;125;29062021165627
149;125;29062021165627
150;125;29062021165627
151;125;29062021165627
152;126;29062021165627
153;124;29062021165627
154;125;29062021165627
155;124;29062021165627
156;123;29062021165627
157;125;29062021165627
158;123;29062021165627
159;123;29062021165627
160;123;29062021165627
161;122;29062021165627
162;124;29062021165627
163;123;29062021165627
164;122;29062021165627
165;124;29062021165627
166;123;29062021165627
167;123;29062021165627
168;124;29062021165627
169;121;29062021165627
170;122;29062021165627
171;122;29062021165627
172;121;29062021165627
173;122;29062021165627
174;122;29062021165627
175;121;29062021165627
176;124;29062021165627
177;120;29062021165627
178;123;29062021165627
179;121;29062021165627
180;122;29062021165627
181;122;29062021165627
182;122;29062021165627
183;121;29062021165627
184;122;29062021165627
185;119;29062021165627
186;123;29062021165627
187;121;29062021165627
188;119;29062021165627
189;121;29062021165627
190;120;29062021165627
191;120;29062021165627
192;123;29062021165627
193;122;29062021165627
194;121;29062021165627
195;121;29062021165627
196;120;29062021165627
197;121;29062021165627
198;121;29062021165627
199;120;29062021165627
200;0;29062021165627
0;0;29062021165628
1;142;29062021165628
2;124;29062021165628
3;123;29062021165628
4;124;29062021165628
5;125;29062021165628
6;122;29062021165628
7;124;29062021165628
8;126;29062021165628
9;124;29062021165628
10;128;29062021165628
11;125;29062021165628
12;127;29062021165628
13;130;29062021165628
14;130;29062021165628
15;133;29062021165628
16;138;29062021165628
17;143;29062021165628
18;161;29062021165628
19;192;29062021165628
20;267;29062021165628
21;462;29062021165628
22;948;29062021165628
23;1023;29062021165628
24;1023;29062021165628
25;1023;29062021165628
26;1023;29062021165628
27;1023;29062021165628
28;1023;29062021165628
29;1023;29062021165628
30;1023;29062021165628
31;1023;29062021165628
32;1023;29062021165628
33;1023;29062021165628
34;1023;29062021165628
35;900;29062021165628
36;698;29062021165628
37;555;29062021165628
38;453;29062021165628
39;379;29062021165628
40;327;29062021165628
41;291;29062021165628
42;270;29062021165628
43;251;29062021165628
44;242;29062021165628
45;237;29062021165628
46;228;29062021165628
47;225;29062021165628
48;227;29062021165628
49;224;29062021165628
50;225;29062021165628
51;227;29062021165628
52;228;29062021165628
53;233;29062021165628
54;234;29062021165628
55;238;29062021165628
56;241;29062021165628
57;245;29062021165628
58;252;29062021165628
59;256;29062021165628
60;258;29062021165628
61;266;29062021165628
62;267;29062021165628
63;273;29062021165628
64;278;29062021165628
65;275;29062021165628
66;281;29062021165628
67;281;29062021165628
68;278;29062021165628
69;278;29062021165628
70;272;29062021165628
71;270;29062021165628
72;267;29062021165628
73;261;29062021165628
74;259;29062021165628
75;249;29062021165628
76;245;29062021165628
77;243;29062021165628
78;233;29062021165628
79;228;29062021165628
80;223;29062021165628
81;217;29062021165628
82;216;29062021165628
83;209;29062021165628
84;207;29062021165628
85;206;29062021165628
86;203;29062021165628
87;201;29062021165628
88;204;29062021165628
89;197;29062021165628
90;197;29062021165628
91;192;29062021165628
92;189;29062021165628
93;189;29062021165628
94;185;29062021165628
95;180;29062021165628
96;180;29062021165628
97;176;29062021165628
98;174;29062021165628
99;172;29062021165628
100;169;29062021165628
101;168;29062021165628
102;166;29062021165628
103;162;29062021165628
104;162;29062021165628
105;160;29062021165628
106;162;29062021165628
107;156;29062021165628
108;155;29062021165628
109;155;29062021165628
110;150;29062021165628
111;150;29062021165628
112;152;29062021165628
113;147;29062021165628
114;147;29062021165628
115;147;29062021165628
116;145;29062021165628
117;149;29062021165628
118;143;29062021165628
119;143;29062021165628
120;142;29062021165628
121;140;29062021165628
122;142;29062021165628
123;140;29062021165628
124;137;29062021165628
125;140;29062021165628
126;136;29062021165628
127;135;29062021165628
128;137;29062021165628
129;133;29062021165628
130;135;29062021165628
131;135;29062021165628
132;132;29062021165628
133;135;29062021165628
134;130;29062021165628
135;130;29062021165628
136;131;29062021165628
137;128;29062021165628
138;131;29062021165628
139;130;29062021165628
140;127;29062021165628
141;129;29062021165628
142;128;29062021165628
143;126;29062021165628
144;127;29062021165628
145;125;29062021165628
146;127;29062021165628
147;126;29062021165628
148;125;29062021165628
149;125;29062021165628
150;124;29062021165628
151;126;29062021165628
152;124;29062021165628
153;123;29062021165628
154;125;29062021165628
155;123;29062021165628
156;122;29062021165628
157;123;29062021165628
158;122;29062021165628
159;122;29062021165628
160;124;29062021165628
161;121;29062021165628
162;123;29062021165628
163;123;29062021165628
164;121;29062021165628
165;125;29062021165628
166;122;29062021165628
167;123;29062021165628
168;124;29062021165628
169;121;29062021165628
170;123;29062021165628
171;122;29062021165628
172;121;29062021165628
173;121;29062021165628
174;122;29062021165628
175;120;29062021165628
176;122;29062021165628
177;120;29062021165628
178;123;29062021165628
179;121;29062021165628
180;120;29062021165628
181;122;29062021165628
182;121;29062021165628
183;120;29062021165628
184;121;29062021165628
185;119;29062021165628
186;122;29062021165628
187;121;29062021165628
188;118;29062021165628
189;120;29062021165628
190;119;29062021165628
191;120;29062021165628
192;122;29062021165628
193;120;29062021165628
194;120;29062021165628
195;121;29062021165628
196;119;29062021165628
197;121;29062021165628
198;121;29062021165628
199;119;29062021165628
200;0;29062021165628
0;0;29062021165628
1;143;29062021165628
2;124;29062021165628
3;124;29062021165628
4;125;29062021165628
5;126;29062021165628
6;123;29062021165628
7;124;29062021165628
8;126;29062021165628
9;125;29062021165628
10;128;29062021165628
11;126;29062021165628
12;126;29062021165628
13;131;29062021165628
14;130;29062021165628
15;134;29062021165628
16;137;29062021165628
17;143;29062021165628
18;162;29062021165628
19;193;29062021165628
20;267;29062021165628
21;462;29062021165628
22;946;29062021165628
23;1023;29062021165628
24;1023;29062021165628
25;1023;29062021165628
26;1023;29062021165628
27;1023;29062021165628
28;1023;29062021165628
29;1023;29062021165628
30;1023;29062021165628
31;1023;29062021165628
32;1023;29062021165628
33;1023;29062021165628
34;1023;29062021165628
35;896;29062021165628
36;700;29062021165628
37;553;29062021165628
38;448;29062021165628
39;374;29062021165628
40;327;29062021165628
41;288;29062021165628
42;267;29062021165628
43;250;29062021165628
44;241;29062021165628
45;235;29062021165628
46;227;29062021165628
47;226;29062021165628
48;227;29062021165628
49;222;29062021165628
50;225;29062021165628
51;227;29062021165628
52;228;29062021165628
53;236;29062021165628
54;231;29062021165628
55;237;29062021165628
56;244;29062021165628
57;245;29062021165628
58;251;29062021165628
59;252;29062021165628
60;262;29062021165628
61;265;29062021165628
62;268;29062021165628
63;277;29062021165628
64;279;29062021165628
65;275;29062021165628
66;279;29062021165628
67;280;29062021165628
68;278;29062021165628
69;281;29062021165628
70;273;29062021165628
71;269;29062021165628
72;270;29062021165628
73;260;29062021165628
74;259;29062021165628
75;249;29062021165628
76;244;29062021165628
77;240;29062021165628
78;232;29062021165628
79;228;29062021165628
80;223;29062021165628
81;218;29062021165628
82;216;29062021165628
83;210;29062021165628
84;207;29062021165628
85;207;29062021165628
86;202;29062021165628
87;203;29062021165628
88;200;29062021165628
89;196;29062021165628
90;196;29062021165628
91;195;29062021165628
92;188;29062021165628
93;190;29062021165628
94;186;29062021165628
95;179;29062021165628
96;179;29062021165628
97;175;29062021165628
98;174;29062021165628
99;173;29062021165628
100;169;29062021165628
101;169;29062021165628
102;164;29062021165628
103;164;29062021165628
104;164;29062021165628
105;159;29062021165628
106;161;29062021165628
107;157;29062021165628
108;157;29062021165628
109;156;29062021165628
110;153;29062021165628
111;150;29062021165628
112;153;29062021165628
113;148;29062021165628
114;149;29062021165628
115;147;29062021165628
116;146;29062021165628
117;148;29062021165628
118;143;29062021165628
119;143;29062021165628
120;142;29062021165628
121;139;29062021165628
122;142;29062021165628
123;139;29062021165628
124;136;29062021165628
125;140;29062021165628
126;136;29062021165628
127;135;29062021165628
128;137;29062021165628
129;134;29062021165628
130;135;29062021165628
131;134;29062021165628
132;132;29062021165628
133;134;29062021165628
134;130;29062021165628
135;131;29062021165628
136;133;29062021165628
137;129;29062021165628
138;131;29062021165628
139;130;29062021165628
140;128;29062021165628
141;131;29062021165628
142;127;29062021165628
143;127;29062021165628
144;128;29062021165628
145;125;29062021165628
146;129;29062021165628
147;126;29062021165628
148;126;29062021165628
149;126;29062021165628
150;124;29062021165628
151;125;29062021165628
152;125;29062021165628
153;123;29062021165628
154;126;29062021165628
155;124;29062021165628
156;122;29062021165628
157;123;29062021165628
158;122;29062021165628
159;123;29062021165628
160;124;29062021165628
161;122;29062021165628
162;123;29062021165628
163;124;29062021165628
164;122;29062021165628
165;125;29062021165628
166;123;29062021165628
167;122;29062021165628
168;124;29062021165628
169;120;29062021165628
170;123;29062021165628
171;122;29062021165628
172;122;29062021165628
173;123;29062021165628
174;122;29062021165628
175;121;29062021165628
176;123;29062021165628
177;121;29062021165628
178;123;29062021165628
179;122;29062021165628
180;121;29062021165628
181;122;29062021165628
182;121;29062021165628
183;120;29062021165628
184;122;29062021165628
185;120;29062021165628
186;123;29062021165628
187;122;29062021165628
188;120;29062021165628
189;120;29062021165628
190;120;29062021165628
191;121;29062021165628
192;124;29062021165628
193;120;29062021165628
194;120;29062021165628
195;122;29062021165628
196;120;29062021165628
197;121;29062021165628
198;120;29062021165628
199;120;29062021165628
200;0;29062021165628
0;0;29062021165628
1;142;29062021165628
2;124;29062021165628
3;123;29062021165628
4;125;29062021165628
5;126;29062021165628
6;122;29062021165628
7;125;29062021165628
8;127;29062021165628
9;124;29062021165628
10;128;29062021165628
11;126;29062021165628
12;127;29062021165628
13;130;29062021165628
14;129;29062021165628
15;134;29062021165628
16;137;29062021165628
17;143;29062021165628
18;161;29062021165628
19;192;29062021165628
20;268;29062021165628
21;459;29062021165628
22;941;29062021165628
23;1023;29062021165628
24;1023;29062021165628
25;1023;29062021165628
26;1023;29062021165628
27;1023;29062021165628
28;1023;29062021165628
29;1023;29062021165628
30;1023;29062021165628
31;1023;29062021165628
32;1023;29062021165628
33;1023;29062021165628
34;1023;29062021165628
35;905;29062021165628
36;704;29062021165628
37;561;29062021165628
38;458;29062021165628
39;382;29062021165628
40;326;29062021165628
41;289;29062021165628
42;271;29062021165628
43;253;29062021165628
44;243;29062021165628
45;231;29062021165628
46;225;29062021165628
47;225;29062021165628
48;227;29062021165628
49;223;29062021165628
50;226;29062021165628
51;228;29062021165628
52;226;29062021165628
53;231;29062021165628
54;233;29062021165628
55;238;29062021165628
56;241;29062021165628
57;245;29062021165628
58;252;29062021165628
59;257;29062021165628
60;259;29062021165628
61;265;29062021165628
62;267;29062021165628
63;276;29062021165628
64;276;29062021165628
65;275;29062021165628
66;280;29062021165628
67;280;29062021165628
68;277;29062021165628
69;279;29062021165628
70;273;29062021165628
71;272;29062021165628
72;267;29062021165628
73;260;29062021165628
74;257;29062021165628
75;251;29062021165628
76;247;29062021165628
77;240;29062021165628
78;233;29062021165628
79;229;29062021165628
80;224;29062021165628
81;216;29062021165628
82;215;29062021165628
83;209;29062021165628
84;210;29062021165628
85;205;29062021165628
86;204;29062021165628
87;202;29062021165628
88;204;29062021165628
89;194;29062021165628
90;197;29062021165628
91;196;29062021165628
92;188;29062021165628
93;189;29062021165628
94;185;29062021165628
95;181;29062021165628
96;182;29062021165628
97;176;29062021165628
98;172;29062021165628
99;172;29062021165628
100;168;29062021165628
101;170;29062021165628
102;166;29062021165628
103;164;29062021165628
104;162;29062021165628
105;159;29062021165628
106;161;29062021165628
107;157;29062021165628
108;153;29062021165628
109;155;29062021165628
110;151;29062021165628
111;151;29062021165628
112;151;29062021165628
113;147;29062021165628
114;147;29062021165628
115;148;29062021165628
116;148;29062021165628
117;147;29062021165628
118;144;29062021165628
119;143;29062021165628
120;141;29062021165628
121;139;29062021165628
122;141;29062021165628
123;139;29062021165628
124;137;29062021165628
125;139;29062021165628
126;136;29062021165628
127;137;29062021165628
128;138;29062021165628
129;133;29062021165628
130;134;29062021165628
131;135;29062021165628
132;132;29062021165628
133;135;29062021165628
134;131;29062021165628
135;131;29062021165628
136;132;29062021165628
137;129;29062021165628
138;131;29062021165628
139;129;29062021165628
140;128;29062021165628
141;130;29062021165628
142;128;29062021165628
143;128;29062021165628
144;128;29062021165628
145;125;29062021165628
146;127;29062021165628
147;126;29062021165628
148;124;29062021165628
149;124;29062021165628
150;125;29062021165628
151;125;29062021165628
152;125;29062021165628
153;122;29062021165628
154;125;29062021165628
155;123;29062021165628
156;123;29062021165628
157;124;29062021165628
158;122;29062021165628
159;123;29062021165628
160;124;29062021165628
161;122;29062021165628
162;124;29062021165628
163;123;29062021165628
164;121;29062021165628
165;124;29062021165628
166;122;29062021165628
167;122;29062021165628
168;123;29062021165628
169;120;29062021165628
170;122;29062021165628
171;122;29062021165628
172;121;29062021165628
173;123;29062021165628
174;121;29062021165628
175;122;29062021165628
176;122;29062021165628
177;120;29062021165628
178;122;29062021165628
179;120;29062021165628
180;121;29062021165628
181;122;29062021165628
182;121;29062021165628
183;121;29062021165628
184;122;29062021165628
185;119;29062021165628
186;122;29062021165628
187;121;29062021165628
188;119;29062021165628
189;121;29062021165628
190;120;29062021165628
191;120;29062021165628
192;123;29062021165628
193;120;29062021165628
194;120;29062021165628
195;120;29062021165628
196;120;29062021165628
197;121;29062021165628
198;121;29062021165628
199;119;29062021165628
200;0;29062021165628
0;0;29062021165629
1;143;29062021165629
2;124;29062021165629
3;124;29062021165629
4;124;29062021165629
5;125;29062021165629
6;122;29062021165629
7;126;29062021165629
8;126;29062021165629
9;125;29062021165629
10;128;29062021165629
11;126;29062021165629
12;128;29062021165629
13;130;29062021165629
14;130;29062021165629
15;134;29062021165629
16;138;29062021165629
17;145;29062021165629
18;162;29062021165629
19;192;29062021165629
20;266;29062021165629
21;464;29062021165629
22;946;29062021165629
23;1023;29062021165629
24;1023;29062021165629
25;1023;29062021165629
26;1023;29062021165629
27;1023;29062021165629
28;1023;29062021165629
29;1023;29062021165629
30;1023;29062021165629
31;1023;29062021165629
32;1023;29062021165629
33;1023;29062021165629
34;1023;29062021165629
35;898;29062021165629
36;703;29062021165629
37;552;29062021165629
38;447;29062021165629
39;376;29062021165629
40;326;29062021165629
41;290;29062021165629
42;268;29062021165629
43;251;29062021165629
44;240;29062021165629
45;232;29062021165629
46;231;29062021165629
47;225;29062021165629
48;226;29062021165629
49;223;29062021165629
50;228;29062021165629
51;224;29062021165629
52;229;29062021165629
53;232;29062021165629
54;233;29062021165629
55;239;29062021165629
56;243;29062021165629
57;244;29062021165629
58;252;29062021165629
59;255;29062021165629
60;260;29062021165629
61;266;29062021165629
62;270;29062021165629
63;273;29062021165629
64;277;29062021165629
65;278;29062021165629
66;279;29062021165629
67;281;29062021165629
68;276;29062021165629
69;278;29062021165629
70;271;29062021165629
71;267;29062021165629
72;270;29062021165629
73;260;29062021165629
74;258;29062021165629
75;249;29062021165629
76;242;29062021165629
77;239;29062021165629
78;234;29062021165629
79;229;29062021165629
80;222;29062021165629
81;217;29062021165629
82;216;29062021165629
83;211;29062021165629
84;207;29062021165629
85;206;29062021165629
86;202;29062021165629
87;205;29062021165629
88;201;29062021165629
89;196;29062021165629
90;198;29062021165629
91;196;29062021165629
92;191;29062021165629
93;188;29062021165629
94;183;29062021165629
95;182;29062021165629
96;179;29062021165629
97;174;29062021165629
98;174;29062021165629
99;171;29062021165629
100;168;29062021165629
101;169;29062021165629
102;165;29062021165629
103;165;29062021165629
104;162;29062021165629
105;159;29062021165629
106;160;29062021165629
107;159;29062021165629
108;156;29062021165629
109;155;29062021165629
110;152;29062021165629
111;150;29062021165629
112;152;29062021165629
113;148;29062021165629
114;148;29062021165629
115;149;29062021165629
116;146;29062021165629
117;147;29062021165629
118;144;29062021165629
119;144;29062021165629
120;141;29062021165629
121;140;29062021165629
122;141;29062021165629
123;140;29062021165629
124;138;29062021165629
125;139;29062021165629
126;136;29062021165629
127;137;29062021165629
128;137;29062021165629
129;135;29062021165629
130;134;29062021165629
131;134;29062021165629
132;132;29062021165629
133;135;29062021165629
134;132;29062021165629
135;130;29062021165629
136;132;29062021165629
137;129;29062021165629
138;131;29062021165629
139;130;29062021165629
140;127;29062021165629
141;130;29062021165629
142;127;29062021165629
143;126;29062021165629
144;127;29062021165629
145;125;29062021165629
146;128;29062021165629
147;126;29062021165629
148;124;29062021165629
149;126;29062021165629
150;124;29062021165629
151;126;29062021165629
152;125;29062021165629
153;124;29062021165629
154;125;29062021165629
155;124;29062021165629
156;122;29062021165629
157;124;29062021165629
158;123;29062021165629
159;123;29062021165629
160;125;29062021165629
161;122;29062021165629
162;124;29062021165629
163;124;29062021165629
164;122;29062021165629
165;124;29062021165629
166;123;29062021165629
167;122;29062021165629
168;123;29062021165629
169;121;29062021165629
170;123;29062021165629
171;123;29062021165629
172;121;29062021165629
173;123;29062021165629
174;121;29062021165629
175;120;29062021165629
176;122;29062021165629
177;121;29062021165629
178;122;29062021165629
179;122;29062021165629
180;121;29062021165629
181;122;29062021165629
182;121;29062021165629
183;121;29062021165629
184;122;29062021165629
185;119;29062021165629
186;122;29062021165629
187;121;29062021165629
188;118;29062021165629
189;121;29062021165629
190;120;29062021165629
191;120;29062021165629
192;123;29062021165629
193;119;29062021165629
194;120;29062021165629
195;121;29062021165629
196;119;29062021165629
197;122;29062021165629
198;121;29062021165629
199;119;29062021165629
200;0;29062021165629
