ind;val;datetime;counter;delay
0;138;18082021182400;0;100
1;138;18082021182400;0;100
2;119;18082021182400;0;100
3;116;18082021182400;0;100
4;117;18082021182400;0;100
5;119;18082021182400;0;100
6;116;18082021182400;0;100
7;119;18082021182400;0;100
8;119;18082021182400;0;100
9;116;18082021182400;0;100
10;120;18082021182400;0;100
11;116;18082021182400;0;100
12;116;18082021182400;0;100
13;121;18082021182400;0;100
14;119;18082021182400;0;100
15;123;18082021182400;0;100
16;122;18082021182400;0;100
17;124;18082021182400;0;100
18;133;18082021182400;0;100
19;144;18082021182400;0;100
20;171;18082021182400;0;100
21;232;18082021182400;0;100
22;388;18082021182400;0;100
23;755;18082021182400;0;100
24;1023;18082021182400;0;100
25;1023;18082021182400;0;100
26;1023;18082021182400;0;100
27;1023;18082021182400;0;100
28;1023;18082021182400;0;100
29;1023;18082021182400;0;100
30;1023;18082021182400;0;100
31;943;18082021182400;0;100
32;676;18082021182400;0;100
33;492;18082021182400;0;100
34;377;18082021182400;0;100
35;297;18082021182400;0;100
36;241;18082021182400;0;100
37;212;18082021182400;0;100
38;186;18082021182400;0;100
39;173;18082021182400;0;100
40;163;18082021182400;0;100
41;156;18082021182400;0;100
42;155;18082021182400;0;100
43;154;18082021182400;0;100
44;155;18082021182400;0;100
45;157;18082021182400;0;100
46;157;18082021182400;0;100
47;158;18082021182400;0;100
48;159;18082021182400;0;100
49;158;18082021182400;0;100
50;158;18082021182400;0;100
51;154;18082021182400;0;100
52;151;18082021182400;0;100
53;154;18082021182400;0;100
54;154;18082021182400;0;100
55;150;18082021182400;0;100
56;153;18082021182400;0;100
57;154;18082021182400;0;100
58;156;18082021182400;0;100
59;156;18082021182400;0;100
60;157;18082021182400;0;100
61;160;18082021182400;0;100
62;159;18082021182400;0;100
63;161;18082021182400;0;100
64;164;18082021182400;0;100
65;158;18082021182400;0;100
66;161;18082021182400;0;100
67;160;18082021182400;0;100
68;158;18082021182400;0;100
69;160;18082021182400;0;100
70;156;18082021182400;0;100
71;156;18082021182400;0;100
72;154;18082021182400;0;100
73;150;18082021182400;0;100
74;152;18082021182400;0;100
75;149;18082021182400;0;100
76;147;18082021182400;0;100
77;148;18082021182400;0;100
78;145;18082021182400;0;100
79;146;18082021182400;0;100
80;144;18082021182400;0;100
81;142;18082021182400;0;100
82;142;18082021182400;0;100
83;138;18082021182400;0;100
84;136;18082021182400;0;100
85;137;18082021182400;0;100
86;135;18082021182400;0;100
87;136;18082021182400;0;100
88;135;18082021182400;0;100
89;131;18082021182400;0;100
90;135;18082021182400;0;100
91;134;18082021182400;0;100
92;131;18082021182400;0;100
93;133;18082021182400;0;100
94;131;18082021182400;0;100
95;128;18082021182400;0;100
96;129;18082021182400;0;100
97;128;18082021182400;0;100
98;128;18082021182400;0;100
99;128;18082021182400;0;100
100;125;18082021182400;0;100
101;128;18082021182400;0;100
102;125;18082021182400;0;100
103;126;18082021182400;0;100
104;125;18082021182400;0;100
105;123;18082021182400;0;100
106;126;18082021182400;0;100
107;123;18082021182400;0;100
108;123;18082021182400;0;100
109;124;18082021182400;0;100
110;120;18082021182400;0;100
111;121;18082021182400;0;100
112;123;18082021182400;0;100
113;119;18082021182400;0;100
114;122;18082021182400;0;100
115;122;18082021182400;0;100
116;119;18082021182400;0;100
117;123;18082021182400;0;100
118;119;18082021182400;0;100
119;121;18082021182400;0;100
0;137;18082021182400;0;50
1;137;18082021182400;0;50
2;116;18082021182400;0;50
3;114;18082021182400;0;50
4;115;18082021182400;0;50
5;116;18082021182400;0;50
6;112;18082021182400;0;50
7;115;18082021182400;0;50
8;116;18082021182400;0;50
9;114;18082021182400;0;50
10;117;18082021182400;0;50
11;114;18082021182400;0;50
12;113;18082021182400;0;50
13;116;18082021182400;0;50
14;115;18082021182400;0;50
15;118;18082021182400;0;50
16;117;18082021182400;0;50
17;116;18082021182400;0;50
18;123;18082021182400;0;50
19;128;18082021182400;0;50
20;141;18082021182400;0;50
21;173;18082021182400;0;50
22;250;18082021182400;0;50
23;444;18082021182400;0;50
24;813;18082021182400;0;50
25;1023;18082021182400;0;50
26;1023;18082021182400;0;50
27;1023;18082021182400;0;50
28;1023;18082021182400;0;50
29;1023;18082021182400;0;50
30;794;18082021182400;0;50
31;559;18082021182400;0;50
32;400;18082021182400;0;50
33;301;18082021182400;0;50
34;246;18082021182400;0;50
35;207;18082021182400;0;50
36;179;18082021182400;0;50
37;165;18082021182400;0;50
38;150;18082021182400;0;50
39;143;18082021182400;0;50
40;139;18082021182400;0;50
41;133;18082021182400;0;50
42;135;18082021182400;0;50
43;133;18082021182400;0;50
44;133;18082021182400;0;50
45;135;18082021182400;0;50
46;135;18082021182400;0;50
47;136;18082021182400;0;50
48;137;18082021182400;0;50
49;134;18082021182400;0;50
50;137;18082021182400;0;50
51;133;18082021182400;0;50
52;133;18082021182400;0;50
53;134;18082021182400;0;50
54;132;18082021182400;0;50
55;132;18082021182400;0;50
56;134;18082021182400;0;50
57;132;18082021182400;0;50
58;136;18082021182400;0;50
59;134;18082021182400;0;50
60;136;18082021182400;0;50
61;136;18082021182400;0;50
62;135;18082021182400;0;50
63;137;18082021182400;0;50
64;139;18082021182400;0;50
65;135;18082021182400;0;50
66;138;18082021182400;0;50
67;137;18082021182400;0;50
68;134;18082021182400;0;50
69;137;18082021182400;0;50
70;134;18082021182400;0;50
71;134;18082021182400;0;50
72;134;18082021182400;0;50
73;130;18082021182400;0;50
74;133;18082021182400;0;50
75;129;18082021182400;0;50
76;130;18082021182400;0;50
77;130;18082021182400;0;50
78;129;18082021182400;0;50
79;129;18082021182400;0;50
80;128;18082021182400;0;50
81;124;18082021182400;0;50
82;129;18082021182400;0;50
83;125;18082021182400;0;50
84;125;18082021182400;0;50
85;126;18082021182400;0;50
86;123;18082021182400;0;50
87;124;18082021182400;0;50
88;125;18082021182400;0;50
89;122;18082021182400;0;50
90;123;18082021182400;0;50
91;123;18082021182400;0;50
92;120;18082021182400;0;50
93;123;18082021182400;0;50
94;120;18082021182400;0;50
95;120;18082021182400;0;50
96;122;18082021182400;0;50
97;120;18082021182400;0;50
98;121;18082021182400;0;50
99;120;18082021182400;0;50
100;118;18082021182400;0;50
101;121;18082021182400;0;50
102;119;18082021182400;0;50
103;118;18082021182400;0;50
104;119;18082021182400;0;50
105;117;18082021182400;0;50
106;120;18082021182400;0;50
107;118;18082021182400;0;50
108;117;18082021182400;0;50
109;118;18082021182400;0;50
110;116;18082021182400;0;50
111;116;18082021182400;0;50
112;118;18082021182400;0;50
113;115;18082021182400;0;50
114;117;18082021182400;0;50
115;118;18082021182400;0;50
116;116;18082021182400;0;50
117;118;18082021182400;0;50
118;116;18082021182400;0;50
119;117;18082021182400;0;50
0;138;18082021182430;0;100
1;138;18082021182430;0;100
2;119;18082021182430;0;100
3;116;18082021182430;0;100
4;117;18082021182430;0;100
5;118;18082021182430;0;100
6;117;18082021182430;0;100
7;118;18082021182430;0;100
8;118;18082021182430;0;100
9;117;18082021182430;0;100
10;120;18082021182430;0;100
11;117;18082021182430;0;100
12;118;18082021182430;0;100
13;122;18082021182430;0;100
14;120;18082021182430;0;100
15;122;18082021182430;0;100
16;125;18082021182430;0;100
17;125;18082021182430;0;100
18;136;18082021182430;0;100
19;147;18082021182430;0;100
20;176;18082021182430;0;100
21;249;18082021182430;0;100
22;440;18082021182430;0;100
23;875;18082021182430;0;100
24;1023;18082021182430;0;100
25;1023;18082021182430;0;100
26;1023;18082021182430;0;100
27;1023;18082021182430;0;100
28;1023;18082021182430;0;100
29;1023;18082021182430;0;100
30;1023;18082021182430;0;100
31;841;18082021182430;0;100
32;588;18082021182430;0;100
33;434;18082021182430;0;100
34;334;18082021182430;0;100
35;270;18082021182430;0;100
36;227;18082021182430;0;100
37;200;18082021182430;0;100
38;178;18082021182430;0;100
39;170;18082021182430;0;100
40;162;18082021182430;0;100
41;154;18082021182430;0;100
42;157;18082021182430;0;100
43;156;18082021182430;0;100
44;157;18082021182430;0;100
45;161;18082021182430;0;100
46;160;18082021182430;0;100
47;161;18082021182430;0;100
48;160;18082021182430;0;100
49;159;18082021182430;0;100
50;161;18082021182430;0;100
51;157;18082021182430;0;100
52;153;18082021182430;0;100
53;155;18082021182430;0;100
54;154;18082021182430;0;100
55;153;18082021182430;0;100
56;155;18082021182430;0;100
57;156;18082021182430;0;100
58;160;18082021182430;0;100
59;160;18082021182430;0;100
60;159;18082021182430;0;100
61;163;18082021182430;0;100
62;161;18082021182430;0;100
63;164;18082021182430;0;100
64;165;18082021182430;0;100
65;161;18082021182430;0;100
66;164;18082021182430;0;100
67;163;18082021182430;0;100
68;160;18082021182430;0;100
69;161;18082021182430;0;100
70;158;18082021182430;0;100
71;156;18082021182430;0;100
72;158;18082021182430;0;100
73;152;18082021182430;0;100
74;154;18082021182430;0;100
75;151;18082021182430;0;100
76;150;18082021182430;0;100
77;150;18082021182430;0;100
78;148;18082021182430;0;100
79;147;18082021182430;0;100
80;147;18082021182430;0;100
81;141;18082021182430;0;100
82;143;18082021182430;0;100
83;139;18082021182430;0;100
84;136;18082021182430;0;100
85;138;18082021182430;0;100
86;136;18082021182430;0;100
87;136;18082021182430;0;100
88;136;18082021182430;0;100
89;131;18082021182430;0;100
90;136;18082021182430;0;100
91;134;18082021182430;0;100
92;132;18082021182430;0;100
93;132;18082021182430;0;100
94;132;18082021182430;0;100
95;128;18082021182430;0;100
96;131;18082021182430;0;100
97;128;18082021182430;0;100
98;128;18082021182430;0;100
99;128;18082021182430;0;100
100;126;18082021182430;0;100
101;129;18082021182430;0;100
102;126;18082021182430;0;100
103;125;18082021182430;0;100
104;126;18082021182430;0;100
105;122;18082021182430;0;100
106;127;18082021182430;0;100
107;124;18082021182430;0;100
108;123;18082021182430;0;100
109;124;18082021182430;0;100
110;122;18082021182430;0;100
111;122;18082021182430;0;100
112;124;18082021182430;0;100
113;120;18082021182430;0;100
114;121;18082021182430;0;100
115;122;18082021182430;0;100
116;121;18082021182430;0;100
117;123;18082021182430;0;100
118;119;18082021182430;0;100
119;121;18082021182430;0;100
0;137;18082021182430;0;50
1;137;18082021182430;0;50
2;116;18082021182430;0;50
3;113;18082021182430;0;50
4;115;18082021182430;0;50
5;117;18082021182430;0;50
6;114;18082021182430;0;50
7;115;18082021182430;0;50
8;116;18082021182430;0;50
9;113;18082021182430;0;50
10;116;18082021182430;0;50
11;114;18082021182430;0;50
12;114;18082021182430;0;50
13;117;18082021182430;0;50
14;116;18082021182430;0;50
15;118;18082021182430;0;50
16;119;18082021182430;0;50
17;118;18082021182430;0;50
18;124;18082021182430;0;50
19;129;18082021182430;0;50
20;144;18082021182430;0;50
21;179;18082021182430;0;50
22;270;18082021182430;0;50
23;498;18082021182430;0;50
24;890;18082021182430;0;50
25;1023;18082021182430;0;50
26;1023;18082021182430;0;50
27;1023;18082021182430;0;50
28;1023;18082021182430;0;50
29;982;18082021182430;0;50
30;713;18082021182430;0;50
31;504;18082021182430;0;50
32;362;18082021182430;0;50
33;277;18082021182430;0;50
34;230;18082021182430;0;50
35;194;18082021182430;0;50
36;170;18082021182430;0;50
37;158;18082021182430;0;50
38;146;18082021182430;0;50
39;142;18082021182430;0;50
40;138;18082021182430;0;50
41;133;18082021182430;0;50
42;135;18082021182430;0;50
43;132;18082021182430;0;50
44;135;18082021182430;0;50
45;137;18082021182430;0;50
46;135;18082021182430;0;50
47;135;18082021182430;0;50
48;138;18082021182430;0;50
49;134;18082021182430;0;50
50;137;18082021182430;0;50
51;133;18082021182430;0;50
52;132;18082021182430;0;50
53;135;18082021182430;0;50
54;133;18082021182430;0;50
55;133;18082021182430;0;50
56;133;18082021182430;0;50
57;133;18082021182430;0;50
58;136;18082021182430;0;50
59;135;18082021182430;0;50
60;136;18082021182430;0;50
61;138;18082021182430;0;50
62;135;18082021182430;0;50
63;138;18082021182430;0;50
64;139;18082021182430;0;50
65;136;18082021182430;0;50
66;137;18082021182430;0;50
67;137;18082021182430;0;50
68;135;18082021182430;0;50
69;137;18082021182430;0;50
70;133;18082021182430;0;50
71;133;18082021182430;0;50
72;135;18082021182430;0;50
73;131;18082021182430;0;50
74;133;18082021182430;0;50
75;130;18082021182430;0;50
76;130;18082021182430;0;50
77;131;18082021182430;0;50
78;129;18082021182430;0;50
79;129;18082021182430;0;50
80;130;18082021182430;0;50
81;127;18082021182430;0;50
82;128;18082021182430;0;50
83;126;18082021182430;0;50
84;125;18082021182430;0;50
85;126;18082021182430;0;50
86;123;18082021182430;0;50
87;124;18082021182430;0;50
88;125;18082021182430;0;50
89;122;18082021182430;0;50
90;124;18082021182430;0;50
91;123;18082021182430;0;50
92;122;18082021182430;0;50
93;123;18082021182430;0;50
94;122;18082021182430;0;50
95;120;18082021182430;0;50
96;122;18082021182430;0;50
97;120;18082021182430;0;50
98;121;18082021182430;0;50
99;120;18082021182430;0;50
100;118;18082021182430;0;50
101;122;18082021182430;0;50
102;119;18082021182430;0;50
103;118;18082021182430;0;50
104;118;18082021182430;0;50
105;116;18082021182430;0;50
106;120;18082021182430;0;50
107;118;18082021182430;0;50
108;117;18082021182430;0;50
109;119;18082021182430;0;50
110;115;18082021182430;0;50
111;117;18082021182430;0;50
112;119;18082021182430;0;50
113;116;18082021182430;0;50
114;116;18082021182430;0;50
115;117;18082021182430;0;50
116;116;18082021182430;0;50
117;119;18082021182430;0;50
118;116;18082021182430;0;50
119;117;18082021182430;0;50
0;138;18082021182500;161;100
1;138;18082021182500;161;100
2;119;18082021182500;161;100
3;117;18082021182500;161;100
4;118;18082021182500;161;100
5;119;18082021182500;161;100
6;117;18082021182500;161;100
7;119;18082021182500;161;100
8;119;18082021182500;161;100
9;117;18082021182500;161;100
10;121;18082021182500;161;100
11;119;18082021182500;161;100
12;119;18082021182500;161;100
13;122;18082021182500;161;100
14;121;18082021182500;161;100
15;125;18082021182500;161;100
16;126;18082021182500;161;100
17;128;18082021182500;161;100
18;141;18082021182500;161;100
19;157;18082021182500;161;100
20;196;18082021182500;161;100
21;296;18082021182500;161;100
22;565;18082021182500;161;100
23;1023;18082021182500;161;100
24;1023;18082021182500;161;100
25;1023;18082021182500;161;100
26;1023;18082021182500;161;100
27;1023;18082021182500;161;100
28;1023;18082021182500;161;100
29;1023;18082021182500;161;100
30;1023;18082021182500;161;100
31;999;18082021182500;161;100
32;733;18082021182500;161;100
33;529;18082021182500;161;100
34;404;18082021182500;161;100
35;323;18082021182500;161;100
36;258;18082021182500;161;100
37;225;18082021182500;161;100
38;197;18082021182500;161;100
39;183;18082021182500;161;100
40;177;18082021182500;161;100
41;165;18082021182500;161;100
42;166;18082021182500;161;100
43;165;18082021182500;161;100
44;167;18082021182500;161;100
45;166;18082021182500;161;100
46;170;18082021182500;161;100
47;169;18082021182500;161;100
48;170;18082021182500;161;100
49;167;18082021182500;161;100
50;169;18082021182500;161;100
51;164;18082021182500;161;100
52;164;18082021182500;161;100
53;164;18082021182500;161;100
54;162;18082021182500;161;100
55;164;18082021182500;161;100
56;166;18082021182500;161;100
57;165;18082021182500;161;100
58;170;18082021182500;161;100
59;168;18082021182500;161;100
60;169;18082021182500;161;100
61;170;18082021182500;161;100
62;174;18082021182500;161;100
63;173;18082021182500;161;100
64;175;18082021182500;161;100
65;170;18082021182500;161;100
66;174;18082021182500;161;100
67;172;18082021182500;161;100
68;170;18082021182500;161;100
69;171;18082021182500;161;100
70;168;18082021182500;161;100
71;164;18082021182500;161;100
72;166;18082021182500;161;100
73;159;18082021182500;161;100
74;161;18082021182500;161;100
75;158;18082021182500;161;100
76;158;18082021182500;161;100
77;157;18082021182500;161;100
78;154;18082021182500;161;100
79;152;18082021182500;161;100
80;152;18082021182500;161;100
81;147;18082021182500;161;100
82;150;18082021182500;161;100
83;144;18082021182500;161;100
84;143;18082021182500;161;100
85;142;18082021182500;161;100
86;142;18082021182500;161;100
87;141;18082021182500;161;100
88;141;18082021182500;161;100
89;136;18082021182500;161;100
90;140;18082021182500;161;100
91;137;18082021182500;161;100
92;135;18082021182500;161;100
93;138;18082021182500;161;100
94;134;18082021182500;161;100
95;132;18082021182500;161;100
96;133;18082021182500;161;100
97;131;18082021182500;161;100
98;131;18082021182500;161;100
99;130;18082021182500;161;100
100;128;18082021182500;161;100
101;131;18082021182500;161;100
102;129;18082021182500;161;100
103;128;18082021182500;161;100
104;127;18082021182500;161;100
105;125;18082021182500;161;100
106;129;18082021182500;161;100
107;125;18082021182500;161;100
108;126;18082021182500;161;100
109;127;18082021182500;161;100
110;123;18082021182500;161;100
111;123;18082021182500;161;100
112;125;18082021182500;161;100
113;122;18082021182500;161;100
114;123;18082021182500;161;100
115;123;18082021182500;161;100
116;122;18082021182500;161;100
117;124;18082021182500;161;100
118;121;18082021182500;161;100
119;122;18082021182500;161;100
0;137;18082021182500;161;50
1;137;18082021182500;161;50
2;117;18082021182500;161;50
3;114;18082021182500;161;50
4;115;18082021182500;161;50
5;117;18082021182500;161;50
6;114;18082021182500;161;50
7;115;18082021182500;161;50
8;116;18082021182500;161;50
9;115;18082021182500;161;50
10;117;18082021182500;161;50
11;114;18082021182500;161;50
12;114;18082021182500;161;50
13;118;18082021182500;161;50
14;116;18082021182500;161;50
15;119;18082021182500;161;50
16;119;18082021182500;161;50
17;120;18082021182500;161;50
18;127;18082021182500;161;50
19;134;18082021182500;161;50
20;153;18082021182500;161;50
21;202;18082021182500;161;50
22;331;18082021182500;161;50
23;638;18082021182500;161;50
24;1023;18082021182500;161;50
25;1023;18082021182500;161;50
26;1023;18082021182500;161;50
27;1023;18082021182500;161;50
28;1023;18082021182500;161;50
29;1023;18082021182500;161;50
30;881;18082021182500;161;50
31;622;18082021182500;161;50
32;440;18082021182500;161;50
33;328;18082021182500;161;50
34;264;18082021182500;161;50
35;221;18082021182500;161;50
36;186;18082021182500;161;50
37;171;18082021182500;161;50
38;154;18082021182500;161;50
39;148;18082021182500;161;50
40;146;18082021182500;161;50
41;139;18082021182500;161;50
42;139;18082021182500;161;50
43;137;18082021182500;161;50
44;140;18082021182500;161;50
45;141;18082021182500;161;50
46;140;18082021182500;161;50
47;139;18082021182500;161;50
48;140;18082021182500;161;50
49;139;18082021182500;161;50
50;141;18082021182500;161;50
51;137;18082021182500;161;50
52;136;18082021182500;161;50
53;139;18082021182500;161;50
54;136;18082021182500;161;50
55;137;18082021182500;161;50
56;138;18082021182500;161;50
57;137;18082021182500;161;50
58;139;18082021182500;161;50
59;139;18082021182500;161;50
60;141;18082021182500;161;50
61;143;18082021182500;161;50
62;142;18082021182500;161;50
63;143;18082021182500;161;50
64;145;18082021182500;161;50
65;141;18082021182500;161;50
66;143;18082021182500;161;50
67;141;18082021182500;161;50
68;141;18082021182500;161;50
69;142;18082021182500;161;50
70;139;18082021182500;161;50
71;138;18082021182500;161;50
72;139;18082021182500;161;50
73;136;18082021182500;161;50
74;137;18082021182500;161;50
75;134;18082021182500;161;50
76;134;18082021182500;161;50
77;135;18082021182500;161;50
78;132;18082021182500;161;50
79;133;18082021182500;161;50
80;132;18082021182500;161;50
81;129;18082021182500;161;50
82;132;18082021182500;161;50
83;129;18082021182500;161;50
84;127;18082021182500;161;50
85;128;18082021182500;161;50
86;125;18082021182500;161;50
87;126;18082021182500;161;50
88;127;18082021182500;161;50
89;123;18082021182500;161;50
90;127;18082021182500;161;50
91;125;18082021182500;161;50
92;122;18082021182500;161;50
93;125;18082021182500;161;50
94;123;18082021182500;161;50
95;122;18082021182500;161;50
96;124;18082021182500;161;50
97;121;18082021182500;161;50
98;122;18082021182500;161;50
99;121;18082021182500;161;50
100;119;18082021182500;161;50
101;123;18082021182500;161;50
102;120;18082021182500;161;50
103;120;18082021182500;161;50
104;120;18082021182500;161;50
105;118;18082021182500;161;50
106;121;18082021182500;161;50
107;118;18082021182500;161;50
108;118;18082021182500;161;50
109;119;18082021182500;161;50
110;117;18082021182500;161;50
111;118;18082021182500;161;50
112;120;18082021182500;161;50
113;116;18082021182500;161;50
114;118;18082021182500;161;50
115;119;18082021182500;161;50
116;116;18082021182500;161;50
117;121;18082021182500;161;50
118;117;18082021182500;161;50
119;117;18082021182500;161;50
0;138;18082021182530;247;100
1;138;18082021182530;247;100
2;118;18082021182530;247;100
3;116;18082021182530;247;100
4;118;18082021182530;247;100
5;118;18082021182530;247;100
6;117;18082021182530;247;100
7;120;18082021182530;247;100
8;120;18082021182530;247;100
9;118;18082021182530;247;100
10;121;18082021182530;247;100
11;119;18082021182530;247;100
12;118;18082021182530;247;100
13;122;18082021182530;247;100
14;121;18082021182530;247;100
15;124;18082021182530;247;100
16;126;18082021182530;247;100
17;128;18082021182530;247;100
18;139;18082021182530;247;100
19;157;18082021182530;247;100
20;193;18082021182530;247;100
21;287;18082021182530;247;100
22;544;18082021182530;247;100
23;1017;18082021182530;247;100
24;1023;18082021182530;247;100
25;1023;18082021182530;247;100
26;1023;18082021182530;247;100
27;1023;18082021182530;247;100
28;1023;18082021182530;247;100
29;1023;18082021182530;247;100
30;1023;18082021182530;247;100
31;978;18082021182530;247;100
32;706;18082021182530;247;100
33;508;18082021182530;247;100
34;391;18082021182530;247;100
35;307;18082021182530;247;100
36;253;18082021182530;247;100
37;221;18082021182530;247;100
38;194;18082021182530;247;100
39;182;18082021182530;247;100
40;173;18082021182530;247;100
41;166;18082021182530;247;100
42;166;18082021182530;247;100
43;165;18082021182530;247;100
44;166;18082021182530;247;100
45;169;18082021182530;247;100
46;169;18082021182530;247;100
47;170;18082021182530;247;100
48;172;18082021182530;247;100
49;169;18082021182530;247;100
50;169;18082021182530;247;100
51;166;18082021182530;247;100
52;163;18082021182530;247;100
53;166;18082021182530;247;100
54;165;18082021182530;247;100
55;163;18082021182530;247;100
56;167;18082021182530;247;100
57;164;18082021182530;247;100
58;173;18082021182530;247;100
59;170;18082021182530;247;100
60;172;18082021182530;247;100
61;175;18082021182530;247;100
62;174;18082021182530;247;100
63;176;18082021182530;247;100
64;177;18082021182530;247;100
65;174;18082021182530;247;100
66;176;18082021182530;247;100
67;174;18082021182530;247;100
68;174;18082021182530;247;100
69;173;18082021182530;247;100
70;168;18082021182530;247;100
71;167;18082021182530;247;100
72;167;18082021182530;247;100
73;162;18082021182530;247;100
74;163;18082021182530;247;100
75;159;18082021182530;247;100
76;158;18082021182530;247;100
77;159;18082021182530;247;100
78;156;18082021182530;247;100
79;155;18082021182530;247;100
80;155;18082021182530;247;100
81;148;18082021182530;247;100
82;150;18082021182530;247;100
83;147;18082021182530;247;100
84;144;18082021182530;247;100
85;146;18082021182530;247;100
86;142;18082021182530;247;100
87;144;18082021182530;247;100
88;143;18082021182530;247;100
89;138;18082021182530;247;100
90;140;18082021182530;247;100
91;138;18082021182530;247;100
92;135;18082021182530;247;100
93;136;18082021182530;247;100
94;135;18082021182530;247;100
95;133;18082021182530;247;100
96;135;18082021182530;247;100
97;132;18082021182530;247;100
98;131;18082021182530;247;100
99;131;18082021182530;247;100
100;128;18082021182530;247;100
101;132;18082021182530;247;100
102;129;18082021182530;247;100
103;128;18082021182530;247;100
104;128;18082021182530;247;100
105;126;18082021182530;247;100
106;128;18082021182530;247;100
107;125;18082021182530;247;100
108;126;18082021182530;247;100
109;127;18082021182530;247;100
110;124;18082021182530;247;100
111;124;18082021182530;247;100
112;126;18082021182530;247;100
113;122;18082021182530;247;100
114;123;18082021182530;247;100
115;125;18082021182530;247;100
116;123;18082021182530;247;100
117;126;18082021182530;247;100
118;122;18082021182530;247;100
119;122;18082021182530;247;100
0;137;18082021182530;247;50
1;137;18082021182530;247;50
2;116;18082021182530;247;50
3;115;18082021182530;247;50
4;115;18082021182530;247;50
5;116;18082021182530;247;50
6;114;18082021182530;247;50
7;115;18082021182530;247;50
8;116;18082021182530;247;50
9;115;18082021182530;247;50
10;117;18082021182530;247;50
11;115;18082021182530;247;50
12;114;18082021182530;247;50
13;118;18082021182530;247;50
14;116;18082021182530;247;50
15;119;18082021182530;247;50
16;120;18082021182530;247;50
17;120;18082021182530;247;50
18;126;18082021182530;247;50
19;132;18082021182530;247;50
20;152;18082021182530;247;50
21;198;18082021182530;247;50
22;321;18082021182530;247;50
23;622;18082021182530;247;50
24;1023;18082021182530;247;50
25;1023;18082021182530;247;50
26;1023;18082021182530;247;50
27;1023;18082021182530;247;50
28;1023;18082021182530;247;50
29;1023;18082021182530;247;50
30;851;18082021182530;247;50
31;594;18082021182530;247;50
32;422;18082021182530;247;50
33;319;18082021182530;247;50
34;258;18082021182530;247;50
35;213;18082021182530;247;50
36;184;18082021182530;247;50
37;170;18082021182530;247;50
38;154;18082021182530;247;50
39;147;18082021182530;247;50
40;144;18082021182530;247;50
41;139;18082021182530;247;50
42;140;18082021182530;247;50
43;138;18082021182530;247;50
44;140;18082021182530;247;50
45;142;18082021182530;247;50
46;141;18082021182530;247;50
47;143;18082021182530;247;50
48;143;18082021182530;247;50
49;140;18082021182530;247;50
50;142;18082021182530;247;50
51;139;18082021182530;247;50
52;138;18082021182530;247;50
53;140;18082021182530;247;50
54;138;18082021182530;247;50
55;138;18082021182530;247;50
56;140;18082021182530;247;50
57;138;18082021182530;247;50
58;142;18082021182530;247;50
59;142;18082021182530;247;50
60;142;18082021182530;247;50
61;144;18082021182530;247;50
62;142;18082021182530;247;50
63;143;18082021182530;247;50
64;147;18082021182530;247;50
65;142;18082021182530;247;50
66;145;18082021182530;247;50
67;143;18082021182530;247;50
68;142;18082021182530;247;50
69;144;18082021182530;247;50
70;139;18082021182530;247;50
71;139;18082021182530;247;50
72;143;18082021182530;247;50
73;136;18082021182530;247;50
74;138;18082021182530;247;50
75;136;18082021182530;247;50
76;135;18082021182530;247;50
77;136;18082021182530;247;50
78;133;18082021182530;247;50
79;135;18082021182530;247;50
80;134;18082021182530;247;50
81;129;18082021182530;247;50
82;133;18082021182530;247;50
83;129;18082021182530;247;50
84;127;18082021182530;247;50
85;129;18082021182530;247;50
86;126;18082021182530;247;50
87;128;18082021182530;247;50
88;128;18082021182530;247;50
89;124;18082021182530;247;50
90;127;18082021182530;247;50
91;125;18082021182530;247;50
92;123;18082021182530;247;50
93;125;18082021182530;247;50
94;124;18082021182530;247;50
95;123;18082021182530;247;50
96;125;18082021182530;247;50
97;122;18082021182530;247;50
98;122;18082021182530;247;50
99;122;18082021182530;247;50
100;120;18082021182530;247;50
101;123;18082021182530;247;50
102;121;18082021182530;247;50
103;120;18082021182530;247;50
104;120;18082021182530;247;50
105;119;18082021182530;247;50
106;121;18082021182530;247;50
107;119;18082021182530;247;50
108;120;18082021182530;247;50
109;119;18082021182530;247;50
110;117;18082021182530;247;50
111;118;18082021182530;247;50
112;121;18082021182530;247;50
113;117;18082021182530;247;50
114;117;18082021182530;247;50
115;119;18082021182530;247;50
116;117;18082021182530;247;50
117;120;18082021182530;247;50
118;117;18082021182530;247;50
119;118;18082021182530;247;50
