ind;val;datetime
0;0;29062021112423
1;149;29062021112423
2;186;29062021112423
3;181;29062021112423
4;186;29062021112423
5;188;29062021112423
6;191;29062021112423
7;196;29062021112423
8;204;29062021112423
9;202;29062021112423
10;215;29062021112423
11;217;29062021112423
12;227;29062021112423
13;244;29062021112423
14;263;29062021112423
15;293;29062021112423
16;340;29062021112423
17;429;29062021112423
18;604;29062021112423
19;925;29062021112423
20;1023;29062021112423
21;1023;29062021112423
22;1023;29062021112423
23;1023;29062021112423
24;1020;29062021112423
25;985;29062021112423
26;969;29062021112423
27;975;29062021112423
28;989;29062021112423
29;1016;29062021112423
30;1023;29062021112423
31;1023;29062021112423
32;1023;29062021112423
33;1023;29062021112423
34;1023;29062021112423
35;1023;29062021112423
36;1023;29062021112423
37;1023;29062021112423
38;1023;29062021112423
39;1006;29062021112423
40;840;29062021112423
41;695;29062021112423
42;598;29062021112423
43;515;29062021112423
44;465;29062021112423
45;429;29062021112423
46;394;29062021112423
47;370;29062021112423
48;352;29062021112423
49;332;29062021112423
50;320;29062021112423
51;307;29062021112423
52;297;29062021112423
53;289;29062021112423
54;283;29062021112423
55;275;29062021112423
56;275;29062021112423
57;272;29062021112423
58;275;29062021112423
59;273;29062021112423
60;272;29062021112423
61;272;29062021112423
62;266;29062021112423
63;261;29062021112423
64;259;29062021112423
65;248;29062021112423
66;250;29062021112423
67;243;29062021112423
68;239;29062021112423
69;237;29062021112423
70;237;29062021112423
71;235;29062021112423
72;236;29062021112423
73;236;29062021112423
74;240;29062021112423
75;236;29062021112423
76;232;29062021112423
77;230;29062021112423
78;226;29062021112423
79;222;29062021112423
80;212;29062021112423
81;202;29062021112423
82;200;29062021112423
83;194;29062021112423
84;187;29062021112423
85;185;29062021112423
86;178;29062021112423
87;178;29062021112423
88;171;29062021112423
89;162;29062021112423
90;164;29062021112423
91;156;29062021112423
92;151;29062021112423
93;156;29062021112423
94;152;29062021112423
95;151;29062021112423
96;152;29062021112423
97;148;29062021112423
98;147;29062021112423
99;146;29062021112423
100;144;29062021112423
101;150;29062021112423
102;146;29062021112423
103;144;29062021112423
104;144;29062021112423
105;142;29062021112423
106;144;29062021112423
107;142;29062021112423
108;142;29062021112423
109;143;29062021112423
110;139;29062021112423
111;139;29062021112423
112;142;29062021112423
113;139;29062021112423
114;139;29062021112423
115;140;29062021112423
116;140;29062021112423
117;142;29062021112423
118;138;29062021112423
119;141;29062021112423
120;140;29062021112423
121;138;29062021112423
122;141;29062021112423
123;141;29062021112423
124;141;29062021112423
125;141;29062021112423
126;136;29062021112423
127;139;29062021112423
128;142;29062021112423
129;137;29062021112423
130;137;29062021112423
131;136;29062021112423
132;135;29062021112423
133;144;29062021112423
134;135;29062021112423
135;136;29062021112423
136;136;29062021112423
137;134;29062021112423
138;138;29062021112423
139;134;29062021112423
140;135;29062021112423
141;138;29062021112423
142;136;29062021112423
143;133;29062021112423
144;137;29062021112423
145;134;29062021112423
146;136;29062021112423
147;138;29062021112423
148;135;29062021112423
149;135;29062021112423
150;135;29062021112423
151;137;29062021112423
152;134;29062021112423
153;134;29062021112423
154;134;29062021112423
155;136;29062021112423
156;134;29062021112423
157;134;29062021112423
158;133;29062021112423
159;133;29062021112423
160;133;29062021112423
161;133;29062021112423
162;136;29062021112423
163;135;29062021112423
164;135;29062021112423
165;138;29062021112423
166;133;29062021112423
167;135;29062021112423
168;137;29062021112423
169;131;29062021112423
170;136;29062021112423
171;134;29062021112423
172;132;29062021112423
173;136;29062021112423
174;132;29062021112423
175;133;29062021112423
176;136;29062021112423
177;132;29062021112423
178;137;29062021112423
179;134;29062021112423
180;133;29062021112423
181;134;29062021112423
182;135;29062021112423
183;133;29062021112423
184;134;29062021112423
185;131;29062021112423
186;136;29062021112423
187;133;29062021112423
188;134;29062021112423
189;135;29062021112423
190;133;29062021112423
191;135;29062021112423
192;137;29062021112423
193;133;29062021112423
194;138;29062021112423
195;136;29062021112423
196;134;29062021112423
197;134;29062021112423
198;134;29062021112423
199;134;29062021112423
200;0;29062021112423
0;0;29062021112424
1;150;29062021112424
2;185;29062021112424
3;182;29062021112424
4;185;29062021112424
5;189;29062021112424
6;191;29062021112424
7;197;29062021112424
8;201;29062021112424
9;204;29062021112424
10;215;29062021112424
11;221;29062021112424
12;227;29062021112424
13;243;29062021112424
14;262;29062021112424
15;293;29062021112424
16;344;29062021112424
17;429;29062021112424
18;607;29062021112424
19;927;29062021112424
20;1023;29062021112424
21;1023;29062021112424
22;1023;29062021112424
23;1023;29062021112424
24;1022;29062021112424
25;987;29062021112424
26;972;29062021112424
27;979;29062021112424
28;988;29062021112424
29;1015;29062021112424
30;1023;29062021112424
31;1023;29062021112424
32;1023;29062021112424
33;1023;29062021112424
34;1023;29062021112424
35;1023;29062021112424
36;1023;29062021112424
37;1023;29062021112424
38;1023;29062021112424
39;1018;29062021112424
40;853;29062021112424
41;706;29062021112424
42;604;29062021112424
43;519;29062021112424
44;470;29062021112424
45;433;29062021112424
46;397;29062021112424
47;374;29062021112424
48;350;29062021112424
49;330;29062021112424
50;321;29062021112424
51;307;29062021112424
52;298;29062021112424
53;293;29062021112424
54;283;29062021112424
55;281;29062021112424
56;275;29062021112424
57;272;29062021112424
58;273;29062021112424
59;271;29062021112424
60;272;29062021112424
61;271;29062021112424
62;263;29062021112424
63;260;29062021112424
64;262;29062021112424
65;249;29062021112424
66;249;29062021112424
67;245;29062021112424
68;239;29062021112424
69;238;29062021112424
70;237;29062021112424
71;237;29062021112424
72;238;29062021112424
73;235;29062021112424
74;240;29062021112424
75;238;29062021112424
76;234;29062021112424
77;231;29062021112424
78;227;29062021112424
79;222;29062021112424
80;214;29062021112424
81;203;29062021112424
82;200;29062021112424
83;192;29062021112424
84;186;29062021112424
85;182;29062021112424
86;179;29062021112424
87;177;29062021112424
88;171;29062021112424
89;162;29062021112424
90;163;29062021112424
91;155;29062021112424
92;150;29062021112424
93;155;29062021112424
94;152;29062021112424
95;149;29062021112424
96;150;29062021112424
97;147;29062021112424
98;146;29062021112424
99;147;29062021112424
100;144;29062021112424
101;149;29062021112424
102;147;29062021112424
103;144;29062021112424
104;144;29062021112424
105;142;29062021112424
106;143;29062021112424
107;142;29062021112424
108;142;29062021112424
109;143;29062021112424
110;140;29062021112424
111;139;29062021112424
112;141;29062021112424
113;138;29062021112424
114;139;29062021112424
115;140;29062021112424
116;139;29062021112424
117;141;29062021112424
118;138;29062021112424
119;141;29062021112424
120;139;29062021112424
121;138;29062021112424
122;141;29062021112424
123;141;29062021112424
124;142;29062021112424
125;141;29062021112424
126;138;29062021112424
127;139;29062021112424
128;140;29062021112424
129;138;29062021112424
130;136;29062021112424
131;136;29062021112424
132;134;29062021112424
133;143;29062021112424
134;134;29062021112424
135;135;29062021112424
136;135;29062021112424
137;134;29062021112424
138;138;29062021112424
139;135;29062021112424
140;135;29062021112424
141;138;29062021112424
142;135;29062021112424
143;132;29062021112424
144;137;29062021112424
145;134;29062021112424
146;135;29062021112424
147;137;29062021112424
148;133;29062021112424
149;136;29062021112424
150;135;29062021112424
151;137;29062021112424
152;133;29062021112424
153;133;29062021112424
154;135;29062021112424
155;136;29062021112424
156;135;29062021112424
157;134;29062021112424
158;133;29062021112424
159;131;29062021112424
160;132;29062021112424
161;133;29062021112424
162;135;29062021112424
163;136;29062021112424
164;135;29062021112424
165;136;29062021112424
166;133;29062021112424
167;135;29062021112424
168;136;29062021112424
169;131;29062021112424
170;135;29062021112424
171;132;29062021112424
172;132;29062021112424
173;136;29062021112424
174;133;29062021112424
175;133;29062021112424
176;135;29062021112424
177;131;29062021112424
178;137;29062021112424
179;134;29062021112424
180;133;29062021112424
181;134;29062021112424
182;135;29062021112424
183;132;29062021112424
184;135;29062021112424
185;131;29062021112424
186;136;29062021112424
187;134;29062021112424
188;133;29062021112424
189;136;29062021112424
190;132;29062021112424
191;135;29062021112424
192;137;29062021112424
193;133;29062021112424
194;136;29062021112424
195;134;29062021112424
196;133;29062021112424
197;135;29062021112424
198;135;29062021112424
199;133;29062021112424
200;0;29062021112424
0;0;29062021112424
1;150;29062021112424
2;184;29062021112424
3;182;29062021112424
4;187;29062021112424
5;188;29062021112424
6;189;29062021112424
7;197;29062021112424
8;202;29062021112424
9;203;29062021112424
10;211;29062021112424
11;218;29062021112424
12;226;29062021112424
13;245;29062021112424
14;258;29062021112424
15;291;29062021112424
16;339;29062021112424
17;429;29062021112424
18;602;29062021112424
19;917;29062021112424
20;1023;29062021112424
21;1023;29062021112424
22;1023;29062021112424
23;1023;29062021112424
24;1023;29062021112424
25;985;29062021112424
26;970;29062021112424
27;978;29062021112424
28;987;29062021112424
29;1015;29062021112424
30;1023;29062021112424
31;1023;29062021112424
32;1023;29062021112424
33;1023;29062021112424
34;1023;29062021112424
35;1023;29062021112424
36;1023;29062021112424
37;1023;29062021112424
38;1023;29062021112424
39;1020;29062021112424
40;856;29062021112424
41;710;29062021112424
42;604;29062021112424
43;526;29062021112424
44;471;29062021112424
45;432;29062021112424
46;397;29062021112424
47;368;29062021112424
48;352;29062021112424
49;331;29062021112424
50;320;29062021112424
51;309;29062021112424
52;296;29062021112424
53;292;29062021112424
54;284;29062021112424
55;278;29062021112424
56;275;29062021112424
57;272;29062021112424
58;275;29062021112424
59;270;29062021112424
60;270;29062021112424
61;266;29062021112424
62;264;29062021112424
63;263;29062021112424
64;263;29062021112424
65;250;29062021112424
66;248;29062021112424
67;241;29062021112424
68;238;29062021112424
69;237;29062021112424
70;234;29062021112424
71;235;29062021112424
72;237;29062021112424
73;234;29062021112424
74;239;29062021112424
75;235;29062021112424
76;234;29062021112424
77;231;29062021112424
78;226;29062021112424
79;223;29062021112424
80;213;29062021112424
81;203;29062021112424
82;199;29062021112424
83;192;29062021112424
84;187;29062021112424
85;184;29062021112424
86;179;29062021112424
87;177;29062021112424
88;170;29062021112424
89;162;29062021112424
90;163;29062021112424
91;155;29062021112424
92;151;29062021112424
93;155;29062021112424
94;151;29062021112424
95;148;29062021112424
96;150;29062021112424
97;147;29062021112424
98;147;29062021112424
99;145;29062021112424
100;142;29062021112424
101;149;29062021112424
102;147;29062021112424
103;143;29062021112424
104;145;29062021112424
105;142;29062021112424
106;143;29062021112424
107;140;29062021112424
108;142;29062021112424
109;142;29062021112424
110;139;29062021112424
111;138;29062021112424
112;142;29062021112424
113;139;29062021112424
114;140;29062021112424
115;140;29062021112424
116;139;29062021112424
117;140;29062021112424
118;139;29062021112424
119;140;29062021112424
120;139;29062021112424
121;139;29062021112424
122;140;29062021112424
123;140;29062021112424
124;140;29062021112424
125;140;29062021112424
126;136;29062021112424
127;138;29062021112424
128;141;29062021112424
129;137;29062021112424
130;136;29062021112424
131;136;29062021112424
132;134;29062021112424
133;142;29062021112424
134;134;29062021112424
135;134;29062021112424
136;136;29062021112424
137;133;29062021112424
138;137;29062021112424
139;134;29062021112424
140;135;29062021112424
141;137;29062021112424
142;134;29062021112424
143;132;29062021112424
144;136;29062021112424
145;132;29062021112424
146;135;29062021112424
147;136;29062021112424
148;132;29062021112424
149;135;29062021112424
150;135;29062021112424
151;135;29062021112424
152;133;29062021112424
153;133;29062021112424
154;135;29062021112424
155;136;29062021112424
156;133;29062021112424
157;134;29062021112424
158;133;29062021112424
159;132;29062021112424
160;132;29062021112424
161;133;29062021112424
162;134;29062021112424
163;135;29062021112424
164;134;29062021112424
165;136;29062021112424
166;133;29062021112424
167;135;29062021112424
168;136;29062021112424
169;131;29062021112424
170;135;29062021112424
171;133;29062021112424
172;132;29062021112424
173;135;29062021112424
174;133;29062021112424
175;133;29062021112424
176;134;29062021112424
177;132;29062021112424
178;137;29062021112424
179;134;29062021112424
180;133;29062021112424
181;134;29062021112424
182;136;29062021112424
183;132;29062021112424
184;134;29062021112424
185;129;29062021112424
186;135;29062021112424
187;134;29062021112424
188;133;29062021112424
189;135;29062021112424
190;132;29062021112424
191;134;29062021112424
192;137;29062021112424
193;134;29062021112424
194;137;29062021112424
195;135;29062021112424
196;134;29062021112424
197;133;29062021112424
198;135;29062021112424
199;132;29062021112424
200;0;29062021112424
0;0;29062021112425
1;149;29062021112425
2;185;29062021112425
3;182;29062021112425
4;186;29062021112425
5;186;29062021112425
6;190;29062021112425
7;197;29062021112425
8;202;29062021112425
9;203;29062021112425
10;211;29062021112425
11;222;29062021112425
12;226;29062021112425
13;244;29062021112425
14;261;29062021112425
15;292;29062021112425
16;339;29062021112425
17;427;29062021112425
18;606;29062021112425
19;920;29062021112425
20;1023;29062021112425
21;1023;29062021112425
22;1023;29062021112425
23;1023;29062021112425
24;1023;29062021112425
25;986;29062021112425
26;973;29062021112425
27;975;29062021112425
28;989;29062021112425
29;1015;29062021112425
30;1023;29062021112425
31;1023;29062021112425
32;1023;29062021112425
33;1023;29062021112425
34;1023;29062021112425
35;1023;29062021112425
36;1023;29062021112425
37;1023;29062021112425
38;1023;29062021112425
39;1023;29062021112425
40;865;29062021112425
41;709;29062021112425
42;608;29062021112425
43;522;29062021112425
44;472;29062021112425
45;431;29062021112425
46;398;29062021112425
47;370;29062021112425
48;352;29062021112425
49;333;29062021112425
50;321;29062021112425
51;309;29062021112425
52;296;29062021112425
53;291;29062021112425
54;284;29062021112425
55;279;29062021112425
56;276;29062021112425
57;272;29062021112425
58;274;29062021112425
59;273;29062021112425
60;268;29062021112425
61;272;29062021112425
62;263;29062021112425
63;260;29062021112425
64;262;29062021112425
65;250;29062021112425
66;248;29062021112425
67;243;29062021112425
68;239;29062021112425
69;238;29062021112425
70;236;29062021112425
71;233;29062021112425
72;236;29062021112425
73;234;29062021112425
74;239;29062021112425
75;236;29062021112425
76;235;29062021112425
77;231;29062021112425
78;227;29062021112425
79;221;29062021112425
80;212;29062021112425
81;202;29062021112425
82;201;29062021112425
83;194;29062021112425
84;188;29062021112425
85;183;29062021112425
86;179;29062021112425
87;177;29062021112425
88;170;29062021112425
89;162;29062021112425
90;162;29062021112425
91;156;29062021112425
92;151;29062021112425
93;156;29062021112425
94;152;29062021112425
95;148;29062021112425
96;149;29062021112425
97;148;29062021112425
98;145;29062021112425
99;146;29062021112425
100;143;29062021112425
101;150;29062021112425
102;146;29062021112425
103;144;29062021112425
104;145;29062021112425
105;142;29062021112425
106;143;29062021112425
107;141;29062021112425
108;143;29062021112425
109;143;29062021112425
110;139;29062021112425
111;139;29062021112425
112;141;29062021112425
113;137;29062021112425
114;138;29062021112425
115;140;29062021112425
116;137;29062021112425
117;141;29062021112425
118;138;29062021112425
119;141;29062021112425
120;140;29062021112425
121;138;29062021112425
122;141;29062021112425
123;139;29062021112425
124;141;29062021112425
125;139;29062021112425
126;137;29062021112425
127;140;29062021112425
128;141;29062021112425
129;137;29062021112425
130;136;29062021112425
131;136;29062021112425
132;134;29062021112425
133;142;29062021112425
134;133;29062021112425
135;134;29062021112425
136;136;29062021112425
137;133;29062021112425
138;136;29062021112425
139;135;29062021112425
140;134;29062021112425
141;137;29062021112425
142;134;29062021112425
143;132;29062021112425
144;136;29062021112425
145;133;29062021112425
146;134;29062021112425
147;137;29062021112425
148;134;29062021112425
149;136;29062021112425
150;135;29062021112425
151;136;29062021112425
152;135;29062021112425
153;133;29062021112425
154;137;29062021112425
155;137;29062021112425
156;134;29062021112425
157;134;29062021112425
158;133;29062021112425
159;133;29062021112425
160;134;29062021112425
161;133;29062021112425
162;136;29062021112425
163;137;29062021112425
164;136;29062021112425
165;136;29062021112425
166;134;29062021112425
167;136;29062021112425
168;136;29062021112425
169;131;29062021112425
170;136;29062021112425
171;133;29062021112425
172;132;29062021112425
173;138;29062021112425
174;134;29062021112425
175;133;29062021112425
176;136;29062021112425
177;133;29062021112425
178;137;29062021112425
179;135;29062021112425
180;133;29062021112425
181;134;29062021112425
182;137;29062021112425
183;133;29062021112425
184;135;29062021112425
185;132;29062021112425
186;136;29062021112425
187;134;29062021112425
188;133;29062021112425
189;135;29062021112425
190;133;29062021112425
191;136;29062021112425
192;137;29062021112425
193;134;29062021112425
194;137;29062021112425
195;136;29062021112425
196;134;29062021112425
197;134;29062021112425
198;135;29062021112425
199;133;29062021112425
200;0;29062021112425
0;0;29062021112426
1;149;29062021112426
2;186;29062021112426
3;182;29062021112426
4;186;29062021112426
5;187;29062021112426
6;190;29062021112426
7;198;29062021112426
8;201;29062021112426
9;200;29062021112426
10;213;29062021112426
11;219;29062021112426
12;226;29062021112426
13;243;29062021112426
14;259;29062021112426
15;292;29062021112426
16;338;29062021112426
17;427;29062021112426
18;605;29062021112426
19;918;29062021112426
20;1023;29062021112426
21;1023;29062021112426
22;1023;29062021112426
23;1023;29062021112426
24;1023;29062021112426
25;985;29062021112426
26;972;29062021112426
27;978;29062021112426
28;987;29062021112426
29;1012;29062021112426
30;1023;29062021112426
31;1023;29062021112426
32;1023;29062021112426
33;1023;29062021112426
34;1023;29062021112426
35;1023;29062021112426
36;1023;29062021112426
37;1023;29062021112426
38;1023;29062021112426
39;1023;29062021112426
40;866;29062021112426
41;714;29062021112426
42;611;29062021112426
43;523;29062021112426
44;478;29062021112426
45;434;29062021112426
46;399;29062021112426
47;369;29062021112426
48;351;29062021112426
49;332;29062021112426
50;319;29062021112426
51;308;29062021112426
52;298;29062021112426
53;289;29062021112426
54;284;29062021112426
55;275;29062021112426
56;276;29062021112426
57;273;29062021112426
58;275;29062021112426
59;268;29062021112426
60;269;29062021112426
61;268;29062021112426
62;263;29062021112426
63;259;29062021112426
64;258;29062021112426
65;249;29062021112426
66;249;29062021112426
67;243;29062021112426
68;239;29062021112426
69;237;29062021112426
70;235;29062021112426
71;232;29062021112426
72;238;29062021112426
73;234;29062021112426
74;238;29062021112426
75;238;29062021112426
76;236;29062021112426
77;230;29062021112426
78;225;29062021112426
79;223;29062021112426
80;212;29062021112426
81;202;29062021112426
82;201;29062021112426
83;191;29062021112426
84;187;29062021112426
85;183;29062021112426
86;180;29062021112426
87;177;29062021112426
88;170;29062021112426
89;161;29062021112426
90;163;29062021112426
91;155;29062021112426
92;152;29062021112426
93;155;29062021112426
94;151;29062021112426
95;148;29062021112426
96;150;29062021112426
97;148;29062021112426
98;146;29062021112426
99;145;29062021112426
100;143;29062021112426
101;151;29062021112426
102;146;29062021112426
103;143;29062021112426
104;143;29062021112426
105;141;29062021112426
106;143;29062021112426
107;140;29062021112426
108;142;29062021112426
109;141;29062021112426
110;139;29062021112426
111;138;29062021112426
112;142;29062021112426
113;138;29062021112426
114;139;29062021112426
115;140;29062021112426
116;138;29062021112426
117;142;29062021112426
118;138;29062021112426
119;140;29062021112426
120;140;29062021112426
121;138;29062021112426
122;141;29062021112426
123;139;29062021112426
124;140;29062021112426
125;139;29062021112426
126;137;29062021112426
127;138;29062021112426
128;140;29062021112426
129;137;29062021112426
130;135;29062021112426
131;135;29062021112426
132;132;29062021112426
133;142;29062021112426
134;134;29062021112426
135;133;29062021112426
136;136;29062021112426
137;134;29062021112426
138;138;29062021112426
139;135;29062021112426
140;134;29062021112426
141;136;29062021112426
142;134;29062021112426
143;131;29062021112426
144;136;29062021112426
145;133;29062021112426
146;135;29062021112426
147;137;29062021112426
148;133;29062021112426
149;136;29062021112426
150;135;29062021112426
151;136;29062021112426
152;133;29062021112426
153;133;29062021112426
154;134;29062021112426
155;137;29062021112426
156;133;29062021112426
157;133;29062021112426
158;132;29062021112426
159;132;29062021112426
160;133;29062021112426
161;132;29062021112426
162;135;29062021112426
163;135;29062021112426
164;134;29062021112426
165;137;29062021112426
166;133;29062021112426
167;135;29062021112426
168;136;29062021112426
169;131;29062021112426
170;135;29062021112426
171;134;29062021112426
172;132;29062021112426
173;137;29062021112426
174;133;29062021112426
175;132;29062021112426
176;135;29062021112426
177;132;29062021112426
178;138;29062021112426
179;134;29062021112426
180;133;29062021112426
181;134;29062021112426
182;136;29062021112426
183;133;29062021112426
184;133;29062021112426
185;130;29062021112426
186;136;29062021112426
187;134;29062021112426
188;133;29062021112426
189;135;29062021112426
190;133;29062021112426
191;134;29062021112426
192;137;29062021112426
193;133;29062021112426
194;137;29062021112426
195;135;29062021112426
196;133;29062021112426
197;133;29062021112426
198;134;29062021112426
199;132;29062021112426
200;0;29062021112426
0;0;29062021112426
1;149;29062021112426
2;185;29062021112426
3;180;29062021112426
4;186;29062021112426
5;189;29062021112426
6;192;29062021112426
7;196;29062021112426
8;203;29062021112426
9;202;29062021112426
10;212;29062021112426
11;218;29062021112426
12;225;29062021112426
13;246;29062021112426
14;259;29062021112426
15;290;29062021112426
16;336;29062021112426
17;424;29062021112426
18;604;29062021112426
19;914;29062021112426
20;1023;29062021112426
21;1023;29062021112426
22;1023;29062021112426
23;1023;29062021112426
24;1023;29062021112426
25;989;29062021112426
26;972;29062021112426
27;976;29062021112426
28;987;29062021112426
29;1011;29062021112426
30;1023;29062021112426
31;1023;29062021112426
32;1023;29062021112426
33;1023;29062021112426
34;1023;29062021112426
35;1023;29062021112426
36;1023;29062021112426
37;1023;29062021112426
38;1023;29062021112426
39;1023;29062021112426
40;870;29062021112426
41;719;29062021112426
42;610;29062021112426
43;525;29062021112426
44;474;29062021112426
45;431;29062021112426
46;399;29062021112426
47;372;29062021112426
48;350;29062021112426
49;333;29062021112426
50;322;29062021112426
51;308;29062021112426
52;295;29062021112426
53;291;29062021112426
54;280;29062021112426
55;275;29062021112426
56;275;29062021112426
57;272;29062021112426
58;272;29062021112426
59;271;29062021112426
60;269;29062021112426
61;267;29062021112426
62;262;29062021112426
63;259;29062021112426
64;260;29062021112426
65;250;29062021112426
66;247;29062021112426
67;243;29062021112426
68;239;29062021112426
69;238;29062021112426
70;233;29062021112426
71;233;29062021112426
72;235;29062021112426
73;234;29062021112426
74;238;29062021112426
75;236;29062021112426
76;236;29062021112426
77;228;29062021112426
78;224;29062021112426
79;222;29062021112426
80;213;29062021112426
81;202;29062021112426
82;199;29062021112426
83;192;29062021112426
84;186;29062021112426
85;182;29062021112426
86;178;29062021112426
87;175;29062021112426
88;169;29062021112426
89;161;29062021112426
90;161;29062021112426
91;154;29062021112426
92;152;29062021112426
93;156;29062021112426
94;152;29062021112426
95;149;29062021112426
96;150;29062021112426
97;147;29062021112426
98;146;29062021112426
99;145;29062021112426
100;143;29062021112426
101;148;29062021112426
102;147;29062021112426
103;143;29062021112426
104;144;29062021112426
105;141;29062021112426
106;143;29062021112426
107;141;29062021112426
108;142;29062021112426
109;142;29062021112426
110;139;29062021112426
111;139;29062021112426
112;141;29062021112426
113;138;29062021112426
114;137;29062021112426
115;140;29062021112426
116;139;29062021112426
117;141;29062021112426
118;138;29062021112426
119;140;29062021112426
120;139;29062021112426
121;138;29062021112426
122;140;29062021112426
123;140;29062021112426
124;139;29062021112426
125;139;29062021112426
126;136;29062021112426
127;138;29062021112426
128;140;29062021112426
129;137;29062021112426
130;135;29062021112426
131;135;29062021112426
132;133;29062021112426
133;141;29062021112426
134;134;29062021112426
135;134;29062021112426
136;136;29062021112426
137;133;29062021112426
138;138;29062021112426
139;134;29062021112426
140;134;29062021112426
141;137;29062021112426
142;134;29062021112426
143;131;29062021112426
144;135;29062021112426
145;133;29062021112426
146;135;29062021112426
147;136;29062021112426
148;134;29062021112426
149;136;29062021112426
150;136;29062021112426
151;136;29062021112426
152;133;29062021112426
153;131;29062021112426
154;135;29062021112426
155;136;29062021112426
156;134;29062021112426
157;133;29062021112426
158;132;29062021112426
159;132;29062021112426
160;133;29062021112426
161;132;29062021112426
162;133;29062021112426
163;136;29062021112426
164;135;29062021112426
165;136;29062021112426
166;133;29062021112426
167;135;29062021112426
168;137;29062021112426
169;131;29062021112426
170;135;29062021112426
171;132;29062021112426
172;132;29062021112426
173;136;29062021112426
174;133;29062021112426
175;133;29062021112426
176;134;29062021112426
177;132;29062021112426
178;136;29062021112426
179;133;29062021112426
180;132;29062021112426
181;132;29062021112426
182;136;29062021112426
183;133;29062021112426
184;133;29062021112426
185;130;29062021112426
186;135;29062021112426
187;133;29062021112426
188;132;29062021112426
189;135;29062021112426
190;132;29062021112426
191;136;29062021112426
192;137;29062021112426
193;133;29062021112426
194;138;29062021112426
195;134;29062021112426
196;133;29062021112426
197;133;29062021112426
198;134;29062021112426
199;132;29062021112426
200;0;29062021112426
0;0;29062021112427
1;150;29062021112427
2;183;29062021112427
3;182;29062021112427
4;184;29062021112427
5;189;29062021112427
6;191;29062021112427
7;197;29062021112427
8;201;29062021112427
9;202;29062021112427
10;211;29062021112427
11;217;29062021112427
12;228;29062021112427
13;245;29062021112427
14;262;29062021112427
15;291;29062021112427
16;340;29062021112427
17;422;29062021112427
18;602;29062021112427
19;914;29062021112427
20;1023;29062021112427
21;1023;29062021112427
22;1023;29062021112427
23;1023;29062021112427
24;1023;29062021112427
25;992;29062021112427
26;977;29062021112427
27;981;29062021112427
28;990;29062021112427
29;1016;29062021112427
30;1023;29062021112427
31;1023;29062021112427
32;1023;29062021112427
33;1023;29062021112427
34;1023;29062021112427
35;1023;29062021112427
36;1023;29062021112427
37;1023;29062021112427
38;1023;29062021112427
39;1023;29062021112427
40;871;29062021112427
41;716;29062021112427
42;611;29062021112427
43;528;29062021112427
44;474;29062021112427
45;433;29062021112427
46;400;29062021112427
47;370;29062021112427
48;352;29062021112427
49;333;29062021112427
50;319;29062021112427
51;312;29062021112427
52;297;29062021112427
53;292;29062021112427
54;281;29062021112427
55;279;29062021112427
56;276;29062021112427
57;273;29062021112427
58;274;29062021112427
59;273;29062021112427
60;270;29062021112427
61;269;29062021112427
62;263;29062021112427
63;261;29062021112427
64;260;29062021112427
65;250;29062021112427
66;248;29062021112427
67;243;29062021112427
68;240;29062021112427
69;238;29062021112427
70;235;29062021112427
71;235;29062021112427
72;239;29062021112427
73;235;29062021112427
74;236;29062021112427
75;235;29062021112427
76;235;29062021112427
77;230;29062021112427
78;227;29062021112427
79;223;29062021112427
80;213;29062021112427
81;202;29062021112427
82;201;29062021112427
83;192;29062021112427
84;186;29062021112427
85;184;29062021112427
86;181;29062021112427
87;177;29062021112427
88;172;29062021112427
89;162;29062021112427
90;163;29062021112427
91;155;29062021112427
92;151;29062021112427
93;157;29062021112427
94;152;29062021112427
95;148;29062021112427
96;150;29062021112427
97;147;29062021112427
98;146;29062021112427
99;147;29062021112427
100;144;29062021112427
101;151;29062021112427
102;147;29062021112427
103;144;29062021112427
104;143;29062021112427
105;141;29062021112427
106;144;29062021112427
107;143;29062021112427
108;143;29062021112427
109;143;29062021112427
110;139;29062021112427
111;140;29062021112427
112;143;29062021112427
113;138;29062021112427
114;139;29062021112427
115;141;29062021112427
116;140;29062021112427
117;142;29062021112427
118;139;29062021112427
119;141;29062021112427
120;138;29062021112427
121;137;29062021112427
122;140;29062021112427
123;140;29062021112427
124;142;29062021112427
125;140;29062021112427
126;138;29062021112427
127;140;29062021112427
128;142;29062021112427
129;138;29062021112427
130;137;29062021112427
131;136;29062021112427
132;135;29062021112427
133;143;29062021112427
134;135;29062021112427
135;135;29062021112427
136;137;29062021112427
137;133;29062021112427
138;138;29062021112427
139;135;29062021112427
140;135;29062021112427
141;138;29062021112427
142;135;29062021112427
143;132;29062021112427
144;136;29062021112427
145;133;29062021112427
146;137;29062021112427
147;138;29062021112427
148;134;29062021112427
149;136;29062021112427
150;137;29062021112427
151;136;29062021112427
152;133;29062021112427
153;134;29062021112427
154;137;29062021112427
155;137;29062021112427
156;135;29062021112427
157;134;29062021112427
158;133;29062021112427
159;134;29062021112427
160;134;29062021112427
161;134;29062021112427
162;136;29062021112427
163;136;29062021112427
164;136;29062021112427
165;137;29062021112427
166;134;29062021112427
167;135;29062021112427
168;137;29062021112427
169;131;29062021112427
170;135;29062021112427
171;134;29062021112427
172;133;29062021112427
173;137;29062021112427
174;132;29062021112427
175;133;29062021112427
176;135;29062021112427
177;133;29062021112427
178;136;29062021112427
179;135;29062021112427
180;133;29062021112427
181;135;29062021112427
182;137;29062021112427
183;133;29062021112427
184;135;29062021112427
185;131;29062021112427
186;135;29062021112427
187;134;29062021112427
188;133;29062021112427
189;136;29062021112427
190;133;29062021112427
191;137;29062021112427
192;138;29062021112427
193;134;29062021112427
194;137;29062021112427
195;135;29062021112427
196;134;29062021112427
197;135;29062021112427
198;136;29062021112427
199;134;29062021112427
200;0;29062021112427
0;0;29062021112427
1;149;29062021112427
2;184;29062021112427
3;181;29062021112427
4;185;29062021112427
5;185;29062021112427
6;188;29062021112427
7;197;29062021112427
8;201;29062021112427
9;200;29062021112427
10;213;29062021112427
11;218;29062021112427
12;226;29062021112427
13;244;29062021112427
14;258;29062021112427
15;289;29062021112427
16;335;29062021112427
17;424;29062021112427
18;600;29062021112427
19;911;29062021112427
20;1023;29062021112427
21;1023;29062021112427
22;1023;29062021112427
23;1023;29062021112427
24;1023;29062021112427
25;989;29062021112427
26;975;29062021112427
27;978;29062021112427
28;988;29062021112427
29;1011;29062021112427
30;1023;29062021112427
31;1023;29062021112427
32;1023;29062021112427
33;1023;29062021112427
34;1023;29062021112427
35;1023;29062021112427
36;1023;29062021112427
37;1023;29062021112427
38;1023;29062021112427
39;1023;29062021112427
40;872;29062021112427
41;717;29062021112427
42;608;29062021112427
43;528;29062021112427
44;474;29062021112427
45;432;29062021112427
46;397;29062021112427
47;371;29062021112427
48;351;29062021112427
49;333;29062021112427
50;318;29062021112427
51;307;29062021112427
52;296;29062021112427
53;290;29062021112427
54;281;29062021112427
55;277;29062021112427
56;272;29062021112427
57;274;29062021112427
58;271;29062021112427
59;269;29062021112427
60;269;29062021112427
61;267;29062021112427
62;263;29062021112427
63;258;29062021112427
64;260;29062021112427
65;248;29062021112427
66;246;29062021112427
67;242;29062021112427
68;239;29062021112427
69;237;29062021112427
70;236;29062021112427
71;233;29062021112427
72;235;29062021112427
73;235;29062021112427
74;236;29062021112427
75;235;29062021112427
76;233;29062021112427
77;231;29062021112427
78;225;29062021112427
79;223;29062021112427
80;213;29062021112427
81;202;29062021112427
82;200;29062021112427
83;193;29062021112427
84;187;29062021112427
85;182;29062021112427
86;179;29062021112427
87;175;29062021112427
88;169;29062021112427
89;162;29062021112427
90;162;29062021112427
91;155;29062021112427
92;151;29062021112427
93;156;29062021112427
94;151;29062021112427
95;148;29062021112427
96;149;29062021112427
97;147;29062021112427
98;147;29062021112427
99;147;29062021112427
100;142;29062021112427
101;150;29062021112427
102;147;29062021112427
103;143;29062021112427
104;144;29062021112427
105;140;29062021112427
106;144;29062021112427
107;141;29062021112427
108;142;29062021112427
109;143;29062021112427
110;139;29062021112427
111;139;29062021112427
112;142;29062021112427
113;138;29062021112427
114;139;29062021112427
115;140;29062021112427
116;139;29062021112427
117;142;29062021112427
118;137;29062021112427
119;140;29062021112427
120;140;29062021112427
121;139;29062021112427
122;142;29062021112427
123;139;29062021112427
124;141;29062021112427
125;140;29062021112427
126;137;29062021112427
127;139;29062021112427
128;141;29062021112427
129;137;29062021112427
130;136;29062021112427
131;136;29062021112427
132;134;29062021112427
133;142;29062021112427
134;135;29062021112427
135;135;29062021112427
136;137;29062021112427
137;132;29062021112427
138;138;29062021112427
139;135;29062021112427
140;133;29062021112427
141;136;29062021112427
142;135;29062021112427
143;133;29062021112427
144;136;29062021112427
145;133;29062021112427
146;137;29062021112427
147;136;29062021112427
148;133;29062021112427
149;135;29062021112427
150;136;29062021112427
151;135;29062021112427
152;134;29062021112427
153;132;29062021112427
154;135;29062021112427
155;137;29062021112427
156;134;29062021112427
157;133;29062021112427
158;132;29062021112427
159;132;29062021112427
160;132;29062021112427
161;132;29062021112427
162;136;29062021112427
163;135;29062021112427
164;135;29062021112427
165;136;29062021112427
166;133;29062021112427
167;135;29062021112427
168;136;29062021112427
169;131;29062021112427
170;135;29062021112427
171;133;29062021112427
172;132;29062021112427
173;136;29062021112427
174;133;29062021112427
175;132;29062021112427
176;134;29062021112427
177;132;29062021112427
178;137;29062021112427
179;133;29062021112427
180;133;29062021112427
181;134;29062021112427
182;135;29062021112427
183;132;29062021112427
184;133;29062021112427
185;130;29062021112427
186;136;29062021112427
187;134;29062021112427
188;133;29062021112427
189;135;29062021112427
190;133;29062021112427
191;136;29062021112427
192;138;29062021112427
193;132;29062021112427
194;136;29062021112427
195;134;29062021112427
196;133;29062021112427
197;133;29062021112427
198;134;29062021112427
199;133;29062021112427
200;0;29062021112427
0;0;29062021112428
1;150;29062021112428
2;186;29062021112428
3;181;29062021112428
4;187;29062021112428
5;188;29062021112428
6;189;29062021112428
7;195;29062021112428
8;201;29062021112428
9;203;29062021112428
10;214;29062021112428
11;216;29062021112428
12;225;29062021112428
13;245;29062021112428
14;260;29062021112428
15;290;29062021112428
16;337;29062021112428
17;423;29062021112428
18;603;29062021112428
19;913;29062021112428
20;1023;29062021112428
21;1023;29062021112428
22;1023;29062021112428
23;1023;29062021112428
24;1023;29062021112428
25;990;29062021112428
26;977;29062021112428
27;982;29062021112428
28;990;29062021112428
29;1014;29062021112428
30;1023;29062021112428
31;1023;29062021112428
32;1023;29062021112428
33;1023;29062021112428
34;1023;29062021112428
35;1023;29062021112428
36;1023;29062021112428
37;1023;29062021112428
38;1023;29062021112428
39;1023;29062021112428
40;877;29062021112428
41;721;29062021112428
42;614;29062021112428
43;532;29062021112428
44;477;29062021112428
45;432;29062021112428
46;400;29062021112428
47;373;29062021112428
48;353;29062021112428
49;334;29062021112428
50;322;29062021112428
51;309;29062021112428
52;300;29062021112428
53;290;29062021112428
54;281;29062021112428
55;278;29062021112428
56;273;29062021112428
57;272;29062021112428
58;270;29062021112428
59;270;29062021112428
60;269;29062021112428
61;267;29062021112428
62;262;29062021112428
63;262;29062021112428
64;260;29062021112428
65;251;29062021112428
66;249;29062021112428
67;245;29062021112428
68;240;29062021112428
69;236;29062021112428
70;234;29062021112428
71;235;29062021112428
72;236;29062021112428
73;235;29062021112428
74;237;29062021112428
75;235;29062021112428
76;234;29062021112428
77;232;29062021112428
78;226;29062021112428
79;222;29062021112428
80;215;29062021112428
81;201;29062021112428
82;199;29062021112428
83;192;29062021112428
84;187;29062021112428
85;183;29062021112428
86;178;29062021112428
87;176;29062021112428
88;170;29062021112428
89;160;29062021112428
90;164;29062021112428
91;154;29062021112428
92;150;29062021112428
93;154;29062021112428
94;152;29062021112428
95;149;29062021112428
96;151;29062021112428
97;146;29062021112428
98;146;29062021112428
99;147;29062021112428
100;143;29062021112428
101;150;29062021112428
102;148;29062021112428
103;143;29062021112428
104;145;29062021112428
105;141;29062021112428
106;144;29062021112428
107;141;29062021112428
108;143;29062021112428
109;144;29062021112428
110;138;29062021112428
111;139;29062021112428
112;141;29062021112428
113;139;29062021112428
114;140;29062021112428
115;141;29062021112428
116;139;29062021112428
117;141;29062021112428
118;139;29062021112428
119;141;29062021112428
120;140;29062021112428
121;138;29062021112428
122;141;29062021112428
123;140;29062021112428
124;142;29062021112428
125;140;29062021112428
126;137;29062021112428
127;139;29062021112428
128;141;29062021112428
129;138;29062021112428
130;137;29062021112428
131;136;29062021112428
132;134;29062021112428
133;142;29062021112428
134;135;29062021112428
135;136;29062021112428
136;136;29062021112428
137;134;29062021112428
138;138;29062021112428
139;135;29062021112428
140;135;29062021112428
141;137;29062021112428
142;135;29062021112428
143;134;29062021112428
144;136;29062021112428
145;133;29062021112428
146;135;29062021112428
147;138;29062021112428
148;134;29062021112428
149;135;29062021112428
150;136;29062021112428
151;136;29062021112428
152;133;29062021112428
153;133;29062021112428
154;136;29062021112428
155;136;29062021112428
156;135;29062021112428
157;134;29062021112428
158;134;29062021112428
159;132;29062021112428
160;134;29062021112428
161;133;29062021112428
162;135;29062021112428
163;135;29062021112428
164;136;29062021112428
165;137;29062021112428
166;133;29062021112428
167;136;29062021112428
168;136;29062021112428
169;130;29062021112428
170;135;29062021112428
171;133;29062021112428
172;133;29062021112428
173;137;29062021112428
174;133;29062021112428
175;133;29062021112428
176;135;29062021112428
177;132;29062021112428
178;137;29062021112428
179;135;29062021112428
180;133;29062021112428
181;133;29062021112428
182;136;29062021112428
183;134;29062021112428
184;135;29062021112428
185;131;29062021112428
186;138;29062021112428
187;134;29062021112428
188;133;29062021112428
189;135;29062021112428
190;132;29062021112428
191;136;29062021112428
192;138;29062021112428
193;133;29062021112428
194;137;29062021112428
195;135;29062021112428
196;134;29062021112428
197;135;29062021112428
198;135;29062021112428
199;133;29062021112428
200;0;29062021112428
