ind;val;datetime
0;0;SD true

0;0;datSD true

0;0;data.txt exists.

0;0;11082021131030
1;143;11082021131030
2;121;11082021131030
3;119;11082021131030
4;120;11082021131030
5;121;11082021131030
6;119;11082021131030
7;120;11082021131030
8;120;11082021131030
9;118;11082021131030
10;122;11082021131030
11;119;11082021131030
12;119;11082021131030
13;121;11082021131030
14;119;11082021131030
15;121;11082021131030
16;120;11082021131030
17;118;11082021131030
18;122;11082021131030
19;120;11082021131030
20;119;11082021131030
21;120;11082021131030
22;118;11082021131030
23;121;11082021131030
24;121;11082021131030
25;119;11082021131030
26;121;11082021131030
27;119;11082021131030
28;119;11082021131030
29;121;11082021131030
30;120;11082021131030
31;120;11082021131030
32;121;11082021131030
33;119;11082021131030
34;121;11082021131030
35;120;11082021131030
36;118;11082021131030
37;121;11082021131030
38;118;11082021131030
39;120;11082021131030
40;121;11082021131030
41;119;11082021131030
42;121;11082021131030
43;120;11082021131030
44;119;11082021131030
45;121;11082021131030
46;119;11082021131030
47;119;11082021131030
48;121;11082021131030
49;119;11082021131030
50;122;11082021131030
51;120;11082021131030
52;119;11082021131030
53;122;11082021131030
54;119;11082021131030
55;119;11082021131030
56;121;11082021131030
57;120;11082021131030
58;121;11082021131030
59;119;11082021131030
60;119;11082021131030
61;120;11082021131030
62;120;11082021131030
63;121;11082021131030
64;122;11082021131030
65;118;11082021131030
66;121;11082021131030
67;119;11082021131030
68;118;11082021131030
69;121;11082021131030
70;119;11082021131030
71;119;11082021131030
72;121;11082021131030
73;119;11082021131030
74;122;11082021131030
75;119;11082021131030
76;120;11082021131030
77;121;11082021131030
78;119;11082021131030
79;120;11082021131030
80;120;11082021131030
81;119;11082021131030
82;122;11082021131030
83;120;11082021131030
84;120;11082021131030
85;121;11082021131030
86;119;11082021131030
87;120;11082021131030
88;121;11082021131030
89;118;11082021131030
90;121;11082021131030
91;121;11082021131030
92;119;11082021131030
93;122;11082021131030
94;121;11082021131030
95;120;11082021131030
96;121;11082021131030
97;119;11082021131030
98;121;11082021131030
99;119;11082021131030
100;119;11082021131030
101;121;11082021131030
102;119;11082021131030
103;121;11082021131030
104;120;11082021131030
105;118;11082021131030
106;122;11082021131030
107;119;11082021131030
108;120;11082021131030
109;120;11082021131030
110;118;11082021131030
111;120;11082021131030
112;122;11082021131030
113;119;11082021131030
114;121;11082021131030
115;120;11082021131030
116;119;11082021131030
117;122;11082021131030
118;120;11082021131030
119;120;11082021131030
120;0;11082021131030
