ind;val;datetime
0;0;30062021115925
1;141;30062021115925
2;126;30062021115925
3;125;30062021115925
4;126;30062021115925
5;128;30062021115925
6;125;30062021115925
7;127;30062021115925
8;128;30062021115925
9;127;30062021115925
10;131;30062021115925
11;130;30062021115925
12;131;30062021115925
13;136;30062021115925
14;137;30062021115925
15;143;30062021115925
16;149;30062021115925
17;162;30062021115925
18;191;30062021115925
19;248;30062021115925
20;376;30062021115925
21;707;30062021115925
22;1023;30062021115925
23;1022;30062021115925
24;1023;30062021115925
25;1023;30062021115925
26;1023;30062021115925
27;1023;30062021115925
28;1023;30062021115925
29;1023;30062021115925
30;1023;30062021115925
31;1023;30062021115925
32;1023;30062021115925
33;1023;30062021115925
34;1023;30062021115925
35;1006;30062021115925
36;805;30062021115925
37;628;30062021115925
38;505;30062021115925
39;416;30062021115925
40;360;30062021115925
41;318;30062021115925
42;295;30062021115925
43;273;30062021115925
44;264;30062021115925
45;256;30062021115925
46;252;30062021115925
47;249;30062021115925
48;249;30062021115925
49;250;30062021115925
50;252;30062021115925
51;250;30062021115925
52;252;30062021115925
53;259;30062021115925
54;260;30062021115925
55;260;30062021115925
56;268;30062021115925
57;271;30062021115925
58;283;30062021115925
59;284;30062021115925
60;291;30062021115925
61;298;30062021115925
62;297;30062021115925
63;304;30062021115925
64;309;30062021115925
65;308;30062021115925
66;313;30062021115925
67;310;30062021115925
68;311;30062021115925
69;308;30062021115925
70;302;30062021115925
71;299;30062021115925
72;301;30062021115925
73;287;30062021115925
74;284;30062021115925
75;274;30062021115925
76;268;30062021115925
77;263;30062021115925
78;259;30062021115925
79;251;30062021115925
80;247;30062021115925
81;237;30062021115925
82;237;30062021115925
83;230;30062021115925
84;225;30062021115925
85;225;30062021115925
86;221;30062021115925
87;222;30062021115925
88;222;30062021115925
89;217;30062021115925
90;214;30062021115925
91;211;30062021115925
92;208;30062021115925
93;204;30062021115925
94;198;30062021115925
95;194;30062021115925
96;193;30062021115925
97;190;30062021115925
98;187;30062021115925
99;183;30062021115925
100;180;30062021115925
101;181;30062021115925
102;175;30062021115925
103;174;30062021115925
104;172;30062021115925
105;168;30062021115925
106;171;30062021115925
107;163;30062021115925
108;164;30062021115925
109;163;30062021115925
110;159;30062021115925
111;160;30062021115925
112;161;30062021115925
113;155;30062021115925
114;155;30062021115925
115;154;30062021115925
116;153;30062021115925
117;153;30062021115925
118;150;30062021115925
119;149;30062021115925
120;148;30062021115925
121;145;30062021115925
122;146;30062021115925
123;145;30062021115925
124;143;30062021115925
125;143;30062021115925
126;140;30062021115925
127;139;30062021115925
128;141;30062021115925
129;138;30062021115925
130;138;30062021115925
131;137;30062021115925
132;135;30062021115925
133;137;30062021115925
134;134;30062021115925
135;132;30062021115925
136;134;30062021115925
137;131;30062021115925
138;132;30062021115925
139;130;30062021115925
140;128;30062021115925
141;131;30062021115925
142;128;30062021115925
143;128;30062021115925
144;129;30062021115925
145;126;30062021115925
146;129;30062021115925
147;127;30062021115925
148;126;30062021115925
149;126;30062021115925
150;125;30062021115925
151;126;30062021115925
152;126;30062021115925
153;124;30062021115925
154;126;30062021115925
155;123;30062021115925
156;124;30062021115925
157;123;30062021115925
158;122;30062021115925
159;122;30062021115925
160;123;30062021115925
161;122;30062021115925
162;124;30062021115925
163;123;30062021115925
164;121;30062021115925
165;124;30062021115925
166;122;30062021115925
167;122;30062021115925
168;122;30062021115925
169;120;30062021115925
170;122;30062021115925
171;122;30062021115925
172;121;30062021115925
173;122;30062021115925
174;121;30062021115925
175;119;30062021115925
176;121;30062021115925
177;118;30062021115925
178;122;30062021115925
179;120;30062021115925
180;120;30062021115925
181;121;30062021115925
182;120;30062021115925
183;119;30062021115925
184;120;30062021115925
185;118;30062021115925
186;121;30062021115925
187;120;30062021115925
188;118;30062021115925
189;121;30062021115925
190;120;30062021115925
191;119;30062021115925
192;122;30062021115925
193;119;30062021115925
194;119;30062021115925
195;120;30062021115925
196;118;30062021115925
197;120;30062021115925
198;119;30062021115925
199;118;30062021115925
200;0;30062021115925
0;0;30062021115926
1;141;30062021115926
2;126;30062021115926
3;124;30062021115926
4;126;30062021115926
5;128;30062021115926
6;124;30062021115926
7;126;30062021115926
8;128;30062021115926
9;126;30062021115926
10;131;30062021115926
11;129;30062021115926
12;131;30062021115926
13;135;30062021115926
14;136;30062021115926
15;141;30062021115926
16;149;30062021115926
17;160;30062021115926
18;190;30062021115926
19;247;30062021115926
20;375;30062021115926
21;707;30062021115926
22;1023;30062021115926
23;1022;30062021115926
24;1023;30062021115926
25;1023;30062021115926
26;1023;30062021115926
27;1023;30062021115926
28;1023;30062021115926
29;1023;30062021115926
30;1023;30062021115926
31;1023;30062021115926
32;1023;30062021115926
33;1023;30062021115926
34;1023;30062021115926
35;1007;30062021115926
36;805;30062021115926
37;630;30062021115926
38;511;30062021115926
39;420;30062021115926
40;359;30062021115926
41;318;30062021115926
42;296;30062021115926
43;275;30062021115926
44;263;30062021115926
45;259;30062021115926
46;253;30062021115926
47;249;30062021115926
48;250;30062021115926
49;248;30062021115926
50;250;30062021115926
51;252;30062021115926
52;250;30062021115926
53;259;30062021115926
54;256;30062021115926
55;262;30062021115926
56;267;30062021115926
57;271;30062021115926
58;280;30062021115926
59;283;30062021115926
60;290;30062021115926
61;296;30062021115926
62;297;30062021115926
63;306;30062021115926
64;309;30062021115926
65;308;30062021115926
66;312;30062021115926
67;309;30062021115926
68;308;30062021115926
69;306;30062021115926
70;301;30062021115926
71;300;30062021115926
72;298;30062021115926
73;287;30062021115926
74;284;30062021115926
75;275;30062021115926
76;267;30062021115926
77;266;30062021115926
78;258;30062021115926
79;252;30062021115926
80;247;30062021115926
81;239;30062021115926
82;235;30062021115926
83;229;30062021115926
84;228;30062021115926
85;227;30062021115926
86;222;30062021115926
87;222;30062021115926
88;219;30062021115926
89;212;30062021115926
90;214;30062021115926
91;211;30062021115926
92;205;30062021115926
93;204;30062021115926
94;200;30062021115926
95;195;30062021115926
96;192;30062021115926
97;188;30062021115926
98;186;30062021115926
99;183;30062021115926
100;179;30062021115926
101;179;30062021115926
102;177;30062021115926
103;173;30062021115926
104;174;30062021115926
105;168;30062021115926
106;170;30062021115926
107;166;30062021115926
108;162;30062021115926
109;162;30062021115926
110;159;30062021115926
111;159;30062021115926
112;158;30062021115926
113;155;30062021115926
114;154;30062021115926
115;155;30062021115926
116;150;30062021115926
117;153;30062021115926
118;150;30062021115926
119;148;30062021115926
120;148;30062021115926
121;144;30062021115926
122;144;30062021115926
123;144;30062021115926
124;143;30062021115926
125;143;30062021115926
126;140;30062021115926
127;140;30062021115926
128;141;30062021115926
129;137;30062021115926
130;138;30062021115926
131;139;30062021115926
132;134;30062021115926
133;138;30062021115926
134;132;30062021115926
135;133;30062021115926
136;133;30062021115926
137;130;30062021115926
138;131;30062021115926
139;131;30062021115926
140;129;30062021115926
141;130;30062021115926
142;128;30062021115926
143;128;30062021115926
144;129;30062021115926
145;125;30062021115926
146;129;30062021115926
147;127;30062021115926
148;125;30062021115926
149;126;30062021115926
150;123;30062021115926
151;125;30062021115926
152;125;30062021115926
153;123;30062021115926
154;125;30062021115926
155;123;30062021115926
156;123;30062021115926
157;123;30062021115926
158;123;30062021115926
159;123;30062021115926
160;123;30062021115926
161;121;30062021115926
162;123;30062021115926
163;121;30062021115926
164;121;30062021115926
165;124;30062021115926
166;121;30062021115926
167;122;30062021115926
168;122;30062021115926
169;120;30062021115926
170;121;30062021115926
171;120;30062021115926
172;120;30062021115926
173;121;30062021115926
174;120;30062021115926
175;119;30062021115926
176;121;30062021115926
177;119;30062021115926
178;121;30062021115926
179;121;30062021115926
180;118;30062021115926
181;121;30062021115926
182;120;30062021115926
183;119;30062021115926
184;121;30062021115926
185;117;30062021115926
186;121;30062021115926
187;120;30062021115926
188;118;30062021115926
189;120;30062021115926
190;118;30062021115926
191;118;30062021115926
192;122;30062021115926
193;119;30062021115926
194;118;30062021115926
195;119;30062021115926
196;118;30062021115926
197;120;30062021115926
198;119;30062021115926
199;118;30062021115926
200;0;30062021115926
0;0;30062021115927
1;141;30062021115927
2;126;30062021115927
3;124;30062021115927
4;126;30062021115927
5;127;30062021115927
6;125;30062021115927
7;127;30062021115927
8;129;30062021115927
9;129;30062021115927
10;131;30062021115927
11;130;30062021115927
12;130;30062021115927
13;135;30062021115927
14;136;30062021115927
15;143;30062021115927
16;150;30062021115927
17;160;30062021115927
18;191;30062021115927
19;246;30062021115927
20;381;30062021115927
21;702;30062021115927
22;1023;30062021115927
23;1021;30062021115927
24;1023;30062021115927
25;1023;30062021115927
26;1023;30062021115927
27;1023;30062021115927
28;1023;30062021115927
29;1023;30062021115927
30;1023;30062021115927
31;1023;30062021115927
32;1023;30062021115927
33;1023;30062021115927
34;1023;30062021115927
35;1010;30062021115927
36;812;30062021115927
37;631;30062021115927
38;510;30062021115927
39;422;30062021115927
40;364;30062021115927
41;320;30062021115927
42;294;30062021115927
43;276;30062021115927
44;263;30062021115927
45;257;30062021115927
46;253;30062021115927
47;250;30062021115927
48;250;30062021115927
49;247;30062021115927
50;251;30062021115927
51;249;30062021115927
52;251;30062021115927
53;257;30062021115927
54;260;30062021115927
55;261;30062021115927
56;268;30062021115927
57;272;30062021115927
58;278;30062021115927
59;283;30062021115927
60;291;30062021115927
61;296;30062021115927
62;298;30062021115927
63;309;30062021115927
64;308;30062021115927
65;308;30062021115927
66;314;30062021115927
67;310;30062021115927
68;311;30062021115927
69;305;30062021115927
70;301;30062021115927
71;297;30062021115927
72;295;30062021115927
73;286;30062021115927
74;286;30062021115927
75;277;30062021115927
76;270;30062021115927
77;266;30062021115927
78;258;30062021115927
79;251;30062021115927
80;244;30062021115927
81;239;30062021115927
82;236;30062021115927
83;229;30062021115927
84;227;30062021115927
85;225;30062021115927
86;222;30062021115927
87;221;30062021115927
88;224;30062021115927
89;214;30062021115927
90;216;30062021115927
91;211;30062021115927
92;205;30062021115927
93;203;30062021115927
94;199;30062021115927
95;193;30062021115927
96;193;30062021115927
97;188;30062021115927
98;185;30062021115927
99;183;30062021115927
100;180;30062021115927
101;180;30062021115927
102;176;30062021115927
103;173;30062021115927
104;172;30062021115927
105;168;30062021115927
106;171;30062021115927
107;165;30062021115927
108;163;30062021115927
109;163;30062021115927
110;159;30062021115927
111;157;30062021115927
112;159;30062021115927
113;153;30062021115927
114;156;30062021115927
115;154;30062021115927
116;152;30062021115927
117;154;30062021115927
118;148;30062021115927
119;149;30062021115927
120;146;30062021115927
121;144;30062021115927
122;146;30062021115927
123;145;30062021115927
124;141;30062021115927
125;143;30062021115927
126;140;30062021115927
127;139;30062021115927
128;142;30062021115927
129;136;30062021115927
130;137;30062021115927
131;135;30062021115927
132;135;30062021115927
133;137;30062021115927
134;135;30062021115927
135;133;30062021115927
136;134;30062021115927
137;131;30062021115927
138;133;30062021115927
139;132;30062021115927
140;128;30062021115927
141;130;30062021115927
142;128;30062021115927
143;127;30062021115927
144;128;30062021115927
145;125;30062021115927
146;129;30062021115927
147;127;30062021115927
148;124;30062021115927
149;124;30062021115927
150;124;30062021115927
151;124;30062021115927
152;125;30062021115927
153;123;30062021115927
154;126;30062021115927
155;124;30062021115927
156;121;30062021115927
157;124;30062021115927
158;123;30062021115927
159;122;30062021115927
160;123;30062021115927
161;121;30062021115927
162;122;30062021115927
163;123;30062021115927
164;121;30062021115927
165;123;30062021115927
166;122;30062021115927
167;122;30062021115927
168;122;30062021115927
169;120;30062021115927
170;122;30062021115927
171;121;30062021115927
172;120;30062021115927
173;120;30062021115927
174;120;30062021115927
175;119;30062021115927
176;121;30062021115927
177;120;30062021115927
178;121;30062021115927
179;120;30062021115927
180;120;30062021115927
181;121;30062021115927
182;120;30062021115927
183;119;30062021115927
184;120;30062021115927
185;118;30062021115927
186;121;30062021115927
187;120;30062021115927
188;118;30062021115927
189;120;30062021115927
190;119;30062021115927
191;119;30062021115927
192;123;30062021115927
193;118;30062021115927
194;119;30062021115927
195;120;30062021115927
196;118;30062021115927
197;120;30062021115927
198;119;30062021115927
199;118;30062021115927
200;0;30062021115927
0;0;30062021115928
1;141;30062021115928
2;125;30062021115928
3;125;30062021115928
4;125;30062021115928
5;128;30062021115928
6;124;30062021115928
7;128;30062021115928
8;128;30062021115928
9;127;30062021115928
10;131;30062021115928
11;129;30062021115928
12;131;30062021115928
13;136;30062021115928
14;137;30062021115928
15;142;30062021115928
16;149;30062021115928
17;159;30062021115928
18;190;30062021115928
19;246;30062021115928
20;379;30062021115928
21;706;30062021115928
22;1023;30062021115928
23;1022;30062021115928
24;1023;30062021115928
25;1023;30062021115928
26;1023;30062021115928
27;1023;30062021115928
28;1023;30062021115928
29;1023;30062021115928
30;1023;30062021115928
31;1023;30062021115928
32;1023;30062021115928
33;1023;30062021115928
34;1023;30062021115928
35;1011;30062021115928
36;813;30062021115928
37;632;30062021115928
38;508;30062021115928
39;421;30062021115928
40;361;30062021115928
41;321;30062021115928
42;298;30062021115928
43;274;30062021115928
44;264;30062021115928
45;259;30062021115928
46;253;30062021115928
47;251;30062021115928
48;252;30062021115928
49;249;30062021115928
50;250;30062021115928
51;248;30062021115928
52;250;30062021115928
53;258;30062021115928
54;260;30062021115928
55;262;30062021115928
56;267;30062021115928
57;272;30062021115928
58;280;30062021115928
59;282;30062021115928
60;289;30062021115928
61;295;30062021115928
62;301;30062021115928
63;307;30062021115928
64;312;30062021115928
65;308;30062021115928
66;315;30062021115928
67;311;30062021115928
68;306;30062021115928
69;309;30062021115928
70;301;30062021115928
71;301;30062021115928
72;297;30062021115928
73;287;30062021115928
74;282;30062021115928
75;274;30062021115928
76;271;30062021115928
77;263;30062021115928
78;258;30062021115928
79;251;30062021115928
80;245;30062021115928
81;239;30062021115928
82;239;30062021115928
83;231;30062021115928
84;229;30062021115928
85;224;30062021115928
86;222;30062021115928
87;220;30062021115928
88;218;30062021115928
89;212;30062021115928
90;213;30062021115928
91;211;30062021115928
92;208;30062021115928
93;205;30062021115928
94;200;30062021115928
95;194;30062021115928
96;195;30062021115928
97;189;30062021115928
98;186;30062021115928
99;184;30062021115928
100;181;30062021115928
101;181;30062021115928
102;177;30062021115928
103;172;30062021115928
104;173;30062021115928
105;170;30062021115928
106;171;30062021115928
107;165;30062021115928
108;165;30062021115928
109;165;30062021115928
110;159;30062021115928
111;159;30062021115928
112;160;30062021115928
113;154;30062021115928
114;155;30062021115928
115;153;30062021115928
116;151;30062021115928
117;153;30062021115928
118;149;30062021115928
119;147;30062021115928
120;147;30062021115928
121;145;30062021115928
122;146;30062021115928
123;145;30062021115928
124;143;30062021115928
125;143;30062021115928
126;140;30062021115928
127;140;30062021115928
128;141;30062021115928
129;136;30062021115928
130;137;30062021115928
131;138;30062021115928
132;135;30062021115928
133;137;30062021115928
134;134;30062021115928
135;133;30062021115928
136;135;30062021115928
137;130;30062021115928
138;132;30062021115928
139;131;30062021115928
140;128;30062021115928
141;131;30062021115928
142;128;30062021115928
143;128;30062021115928
144;129;30062021115928
145;125;30062021115928
146;129;30062021115928
147;127;30062021115928
148;126;30062021115928
149;126;30062021115928
150;125;30062021115928
151;125;30062021115928
152;125;30062021115928
153;123;30062021115928
154;125;30062021115928
155;124;30062021115928
156;123;30062021115928
157;123;30062021115928
158;122;30062021115928
159;123;30062021115928
160;124;30062021115928
161;122;30062021115928
162;125;30062021115928
163;123;30062021115928
164;122;30062021115928
165;124;30062021115928
166;122;30062021115928
167;122;30062021115928
168;122;30062021115928
169;120;30062021115928
170;123;30062021115928
171;121;30062021115928
172;120;30062021115928
173;122;30062021115928
174;121;30062021115928
175;119;30062021115928
176;121;30062021115928
177;120;30062021115928
178;122;30062021115928
179;120;30062021115928
180;119;30062021115928
181;122;30062021115928
182;120;30062021115928
183;119;30062021115928
184;121;30062021115928
185;118;30062021115928
186;121;30062021115928
187;119;30062021115928
188;118;30062021115928
189;119;30062021115928
190;119;30062021115928
191;119;30062021115928
192;121;30062021115928
193;119;30062021115928
194;120;30062021115928
195;120;30062021115928
196;118;30062021115928
197;121;30062021115928
198;119;30062021115928
199;118;30062021115928
200;0;30062021115928
0;0;30062021115928
1;141;30062021115928
2;126;30062021115928
3;125;30062021115928
4;125;30062021115928
5;127;30062021115928
6;125;30062021115928
7;127;30062021115928
8;128;30062021115928
9;127;30062021115928
10;131;30062021115928
11;128;30062021115928
12;131;30062021115928
13;135;30062021115928
14;136;30062021115928
15;141;30062021115928
16;149;30062021115928
17;161;30062021115928
18;189;30062021115928
19;248;30062021115928
20;378;30062021115928
21;699;30062021115928
22;1023;30062021115928
23;1022;30062021115928
24;1023;30062021115928
25;1023;30062021115928
26;1023;30062021115928
27;1023;30062021115928
28;1023;30062021115928
29;1023;30062021115928
30;1023;30062021115928
31;1023;30062021115928
32;1023;30062021115928
33;1023;30062021115928
34;1023;30062021115928
35;1012;30062021115928
36;811;30062021115928
37;633;30062021115928
38;509;30062021115928
39;423;30062021115928
40;360;30062021115928
41;319;30062021115928
42;296;30062021115928
43;274;30062021115928
44;264;30062021115928
45;259;30062021115928
46;250;30062021115928
47;249;30062021115928
48;252;30062021115928
49;247;30062021115928
50;250;30062021115928
51;250;30062021115928
52;251;30062021115928
53;257;30062021115928
54;261;30062021115928
55;262;30062021115928
56;267;30062021115928
57;273;30062021115928
58;279;30062021115928
59;282;30062021115928
60;289;30062021115928
61;295;30062021115928
62;298;30062021115928
63;303;30062021115928
64;309;30062021115928
65;310;30062021115928
66;310;30062021115928
67;311;30062021115928
68;308;30062021115928
69;308;30062021115928
70;301;30062021115928
71;297;30062021115928
72;297;30062021115928
73;286;30062021115928
74;285;30062021115928
75;273;30062021115928
76;270;30062021115928
77;265;30062021115928
78;257;30062021115928
79;250;30062021115928
80;247;30062021115928
81;236;30062021115928
82;236;30062021115928
83;228;30062021115928
84;226;30062021115928
85;224;30062021115928
86;222;30062021115928
87;222;30062021115928
88;222;30062021115928
89;213;30062021115928
90;214;30062021115928
91;211;30062021115928
92;204;30062021115928
93;203;30062021115928
94;201;30062021115928
95;193;30062021115928
96;192;30062021115928
97;189;30062021115928
98;187;30062021115928
99;184;30062021115928
100;182;30062021115928
101;182;30062021115928
102;176;30062021115928
103;172;30062021115928
104;172;30062021115928
105;170;30062021115928
106;171;30062021115928
107;167;30062021115928
108;162;30062021115928
109;161;30062021115928
110;159;30062021115928
111;159;30062021115928
112;160;30062021115928
113;153;30062021115928
114;154;30062021115928
115;154;30062021115928
116;152;30062021115928
117;154;30062021115928
118;148;30062021115928
119;149;30062021115928
120;147;30062021115928
121;145;30062021115928
122;145;30062021115928
123;143;30062021115928
124;142;30062021115928
125;143;30062021115928
126;139;30062021115928
127;141;30062021115928
128;140;30062021115928
129;136;30062021115928
130;137;30062021115928
131;136;30062021115928
132;134;30062021115928
133;137;30062021115928
134;131;30062021115928
135;133;30062021115928
136;134;30062021115928
137;130;30062021115928
138;132;30062021115928
139;131;30062021115928
140;128;30062021115928
141;130;30062021115928
142;128;30062021115928
143;127;30062021115928
144;128;30062021115928
145;125;30062021115928
146;129;30062021115928
147;127;30062021115928
148;125;30062021115928
149;125;30062021115928
150;125;30062021115928
151;125;30062021115928
152;125;30062021115928
153;122;30062021115928
154;125;30062021115928
155;123;30062021115928
156;124;30062021115928
157;124;30062021115928
158;122;30062021115928
159;122;30062021115928
160;124;30062021115928
161;121;30062021115928
162;122;30062021115928
163;122;30062021115928
164;122;30062021115928
165;123;30062021115928
166;121;30062021115928
167;122;30062021115928
168;123;30062021115928
169;119;30062021115928
170;121;30062021115928
171;120;30062021115928
172;120;30062021115928
173;120;30062021115928
174;120;30062021115928
175;119;30062021115928
176;122;30062021115928
177;119;30062021115928
178;122;30062021115928
179;120;30062021115928
180;119;30062021115928
181;121;30062021115928
182;120;30062021115928
183;118;30062021115928
184;119;30062021115928
185;117;30062021115928
186;120;30062021115928
187;119;30062021115928
188;118;30062021115928
189;120;30062021115928
190;118;30062021115928
191;118;30062021115928
192;121;30062021115928
193;118;30062021115928
194;119;30062021115928
195;120;30062021115928
196;118;30062021115928
197;120;30062021115928
198;119;30062021115928
199;119;30062021115928
200;0;30062021115928
0;0;30062021115929
1;141;30062021115929
2;126;30062021115929
3;125;30062021115929
4;127;30062021115929
5;127;30062021115929
6;124;30062021115929
7;127;30062021115929
8;128;30062021115929
9;127;30062021115929
10;131;30062021115929
11;129;30062021115929
12;131;30062021115929
13;135;30062021115929
14;137;30062021115929
15;141;30062021115929
16;148;30062021115929
17;160;30062021115929
18;188;30062021115929
19;248;30062021115929
20;377;30062021115929
21;700;30062021115929
22;1023;30062021115929
23;1022;30062021115929
24;1023;30062021115929
25;1023;30062021115929
26;1023;30062021115929
27;1023;30062021115929
28;1023;30062021115929
29;1023;30062021115929
30;1023;30062021115929
31;1023;30062021115929
32;1023;30062021115929
33;1023;30062021115929
34;1023;30062021115929
35;1011;30062021115929
36;810;30062021115929
37;639;30062021115929
38;510;30062021115929
39;424;30062021115929
40;360;30062021115929
41;319;30062021115929
42;295;30062021115929
43;274;30062021115929
44;265;30062021115929
45;258;30062021115929
46;252;30062021115929
47;249;30062021115929
48;249;30062021115929
49;245;30062021115929
50;252;30062021115929
51;251;30062021115929
52;253;30062021115929
53;256;30062021115929
54;258;30062021115929
55;263;30062021115929
56;269;30062021115929
57;271;30062021115929
58;281;30062021115929
59;286;30062021115929
60;292;30062021115929
61;298;30062021115929
62;300;30062021115929
63;305;30062021115929
64;310;30062021115929
65;307;30062021115929
66;314;30062021115929
67;313;30062021115929
68;311;30062021115929
69;307;30062021115929
70;299;30062021115929
71;299;30062021115929
72;297;30062021115929
73;286;30062021115929
74;284;30062021115929
75;272;30062021115929
76;268;30062021115929
77;264;30062021115929
78;258;30062021115929
79;250;30062021115929
80;246;30062021115929
81;238;30062021115929
82;236;30062021115929
83;230;30062021115929
84;228;30062021115929
85;224;30062021115929
86;222;30062021115929
87;220;30062021115929
88;222;30062021115929
89;214;30062021115929
90;215;30062021115929
91;212;30062021115929
92;205;30062021115929
93;202;30062021115929
94;198;30062021115929
95;194;30062021115929
96;193;30062021115929
97;188;30062021115929
98;188;30062021115929
99;183;30062021115929
100;180;30062021115929
101;182;30062021115929
102;174;30062021115929
103;174;30062021115929
104;172;30062021115929
105;170;30062021115929
106;169;30062021115929
107;165;30062021115929
108;163;30062021115929
109;164;30062021115929
110;160;30062021115929
111;158;30062021115929
112;159;30062021115929
113;154;30062021115929
114;154;30062021115929
115;153;30062021115929
116;152;30062021115929
117;154;30062021115929
118;149;30062021115929
119;149;30062021115929
120;146;30062021115929
121;144;30062021115929
122;145;30062021115929
123;143;30062021115929
124;142;30062021115929
125;143;30062021115929
126;140;30062021115929
127;139;30062021115929
128;141;30062021115929
129;137;30062021115929
130;137;30062021115929
131;136;30062021115929
132;136;30062021115929
133;138;30062021115929
134;134;30062021115929
135;132;30062021115929
136;134;30062021115929
137;131;30062021115929
138;131;30062021115929
139;132;30062021115929
140;129;30062021115929
141;130;30062021115929
142;128;30062021115929
143;127;30062021115929
144;129;30062021115929
145;125;30062021115929
146;128;30062021115929
147;127;30062021115929
148;125;30062021115929
149;126;30062021115929
150;125;30062021115929
151;125;30062021115929
152;126;30062021115929
153;123;30062021115929
154;126;30062021115929
155;123;30062021115929
156;123;30062021115929
157;123;30062021115929
158;123;30062021115929
159;123;30062021115929
160;125;30062021115929
161;122;30062021115929
162;123;30062021115929
163;123;30062021115929
164;121;30062021115929
165;123;30062021115929
166;122;30062021115929
167;121;30062021115929
168;123;30062021115929
169;119;30062021115929
170;122;30062021115929
171;122;30062021115929
172;120;30062021115929
173;120;30062021115929
174;120;30062021115929
175;119;30062021115929
176;120;30062021115929
177;120;30062021115929
178;121;30062021115929
179;120;30062021115929
180;119;30062021115929
181;122;30062021115929
182;121;30062021115929
183;120;30062021115929
184;120;30062021115929
185;118;30062021115929
186;120;30062021115929
187;120;30062021115929
188;118;30062021115929
189;119;30062021115929
190;119;30062021115929
191;119;30062021115929
192;122;30062021115929
193;118;30062021115929
194;119;30062021115929
195;119;30062021115929
196;118;30062021115929
197;120;30062021115929
198;119;30062021115929
199;118;30062021115929
200;0;30062021115929
0;0;30062021115930
1;141;30062021115930
2;126;30062021115930
3;123;30062021115930
4;126;30062021115930
5;126;30062021115930
6;125;30062021115930
7;126;30062021115930
8;128;30062021115930
9;127;30062021115930
10;132;30062021115930
11;132;30062021115930
12;131;30062021115930
13;136;30062021115930
14;135;30062021115930
15;143;30062021115930
16;149;30062021115930
17;160;30062021115930
18;190;30062021115930
19;246;30062021115930
20;376;30062021115930
21;699;30062021115930
22;1023;30062021115930
23;1023;30062021115930
24;1023;30062021115930
25;1023;30062021115930
26;1023;30062021115930
27;1023;30062021115930
28;1023;30062021115930
29;1023;30062021115930
30;1023;30062021115930
31;1023;30062021115930
32;1023;30062021115930
33;1023;30062021115930
34;1023;30062021115930
35;1011;30062021115930
36;813;30062021115930
37;637;30062021115930
38;510;30062021115930
39;427;30062021115930
40;364;30062021115930
41;319;30062021115930
42;294;30062021115930
43;275;30062021115930
44;265;30062021115930
45;258;30062021115930
46;251;30062021115930
47;249;30062021115930
48;250;30062021115930
49;246;30062021115930
50;251;30062021115930
51;252;30062021115930
52;251;30062021115930
53;259;30062021115930
54;260;30062021115930
55;263;30062021115930
56;267;30062021115930
57;272;30062021115930
58;278;30062021115930
59;284;30062021115930
60;291;30062021115930
61;295;30062021115930
62;299;30062021115930
63;305;30062021115930
64;307;30062021115930
65;309;30062021115930
66;314;30062021115930
67;310;30062021115930
68;309;30062021115930
69;309;30062021115930
70;304;30062021115930
71;299;30062021115930
72;295;30062021115930
73;288;30062021115930
74;284;30062021115930
75;273;30062021115930
76;270;30062021115930
77;264;30062021115930
78;258;30062021115930
79;251;30062021115930
80;245;30062021115930
81;237;30062021115930
82;237;30062021115930
83;230;30062021115930
84;228;30062021115930
85;221;30062021115930
86;220;30062021115930
87;221;30062021115930
88;220;30062021115930
89;213;30062021115930
90;213;30062021115930
91;214;30062021115930
92;205;30062021115930
93;204;30062021115930
94;199;30062021115930
95;194;30062021115930
96;194;30062021115930
97;189;30062021115930
98;186;30062021115930
99;184;30062021115930
100;180;30062021115930
101;179;30062021115930
102;175;30062021115930
103;174;30062021115930
104;171;30062021115930
105;169;30062021115930
106;172;30062021115930
107;166;30062021115930
108;163;30062021115930
109;163;30062021115930
110;159;30062021115930
111;160;30062021115930
112;159;30062021115930
113;155;30062021115930
114;156;30062021115930
115;154;30062021115930
116;152;30062021115930
117;153;30062021115930
118;149;30062021115930
119;149;30062021115930
120;147;30062021115930
121;146;30062021115930
122;146;30062021115930
123;144;30062021115930
124;143;30062021115930
125;144;30062021115930
126;139;30062021115930
127;140;30062021115930
128;141;30062021115930
129;138;30062021115930
130;138;30062021115930
131;137;30062021115930
132;134;30062021115930
133;138;30062021115930
134;134;30062021115930
135;132;30062021115930
136;134;30062021115930
137;131;30062021115930
138;133;30062021115930
139;131;30062021115930
140;129;30062021115930
141;130;30062021115930
142;128;30062021115930
143;128;30062021115930
144;129;30062021115930
145;126;30062021115930
146;128;30062021115930
147;126;30062021115930
148;126;30062021115930
149;126;30062021115930
150;124;30062021115930
151;124;30062021115930
152;126;30062021115930
153;123;30062021115930
154;125;30062021115930
155;123;30062021115930
156;123;30062021115930
157;124;30062021115930
158;123;30062021115930
159;123;30062021115930
160;124;30062021115930
161;121;30062021115930
162;123;30062021115930
163;122;30062021115930
164;121;30062021115930
165;123;30062021115930
166;122;30062021115930
167;122;30062021115930
168;123;30062021115930
169;119;30062021115930
170;123;30062021115930
171;121;30062021115930
172;120;30062021115930
173;122;30062021115930
174;120;30062021115930
175;118;30062021115930
176;121;30062021115930
177;120;30062021115930
178;122;30062021115930
179;120;30062021115930
180;119;30062021115930
181;120;30062021115930
182;120;30062021115930
183;120;30062021115930
184;121;30062021115930
185;118;30062021115930
186;120;30062021115930
187;119;30062021115930
188;118;30062021115930
189;120;30062021115930
190;119;30062021115930
191;119;30062021115930
192;121;30062021115930
193;118;30062021115930
194;118;30062021115930
195;119;30062021115930
196;119;30062021115930
197;120;30062021115930
198;119;30062021115930
199;118;30062021115930
200;0;30062021115930
0;0;30062021115930
1;141;30062021115930
2;125;30062021115930
3;124;30062021115930
4;126;30062021115930
5;127;30062021115930
6;125;30062021115930
7;127;30062021115930
8;129;30062021115930
9;126;30062021115930
10;131;30062021115930
11;129;30062021115930
12;130;30062021115930
13;136;30062021115930
14;137;30062021115930
15;143;30062021115930
16;148;30062021115930
17;161;30062021115930
18;188;30062021115930
19;247;30062021115930
20;373;30062021115930
21;700;30062021115930
22;1023;30062021115930
23;1022;30062021115930
24;1023;30062021115930
25;1023;30062021115930
26;1023;30062021115930
27;1023;30062021115930
28;1023;30062021115930
29;1023;30062021115930
30;1023;30062021115930
31;1023;30062021115930
32;1023;30062021115930
33;1023;30062021115930
34;1023;30062021115930
35;1014;30062021115930
36;812;30062021115930
37;638;30062021115930
38;513;30062021115930
39;424;30062021115930
40;361;30062021115930
41;321;30062021115930
42;298;30062021115930
43;276;30062021115930
44;267;30062021115930
45;256;30062021115930
46;248;30062021115930
47;249;30062021115930
48;249;30062021115930
49;247;30062021115930
50;250;30062021115930
51;249;30062021115930
52;251;30062021115930
53;258;30062021115930
54;259;30062021115930
55;261;30062021115930
56;269;30062021115930
57;271;30062021115930
58;279;30062021115930
59;283;30062021115930
60;291;30062021115930
61;299;30062021115930
62;301;30062021115930
63;309;30062021115930
64;308;30062021115930
65;308;30062021115930
66;311;30062021115930
67;309;30062021115930
68;307;30062021115930
69;308;30062021115930
70;301;30062021115930
71;295;30062021115930
72;295;30062021115930
73;286;30062021115930
74;285;30062021115930
75;276;30062021115930
76;271;30062021115930
77;266;30062021115930
78;260;30062021115930
79;250;30062021115930
80;247;30062021115930
81;239;30062021115930
82;235;30062021115930
83;228;30062021115930
84;225;30062021115930
85;224;30062021115930
86;222;30062021115930
87;219;30062021115930
88;219;30062021115930
89;214;30062021115930
90;214;30062021115930
91;210;30062021115930
92;204;30062021115930
93;205;30062021115930
94;199;30062021115930
95;194;30062021115930
96;195;30062021115930
97;189;30062021115930
98;186;30062021115930
99;183;30062021115930
100;181;30062021115930
101;181;30062021115930
102;176;30062021115930
103;175;30062021115930
104;173;30062021115930
105;169;30062021115930
106;170;30062021115930
107;166;30062021115930
108;163;30062021115930
109;163;30062021115930
110;159;30062021115930
111;159;30062021115930
112;160;30062021115930
113;155;30062021115930
114;153;30062021115930
115;154;30062021115930
116;151;30062021115930
117;154;30062021115930
118;149;30062021115930
119;149;30062021115930
120;147;30062021115930
121;145;30062021115930
122;145;30062021115930
123;144;30062021115930
124;142;30062021115930
125;144;30062021115930
126;140;30062021115930
127;139;30062021115930
128;141;30062021115930
129;137;30062021115930
130;137;30062021115930
131;138;30062021115930
132;135;30062021115930
133;137;30062021115930
134;133;30062021115930
135;133;30062021115930
136;132;30062021115930
137;131;30062021115930
138;132;30062021115930
139;130;30062021115930
140;129;30062021115930
141;132;30062021115930
142;128;30062021115930
143;127;30062021115930
144;129;30062021115930
145;126;30062021115930
146;128;30062021115930
147;126;30062021115930
148;125;30062021115930
149;126;30062021115930
150;124;30062021115930
151;125;30062021115930
152;125;30062021115930
153;123;30062021115930
154;125;30062021115930
155;123;30062021115930
156;123;30062021115930
157;124;30062021115930
158;123;30062021115930
159;122;30062021115930
160;124;30062021115930
161;122;30062021115930
162;124;30062021115930
163;122;30062021115930
164;122;30062021115930
165;124;30062021115930
166;120;30062021115930
167;121;30062021115930
168;123;30062021115930
169;119;30062021115930
170;122;30062021115930
171;121;30062021115930
172;121;30062021115930
173;121;30062021115930
174;121;30062021115930
175;119;30062021115930
176;121;30062021115930
177;119;30062021115930
178;121;30062021115930
179;120;30062021115930
180;120;30062021115930
181;122;30062021115930
182;120;30062021115930
183;119;30062021115930
184;121;30062021115930
185;118;30062021115930
186;120;30062021115930
187;120;30062021115930
188;117;30062021115930
189;120;30062021115930
190;118;30062021115930
191;118;30062021115930
192;122;30062021115930
193;119;30062021115930
194;120;30062021115930
195;120;30062021115930
196;118;30062021115930
197;120;30062021115930
198;119;30062021115930
199;118;30062021115930
200;0;30062021115930
0;0;30062021115931
1;141;30062021115931
2;127;30062021115931
3;125;30062021115931
4;125;30062021115931
5;126;30062021115931
6;125;30062021115931
7;127;30062021115931
8;129;30062021115931
9;128;30062021115931
10;130;30062021115931
11;129;30062021115931
12;131;30062021115931
13;136;30062021115931
14;136;30062021115931
15;142;30062021115931
16;150;30062021115931
17;161;30062021115931
18;190;30062021115931
19;246;30062021115931
20;376;30062021115931
21;698;30062021115931
22;1023;30062021115931
23;1023;30062021115931
24;1023;30062021115931
25;1023;30062021115931
26;1023;30062021115931
27;1023;30062021115931
28;1023;30062021115931
29;1023;30062021115931
30;1023;30062021115931
31;1023;30062021115931
32;1023;30062021115931
33;1023;30062021115931
34;1023;30062021115931
35;1012;30062021115931
36;819;30062021115931
37;635;30062021115931
38;514;30062021115931
39;426;30062021115931
40;362;30062021115931
41;318;30062021115931
42;296;30062021115931
43;278;30062021115931
44;266;30062021115931
45;257;30062021115931
46;249;30062021115931
47;247;30062021115931
48;251;30062021115931
49;247;30062021115931
50;250;30062021115931
51;251;30062021115931
52;250;30062021115931
53;259;30062021115931
54;260;30062021115931
55;261;30062021115931
56;267;30062021115931
57;271;30062021115931
58;281;30062021115931
59;284;30062021115931
60;289;30062021115931
61;297;30062021115931
62;299;30062021115931
63;306;30062021115931
64;308;30062021115931
65;308;30062021115931
66;310;30062021115931
67;312;30062021115931
68;308;30062021115931
69;310;30062021115931
70;302;30062021115931
71;297;30062021115931
72;296;30062021115931
73;285;30062021115931
74;286;30062021115931
75;274;30062021115931
76;268;30062021115931
77;266;30062021115931
78;257;30062021115931
79;250;30062021115931
80;247;30062021115931
81;237;30062021115931
82;235;30062021115931
83;227;30062021115931
84;228;30062021115931
85;226;30062021115931
86;221;30062021115931
87;220;30062021115931
88;221;30062021115931
89;213;30062021115931
90;214;30062021115931
91;210;30062021115931
92;205;30062021115931
93;203;30062021115931
94;200;30062021115931
95;193;30062021115931
96;193;30062021115931
97;188;30062021115931
98;184;30062021115931
99;185;30062021115931
100;180;30062021115931
101;181;30062021115931
102;176;30062021115931
103;176;30062021115931
104;171;30062021115931
105;168;30062021115931
106;170;30062021115931
107;166;30062021115931
108;163;30062021115931
109;163;30062021115931
110;159;30062021115931
111;157;30062021115931
112;159;30062021115931
113;154;30062021115931
114;155;30062021115931
115;155;30062021115931
116;152;30062021115931
117;152;30062021115931
118;148;30062021115931
119;148;30062021115931
120;145;30062021115931
121;145;30062021115931
122;144;30062021115931
123;144;30062021115931
124;143;30062021115931
125;142;30062021115931
126;140;30062021115931
127;140;30062021115931
128;140;30062021115931
129;136;30062021115931
130;137;30062021115931
131;137;30062021115931
132;134;30062021115931
133;137;30062021115931
134;133;30062021115931
135;134;30062021115931
136;134;30062021115931
137;130;30062021115931
138;132;30062021115931
139;131;30062021115931
140;129;30062021115931
141;131;30062021115931
142;128;30062021115931
143;127;30062021115931
144;129;30062021115931
145;125;30062021115931
146;129;30062021115931
147;127;30062021115931
148;126;30062021115931
149;125;30062021115931
150;125;30062021115931
151;125;30062021115931
152;125;30062021115931
153;124;30062021115931
154;125;30062021115931
155;124;30062021115931
156;123;30062021115931
157;125;30062021115931
158;122;30062021115931
159;123;30062021115931
160;123;30062021115931
161;121;30062021115931
162;123;30062021115931
163;122;30062021115931
164;122;30062021115931
165;125;30062021115931
166;122;30062021115931
167;122;30062021115931
168;122;30062021115931
169;120;30062021115931
170;122;30062021115931
171;122;30062021115931
172;121;30062021115931
173;121;30062021115931
174;120;30062021115931
175;119;30062021115931
176;121;30062021115931
177;119;30062021115931
178;121;30062021115931
179;120;30062021115931
180;120;30062021115931
181;122;30062021115931
182;120;30062021115931
183;119;30062021115931
184;121;30062021115931
185;118;30062021115931
186;121;30062021115931
187;119;30062021115931
188;118;30062021115931
189;120;30062021115931
190;119;30062021115931
191;119;30062021115931
192;122;30062021115931
193;118;30062021115931
194;119;30062021115931
195;119;30062021115931
196;118;30062021115931
197;120;30062021115931
198;119;30062021115931
199;118;30062021115931
200;0;30062021115931
0;0;30062021115932
1;141;30062021115932
2;127;30062021115932
3;125;30062021115932
4;125;30062021115932
5;127;30062021115932
6;125;30062021115932
7;126;30062021115932
8;128;30062021115932
9;127;30062021115932
10;130;30062021115932
11;129;30062021115932
12;131;30062021115932
13;136;30062021115932
14;136;30062021115932
15;142;30062021115932
16;149;30062021115932
17;160;30062021115932
18;191;30062021115932
19;244;30062021115932
20;374;30062021115932
21;703;30062021115932
22;1023;30062021115932
23;1022;30062021115932
24;1023;30062021115932
25;1023;30062021115932
26;1023;30062021115932
27;1023;30062021115932
28;1023;30062021115932
29;1023;30062021115932
30;1023;30062021115932
31;1023;30062021115932
32;1023;30062021115932
33;1023;30062021115932
34;1023;30062021115932
35;1012;30062021115932
36;814;30062021115932
37;641;30062021115932
38;514;30062021115932
39;425;30062021115932
40;368;30062021115932
41;321;30062021115932
42;296;30062021115932
43;275;30062021115932
44;266;30062021115932
45;257;30062021115932
46;252;30062021115932
47;249;30062021115932
48;249;30062021115932
49;246;30062021115932
50;251;30062021115932
51;249;30062021115932
52;250;30062021115932
53;258;30062021115932
54;260;30062021115932
55;261;30062021115932
56;267;30062021115932
57;272;30062021115932
58;279;30062021115932
59;283;30062021115932
60;289;30062021115932
61;297;30062021115932
62;298;30062021115932
63;306;30062021115932
64;306;30062021115932
65;306;30062021115932
66;315;30062021115932
67;310;30062021115932
68;309;30062021115932
69;305;30062021115932
70;301;30062021115932
71;297;30062021115932
72;292;30062021115932
73;287;30062021115932
74;284;30062021115932
75;274;30062021115932
76;269;30062021115932
77;268;30062021115932
78;258;30062021115932
79;251;30062021115932
80;245;30062021115932
81;236;30062021115932
82;237;30062021115932
83;230;30062021115932
84;227;30062021115932
85;225;30062021115932
86;222;30062021115932
87;220;30062021115932
88;219;30062021115932
89;214;30062021115932
90;215;30062021115932
91;211;30062021115932
92;204;30062021115932
93;202;30062021115932
94;197;30062021115932
95;195;30062021115932
96;194;30062021115932
97;187;30062021115932
98;186;30062021115932
99;184;30062021115932
100;179;30062021115932
101;179;30062021115932
102;175;30062021115932
103;172;30062021115932
104;171;30062021115932
105;169;30062021115932
106;170;30062021115932
107;166;30062021115932
108;165;30062021115932
109;165;30062021115932
110;160;30062021115932
111;158;30062021115932
112;159;30062021115932
113;154;30062021115932
114;154;30062021115932
115;153;30062021115932
116;153;30062021115932
117;153;30062021115932
118;149;30062021115932
119;149;30062021115932
120;145;30062021115932
121;144;30062021115932
122;145;30062021115932
123;143;30062021115932
124;142;30062021115932
125;144;30062021115932
126;140;30062021115932
127;139;30062021115932
128;140;30062021115932
129;137;30062021115932
130;137;30062021115932
131;137;30062021115932
132;134;30062021115932
133;138;30062021115932
134;133;30062021115932
135;133;30062021115932
136;134;30062021115932
137;131;30062021115932
138;133;30062021115932
139;129;30062021115932
140;129;30062021115932
141;130;30062021115932
142;129;30062021115932
143;127;30062021115932
144;129;30062021115932
145;126;30062021115932
146;128;30062021115932
147;126;30062021115932
148;124;30062021115932
149;126;30062021115932
150;125;30062021115932
151;126;30062021115932
152;124;30062021115932
153;123;30062021115932
154;125;30062021115932
155;123;30062021115932
156;122;30062021115932
157;124;30062021115932
158;122;30062021115932
159;123;30062021115932
160;124;30062021115932
161;122;30062021115932
162;124;30062021115932
163;123;30062021115932
164;121;30062021115932
165;124;30062021115932
166;122;30062021115932
167;122;30062021115932
168;123;30062021115932
169;120;30062021115932
170;121;30062021115932
171;122;30062021115932
172;121;30062021115932
173;122;30062021115932
174;119;30062021115932
175;119;30062021115932
176;121;30062021115932
177;120;30062021115932
178;121;30062021115932
179;121;30062021115932
180;120;30062021115932
181;121;30062021115932
182;121;30062021115932
183;119;30062021115932
184;121;30062021115932
185;118;30062021115932
186;121;30062021115932
187;120;30062021115932
188;118;30062021115932
189;120;30062021115932
190;118;30062021115932
191;119;30062021115932
192;122;30062021115932
193;118;30062021115932
194;118;30062021115932
195;120;30062021115932
196;119;30062021115932
197;120;30062021115932
198;119;30062021115932
199;118;30062021115932
200;0;30062021115932
