<?xml version="1.0" encoding="UTF-8" standalone="no"?>
<!-- Created with Inkscape (http://www.inkscape.org/) -->

<svg
   xmlns:dc="http://purl.org/dc/elements/1.1/"
   xmlns:cc="http://creativecommons.org/ns#"
   xmlns:rdf="http://www.w3.org/1999/02/22-rdf-syntax-ns#"
   xmlns:svg="http://www.w3.org/2000/svg"
   xmlns="http://www.w3.org/2000/svg"
   xmlns:sodipodi="http://sodipodi.sourceforge.net/DTD/sodipodi-0.dtd"
   xmlns:inkscape="http://www.inkscape.org/namespaces/inkscape"
   width="210mm"
   height="297mm"
   viewBox="0 0 210 297"
   version="1.1"
   id="svg8"
   inkscape:version="0.92.4 (5da689c313, 2019-01-14)"
   sodipodi:docname="Versuchsaufbau.svg"
   inkscape:export-filename="C:\Users\User\Documents\Masterarbeit\masterarbeit\Versuchsaufbau_klein.png"
   inkscape:export-xdpi="180.86148"
   inkscape:export-ydpi="180.86148">
  <defs
     id="defs2">
    <inkscape:perspective
       sodipodi:type="inkscape:persp3d"
       inkscape:vp_x="163.26254 : 233.81228 : 1"
       inkscape:vp_y="0 : -270.68833 : 0"
       inkscape:vp_z="107.2152 : 233.81228 : 1"
       inkscape:persp3d-origin="135.23887 : 247.21135 : 1"
       id="perspective4788" />
  </defs>
  <sodipodi:namedview
     id="base"
     pagecolor="#ffffff"
     bordercolor="#666666"
     borderopacity="1.0"
     inkscape:pageopacity="0.0"
     inkscape:pageshadow="2"
     inkscape:zoom="2"
     inkscape:cx="722.72596"
     inkscape:cy="893.18328"
     inkscape:document-units="mm"
     inkscape:current-layer="layer1"
     showgrid="false"
     inkscape:snap-nodes="false"
     inkscape:snap-bbox="true"
     inkscape:window-width="1920"
     inkscape:window-height="1057"
     inkscape:window-x="1358"
     inkscape:window-y="-8"
     inkscape:window-maximized="1" />
  <metadata
     id="metadata5">
    <rdf:RDF>
      <cc:Work
         rdf:about="">
        <dc:format>image/svg+xml</dc:format>
        <dc:type
           rdf:resource="http://purl.org/dc/dcmitype/StillImage" />
        <dc:title />
      </cc:Work>
    </rdf:RDF>
  </metadata>
  <g
     inkscape:label="Ebene 1"
     inkscape:groupmode="layer"
     id="layer1">
    <path
       style="fill:none;stroke:#000000;stroke-width:0.15000001;stroke-linecap:butt;stroke-linejoin:miter;stroke-miterlimit:4;stroke-dasharray:none;stroke-opacity:1"
       d="m 134.20624,36.25574 0.0468,5.427872"
       id="path3728"
       inkscape:connector-curvature="0"
       sodipodi:nodetypes="cc" />
    <path
       style="fill:none;stroke:#000000;stroke-width:0.14741279;stroke-linecap:butt;stroke-linejoin:miter;stroke-miterlimit:4;stroke-dasharray:none;stroke-opacity:1"
       d="m 174.17997,36.312473 v 5.283543"
       id="path3728-7"
       inkscape:connector-curvature="0" />
    <path
       style="fill:none;stroke:#000000;stroke-width:0.14964655;stroke-linecap:butt;stroke-linejoin:miter;stroke-miterlimit:4;stroke-dasharray:none;stroke-opacity:1"
       d="M 134.25292,41.683466 151.89107,52.77269"
       id="path3747"
       inkscape:connector-curvature="0" />
    <path
       style="fill:none;stroke:#000000;stroke-width:0.14949933;stroke-linecap:butt;stroke-linejoin:miter;stroke-miterlimit:4;stroke-dasharray:none;stroke-opacity:1"
       d="M 174.10972,41.666447 155.6577,52.737738"
       id="path3747-0"
       inkscape:connector-curvature="0" />
    <path
       style="fill:none;stroke:#000000;stroke-width:0.15;stroke-linecap:butt;stroke-linejoin:miter;stroke-opacity:1;stroke-miterlimit:4;stroke-dasharray:none"
       d="m 155.6739,52.751657 v 3.862044"
       id="path3785"
       inkscape:connector-curvature="0" />
    <path
       style="fill:none;stroke:#000000;stroke-width:0.15;stroke-linecap:butt;stroke-linejoin:miter;stroke-opacity:1;stroke-miterlimit:4;stroke-dasharray:none"
       d="M 151.88195,52.754868 V 56.68373"
       id="path3787"
       inkscape:connector-curvature="0" />
    <path
       style="fill:none;fill-opacity:1;stroke:#000000;stroke-width:0.15016647;stroke-miterlimit:4;stroke-dasharray:0.45049937, 0.45049937;stroke-dashoffset:0;stroke-opacity:1"
       id="path3717-9"
       sodipodi:type="arc"
       sodipodi:cx="154.19525"
       sodipodi:cy="41.718334"
       sodipodi:rx="20.037897"
       sodipodi:ry="1.0918847"
       sodipodi:start="3.1916256"
       sodipodi:end="6.2167471"
       sodipodi:open="true"
       d="m 134.18243,41.663727 a 20.037897,1.0918847 0 0 1 19.84846,-1.037241 20.037897,1.0918847 0 0 1 20.15805,1.019359" />
    <path
       style="fill:none;fill-opacity:1;stroke:#000000;stroke-width:0.15;stroke-miterlimit:4;stroke-dasharray:none;stroke-opacity:1"
       id="path3717-9-6"
       sodipodi:type="arc"
       sodipodi:cx="154.16904"
       sodipodi:cy="36.313602"
       sodipodi:rx="20.010935"
       sodipodi:ry="1.2546569"
       sodipodi:start="0"
       sodipodi:end="6.2822856"
       sodipodi:open="true"
       d="m 174.17997,36.313602 a 20.010935,1.2546569 0 0 1 -20.00643,1.254657 20.010935,1.2546569 0 0 1 -20.01544,-1.254092 20.010935,1.2546569 0 0 1 19.99743,-1.255221 20.010935,1.2546569 0 0 1 20.02443,1.253528" />
    <path
       style="fill:none;fill-opacity:1;stroke:#000000;stroke-width:0.14798909;stroke-miterlimit:4;stroke-dasharray:none;stroke-opacity:1"
       id="path4645"
       sodipodi:type="arc"
       sodipodi:cx="153.76134"
       sodipodi:cy="52.797588"
       sodipodi:rx="1.8359611"
       sodipodi:ry="0.29585931"
       sodipodi:start="6.1354369"
       sodipodi:end="3.1237809"
       sodipodi:open="true"
       d="m 155.5773,52.754034 a 1.8359611,0.29585931 0 0 1 -0.73723,0.282959 1.8359611,0.29585931 0 0 1 -1.89787,0.02537 1.8359611,0.29585931 0 0 1 -1.01653,-0.25951" />
    <path
       style="fill:none;stroke:#edae11;stroke-width:0.3;stroke-linecap:butt;stroke-linejoin:miter;stroke-opacity:1;stroke-miterlimit:4;stroke-dasharray:none"
       d="m 155.6739,56.613701 h -1.34643"
       id="path4666"
       inkscape:connector-curvature="0" />
    <path
       style="fill:none;stroke:#000000;stroke-width:0.15;stroke-linecap:butt;stroke-linejoin:miter;stroke-opacity:1;stroke-miterlimit:4;stroke-dasharray:none"
       d="m 151.88195,56.68373 v 3.153846"
       id="path4668"
       inkscape:connector-curvature="0" />
    <path
       style="fill:none;stroke:#000000;stroke-width:0.15;stroke-linecap:butt;stroke-linejoin:miter;stroke-opacity:1;stroke-miterlimit:4;stroke-dasharray:none"
       d="m 155.6739,56.613701 v 3.220664"
       id="path4670"
       inkscape:connector-curvature="0" />
    <path
       style="fill:none;stroke:#000000;stroke-width:0.15;stroke-linecap:butt;stroke-linejoin:miter;stroke-opacity:1;stroke-miterlimit:4;stroke-dasharray:none"
       d="m 155.6739,59.834365 c -0.62053,3.348475 -5.39522,5.634759 -10.7894,6.579893"
       id="path4672"
       inkscape:connector-curvature="0"
       sodipodi:nodetypes="cc" />
    <path
       style="fill:#0000ff;fill-opacity:1;stroke:#0000ff;stroke-width:0.1;stroke-linecap:butt;stroke-linejoin:miter;stroke-miterlimit:4;stroke-dasharray:none;stroke-opacity:1"
       d="m 138.144,37.66932 c -0.11781,0.349898 -0.59809,1.119867 -0.51776,1.365473 0.0284,0.260354 0.14296,0.439491 0.49725,0.442071 0.35629,-0.02094 0.45641,-0.18735 0.49919,-0.501044 0.0785,-0.243694 -0.40174,-0.956254 -0.47868,-1.3065 z"
       id="path4676"
       inkscape:connector-curvature="0"
       sodipodi:nodetypes="ccccc" />
    <path
       style="fill:#0000ff;fill-opacity:1;stroke:#0000ff;stroke-width:0.1;stroke-linecap:butt;stroke-linejoin:miter;stroke-miterlimit:4;stroke-dasharray:none;stroke-opacity:1"
       d="m 143.12924,32.1558 c -0.11781,0.349898 -0.59809,1.119867 -0.51776,1.365474 0.0284,0.260354 0.14296,0.43949 0.49725,0.44207 0.35629,-0.02094 0.45641,-0.18735 0.49919,-0.501044 0.0785,-0.243694 -0.40174,-0.956254 -0.47868,-1.3065 z"
       id="path4676-3"
       inkscape:connector-curvature="0"
       sodipodi:nodetypes="ccccc" />
    <path
       style="fill:#0000ff;fill-opacity:1;stroke:#0000ff;stroke-width:0.1;stroke-linecap:butt;stroke-linejoin:miter;stroke-miterlimit:4;stroke-dasharray:none;stroke-opacity:1"
       d="m 153.91621,35.468836 c -0.11781,0.349898 -0.59809,1.119867 -0.51776,1.365473 0.0284,0.260354 0.14296,0.439491 0.49725,0.442071 0.35629,-0.02094 0.45641,-0.18735 0.49919,-0.501044 0.0785,-0.243694 -0.40174,-0.956254 -0.47868,-1.3065 z"
       id="path4676-9"
       inkscape:connector-curvature="0"
       sodipodi:nodetypes="ccccc" />
    <path
       style="fill:#0000ff;fill-opacity:1;stroke:#0000ff;stroke-width:0.1;stroke-linecap:butt;stroke-linejoin:miter;stroke-miterlimit:4;stroke-dasharray:none;stroke-opacity:1"
       d="m 164.99857,38.082502 c -0.11781,0.349898 -0.59809,1.119867 -0.51776,1.365473 0.0284,0.260354 0.14296,0.439491 0.49725,0.442071 0.35629,-0.02094 0.45641,-0.18735 0.49919,-0.501044 0.0785,-0.243694 -0.40174,-0.956254 -0.47868,-1.3065 z"
       id="path4676-6"
       inkscape:connector-curvature="0"
       sodipodi:nodetypes="ccccc" />
    <path
       style="fill:#0000ff;fill-opacity:1;stroke:#0000ff;stroke-width:0.1;stroke-linecap:butt;stroke-linejoin:miter;stroke-miterlimit:4;stroke-dasharray:none;stroke-opacity:1"
       d="m 149.09603,40.401066 c -0.11781,0.349898 -0.59809,1.119867 -0.51776,1.365473 0.0284,0.260354 0.14296,0.439491 0.49725,0.442071 0.35629,-0.02094 0.45641,-0.18735 0.49919,-0.501044 0.0785,-0.243694 -0.40174,-0.956254 -0.47868,-1.3065 z"
       id="path4676-1"
       inkscape:connector-curvature="0"
       sodipodi:nodetypes="ccccc" />
    <path
       style="fill:#0000ff;fill-opacity:1;stroke:#0000ff;stroke-width:0.1;stroke-linecap:butt;stroke-linejoin:miter;stroke-miterlimit:4;stroke-dasharray:none;stroke-opacity:1"
       d="m 159.66654,29.476423 c -0.11781,0.349898 -0.59809,1.119867 -0.51776,1.365473 0.0284,0.260354 0.14296,0.439491 0.49725,0.442071 0.35629,-0.02094 0.45641,-0.18735 0.49919,-0.501044 0.0785,-0.243694 -0.40174,-0.956254 -0.47868,-1.3065 z"
       id="path4676-8"
       inkscape:connector-curvature="0"
       sodipodi:nodetypes="ccccc" />
    <path
       style="fill:#0000ff;fill-opacity:1;stroke:#0000fe;stroke-width:0.26499999;stroke-linecap:butt;stroke-linejoin:miter;stroke-miterlimit:4;stroke-dasharray:none;stroke-opacity:1"
       d="m 153.93992,51.819424 -0.95841,-1.91671 0.59708,-4.78e-4 -0.0468,-2.018393 0.64773,0.04629 0.0468,1.972096 0.67343,4.78e-4 z"
       id="path4717"
       inkscape:connector-curvature="0"
       sodipodi:nodetypes="cccccccc" />
    <path
       style="fill:#0000ff;fill-opacity:1;stroke:#0000fe;stroke-width:0.26499999;stroke-linecap:butt;stroke-linejoin:miter;stroke-miterlimit:4;stroke-dasharray:none;stroke-opacity:1"
       d="m 146.78751,64.553906 0.94595,-1.598189 0.37354,0.447815 1.88474,-0.934888 0.33137,0.487249 -1.87915,1.004829 0.32954,0.619483 z"
       id="path4717-0"
       inkscape:connector-curvature="0"
       sodipodi:nodetypes="cccccccc" />
    <path
       style="fill:none;fill-opacity:1;stroke:#000000;stroke-width:0.15;stroke-miterlimit:4;stroke-dasharray:none;stroke-opacity:1"
       id="path4734"
       sodipodi:type="arc"
       sodipodi:cx="138.1403"
       sodipodi:cy="69.666367"
       sodipodi:rx="7.9110327"
       sodipodi:ry="1.1818177"
       sodipodi:start="6.1173075"
       sodipodi:end="6.100482"
       sodipodi:open="true"
       d="m 145.94275,69.471227 a 7.9110327,1.1818177 0 0 1 -6.46338,1.359904 7.9110327,1.1818177 0 0 1 -9.13024,-0.959826 7.9110327,1.1818177 0 0 1 6.38657,-1.367979 7.9110327,1.1818177 0 0 1 9.18397,0.948318" />
    <path
       style="fill:none;stroke:#000000;stroke-width:0.14974155;stroke-linecap:butt;stroke-linejoin:miter;stroke-miterlimit:4;stroke-dasharray:none;stroke-opacity:1"
       d="m 130.35054,69.874221 6.03315,6.92029"
       id="path4736"
       inkscape:connector-curvature="0" />
    <path
       style="fill:none;stroke:#000000;stroke-width:0.15093265;stroke-linecap:butt;stroke-linejoin:miter;stroke-miterlimit:4;stroke-dasharray:none;stroke-opacity:1"
       d="m 145.90163,69.898306 -6.17675,6.867376"
       id="path4736-3"
       inkscape:connector-curvature="0" />
    <path
       style="fill:none;fill-opacity:1;stroke:#000000;stroke-width:0.15;stroke-miterlimit:4;stroke-dasharray:none;stroke-opacity:1"
       id="path4753"
       sodipodi:type="arc"
       sodipodi:cx="138.07812"
       sodipodi:cy="76.786606"
       sodipodi:rx="1.6935811"
       sodipodi:ry="0.47453934"
       sodipodi:start="6.12731"
       sodipodi:end="6.0280182"
       sodipodi:open="true"
       d="m 139.75117,76.712936 a 1.6935811,0.47453934 0 0 1 -1.36868,0.540483 1.6935811,0.47453934 0 0 1 -1.9623,-0.36997 1.6935811,0.47453934 0 0 1 1.27127,-0.558849 1.6935811,0.47453934 0 0 1 2.02541,0.342229" />
    <path
       style="fill:none;stroke:#000000;stroke-width:0.15314834;stroke-linecap:butt;stroke-linejoin:miter;stroke-miterlimit:4;stroke-dasharray:none;stroke-opacity:1"
       d="m 136.40161,76.846222 1.27374,4.934432"
       id="path4757"
       inkscape:connector-curvature="0" />
    <path
       style="fill:none;stroke:#000000;stroke-width:0.15239842;stroke-linecap:butt;stroke-linejoin:miter;stroke-miterlimit:4;stroke-dasharray:none;stroke-opacity:1"
       d="m 139.74737,76.871022 -1.25064,4.976455"
       id="path4757-9"
       inkscape:connector-curvature="0" />
    <path
       style="fill:none;fill-opacity:1;stroke:#000000;stroke-width:0.1;stroke-miterlimit:4;stroke-dasharray:none;stroke-opacity:1"
       id="path4774"
       sodipodi:type="arc"
       sodipodi:cx="138.09401"
       sodipodi:cy="81.767006"
       sodipodi:rx="0.41915509"
       sodipodi:ry="0.11532803"
       sodipodi:start="6.12731"
       sodipodi:end="6.0280182"
       sodipodi:open="true"
       d="m 138.50808,81.749102 a 0.41915509,0.11532803 0 0 1 -0.33874,0.131354 0.41915509,0.11532803 0 0 1 -0.48566,-0.08991 0.41915509,0.11532803 0 0 1 0.31463,-0.135818 0.41915509,0.11532803 0 0 1 0.50128,0.08317" />
    <path
       style="fill:none;stroke:#000000;stroke-width:0.15;stroke-linecap:butt;stroke-linejoin:miter;stroke-miterlimit:4;stroke-dasharray:none;stroke-opacity:1"
       d="m 138.49959,81.831439 c -0.32993,9.177413 -5.58373,21.018511 -8.64964,6.334813"
       id="path4780"
       inkscape:connector-curvature="0"
       sodipodi:nodetypes="cc" />
    <path
       style="fill:none;stroke:#000000;stroke-width:0.15;stroke-linecap:butt;stroke-linejoin:miter;stroke-miterlimit:4;stroke-dasharray:none;stroke-opacity:1"
       d="m 137.67721,81.78121 c -0.65265,9.297513 -4.37172,19.76453 -7.29979,6.381061"
       id="path4786"
       inkscape:connector-curvature="0"
       sodipodi:nodetypes="cc" />
    <rect
       style="fill:none;fill-opacity:1;stroke:#000000;stroke-width:0.15;stroke-miterlimit:4;stroke-dasharray:none;stroke-opacity:1"
       id="rect4832"
       width="2.778125"
       height="7.6067705"
       x="128.70546"
       y="79.355728" />
    <path
       style="fill:none;fill-opacity:1;stroke:#000000;stroke-width:0.15476948;stroke-linecap:butt;stroke-linejoin:miter;stroke-miterlimit:4;stroke-dasharray:none;stroke-opacity:1"
       d="m 131.50878,86.982969 1.0342,-0.661946"
       id="path4840"
       inkscape:connector-curvature="0" />
    <path
       style="fill:none;fill-opacity:1;stroke:#000000;stroke-width:0.14606479;stroke-linecap:butt;stroke-linejoin:miter;stroke-miterlimit:4;stroke-dasharray:none;stroke-opacity:1"
       d="m 131.48301,79.410635 0.94005,-0.563605 0.0684,7.507283"
       id="path4842"
       inkscape:connector-curvature="0" />
    <path
       style="fill:none;stroke:#000000;stroke-width:0.15;stroke-linecap:butt;stroke-linejoin:miter;stroke-miterlimit:4;stroke-dasharray:none;stroke-opacity:1;fill-opacity:1"
       d="m 128.70546,79.355726 0.93133,-0.577267 2.83055,0.0093"
       id="path4846"
       inkscape:connector-curvature="0"
       sodipodi:nodetypes="ccc" />
    <path
       style="fill:none;stroke:#000000;stroke-width:0.15004492;stroke-linecap:butt;stroke-linejoin:miter;stroke-miterlimit:4;stroke-dasharray:none;stroke-opacity:1"
       d="m 128.68347,86.981969 1.20639,1.239204"
       id="path4848"
       inkscape:connector-curvature="0" />
    <path
       style="fill:none;stroke:#000000;stroke-width:0.14515807;stroke-linecap:butt;stroke-linejoin:miter;stroke-miterlimit:4;stroke-dasharray:none;stroke-opacity:1"
       d="m 131.50191,86.990475 -1.13408,1.219366"
       id="path4850"
       inkscape:connector-curvature="0" />
    <path
       style="fill:none;fill-opacity:1;stroke:#000000;stroke-width:0.12415144;stroke-linecap:butt;stroke-linejoin:miter;stroke-miterlimit:4;stroke-dasharray:none;stroke-opacity:1"
       d="m 130.50003,88.06056 2.04598,-1.720624"
       id="path4854"
       inkscape:connector-curvature="0" />
    <path
       style="fill:none;stroke:#000000;stroke-width:0.15;stroke-linecap:butt;stroke-linejoin:miter;stroke-miterlimit:4;stroke-dasharray:0.6,0.6;stroke-dashoffset:0;stroke-opacity:1;fill-opacity:1"
       d="m 128.70545,86.962498 0.82683,-0.58357 0.10451,-7.600469"
       id="path4856"
       inkscape:connector-curvature="0"
       sodipodi:nodetypes="ccc" />
    <path
       style="fill:none;fill-opacity:1;stroke:#000000;stroke-width:0.15000001;stroke-linecap:butt;stroke-linejoin:miter;stroke-miterlimit:4;stroke-dasharray:0.6, 0.6;stroke-dashoffset:0;stroke-opacity:1"
       d="m 129.52643,86.373081 3.00666,-0.02574"
       id="path4858"
       inkscape:connector-curvature="0"
       sodipodi:nodetypes="cc" />
    <path
       style="fill:none;stroke:#000000;stroke-width:0.15;stroke-linecap:butt;stroke-linejoin:miter;stroke-miterlimit:4;stroke-dasharray:0.6,0.6;stroke-dashoffset:0;stroke-opacity:1;fill-opacity:1"
       d="m 129.53228,86.378928 0.5435,1.567166"
       id="path4860"
       inkscape:connector-curvature="0" />
    <path
       style="fill:none;stroke:#000000;stroke-width:0.14422834;stroke-linecap:butt;stroke-linejoin:miter;stroke-miterlimit:4;stroke-dasharray:none;stroke-opacity:1"
       d="M 130.44184,78.14051 131.55,79.386989"
       id="path4848-4"
       inkscape:connector-curvature="0" />
    <path
       style="fill:none;stroke:#000000;stroke-width:0.14988133;stroke-linecap:butt;stroke-linejoin:miter;stroke-miterlimit:4;stroke-dasharray:none;stroke-opacity:1"
       d="m 129.89127,78.095756 -1.20629,1.236598"
       id="path4848-4-7"
       inkscape:connector-curvature="0" />
    <path
       style="fill:none;stroke:#000000;stroke-width:0.14064746;stroke-linecap:butt;stroke-linejoin:miter;stroke-miterlimit:4;stroke-dasharray:none;stroke-opacity:1"
       d="m 130.5343,78.06989 1.93498,0.722628"
       id="path4854-5"
       inkscape:connector-curvature="0"
       sodipodi:nodetypes="cc" />
    <path
       style="fill:none;stroke:#000000;stroke-width:0.1;stroke-linecap:butt;stroke-linejoin:miter;stroke-miterlimit:4;stroke-dasharray:0.4, 0.40000000000000002;stroke-dashoffset:0;stroke-opacity:1;fill-opacity:1"
       d="m 130.07835,78.025611 -0.44156,0.752848"
       id="path4860-3"
       inkscape:connector-curvature="0"
       sodipodi:nodetypes="cc" />
    <path
       style="fill:none;fill-opacity:1;stroke:#000000;stroke-width:0.1;stroke-miterlimit:4;stroke-dasharray:none;stroke-dashoffset:0;stroke-opacity:1"
       id="path4922"
       sodipodi:type="arc"
       sodipodi:cx="130.21371"
       sodipodi:cy="78.077019"
       sodipodi:rx="0.34478512"
       sodipodi:ry="0.093455195"
       sodipodi:start="6.12731"
       sodipodi:end="6.0280182"
       sodipodi:open="true"
       d="m 130.55432,78.06251 a 0.34478512,0.0934552 0 0 1 -0.27864,0.106442 0.34478512,0.0934552 0 0 1 -0.39949,-0.07286 0.34478512,0.0934552 0 0 1 0.25881,-0.110059 0.34478512,0.0934552 0 0 1 0.41234,0.0674" />
    <path
       style="fill:none;stroke:#000000;stroke-width:0.1;stroke-linecap:butt;stroke-linejoin:miter;stroke-miterlimit:4;stroke-dasharray:none;stroke-opacity:1;fill-opacity:1"
       d="m 129.89953,78.013086 c -0.0848,-0.712471 -0.18908,-1.166773 -0.52063,-1.531819 -0.31321,-0.340771 -0.63921,-0.637825 -1.11592,-0.667332 -0.35811,-0.0091 -0.69148,0.06989 -0.91749,0.148829 -0.2815,0.09402 -0.77488,0.50844 -0.98506,0.884556 l -0.51908,0.739154"
       id="path4943"
       inkscape:connector-curvature="0"
       sodipodi:nodetypes="cccccc" />
    <path
       style="fill:none;stroke:#000000;stroke-width:0.1;stroke-linecap:butt;stroke-linejoin:miter;stroke-miterlimit:4;stroke-dasharray:none;stroke-opacity:1;fill-opacity:1"
       d="m 130.43684,78.004494 c -0.0186,-0.803422 -0.51423,-1.892586 -0.90365,-2.224559 -0.33802,-0.24982 -0.47385,-0.348437 -0.76866,-0.402748 -0.31677,-0.06698 -0.98914,-0.02933 -1.21515,0.04961 -0.2815,0.06095 -0.76377,0.18681 -1.28814,0.844047 l -0.72815,1.056872"
       id="path4943-9"
       inkscape:connector-curvature="0"
       sodipodi:nodetypes="cccccc" />
    <path
       style="fill:none;stroke:#edae11;stroke-width:0.3;stroke-linecap:butt;stroke-linejoin:miter;stroke-opacity:1;stroke-miterlimit:4;stroke-dasharray:none"
       d="m 151.88195,56.683729 h 1.39448"
       id="path4962"
       inkscape:connector-curvature="0" />
    <path
       style="fill:#008bff;fill-opacity:0.46261686;stroke:#0066ff;stroke-width:0.01535433;stroke-miterlimit:4;stroke-dasharray:none;stroke-dashoffset:0;stroke-opacity:0.4766355"
       d=""
       id="path4992"
       inkscape:connector-curvature="0"
       transform="scale(0.26458333)" />
    <path
       style="fill:#008bff;fill-opacity:0.46261686;stroke:#0066ff;stroke-width:0.01535433;stroke-miterlimit:4;stroke-dasharray:none;stroke-dashoffset:0;stroke-opacity:0.4766355"
       d=""
       id="path4996"
       inkscape:connector-curvature="0"
       transform="scale(0.26458333)" />
    <path
       style="fill:#0000ff;stroke:#0000ff;stroke-width:0.065;stroke-linecap:butt;stroke-linejoin:miter;stroke-opacity:1;stroke-miterlimit:4;stroke-dasharray:none;fill-opacity:1"
       d="m 125.41957,77.591763 0.18708,0.163703 -0.67819,0.841899 0.1637,0.163703 -0.60804,0.280633 0.14032,-0.678199 0.1637,0.116933 z"
       id="path5028"
       inkscape:connector-curvature="0" />
    <path
       style="fill:#0000ff;fill-opacity:1;stroke:#0000ff;stroke-width:0.15;stroke-linecap:butt;stroke-linejoin:miter;stroke-miterlimit:4;stroke-dasharray:none;stroke-opacity:1"
       d="m 138.04009,79.454654 0.24571,0.03769 -0.1202,1.074376 0.22599,0.05023 -0.36234,0.56319 -0.2457,-0.647514 0.20088,0.01072 z"
       id="path5028-2"
       inkscape:connector-curvature="0" />
    <rect
       style="fill:#00d643;fill-opacity:0.53271025;stroke:#000000;stroke-width:0.2;stroke-miterlimit:4;stroke-dasharray:none;stroke-dashoffset:0;stroke-opacity:1"
       id="rect5045"
       width="20.769791"
       height="11.90625"
       x="157.22864"
       y="68.532288" />
    <text
       xml:space="preserve"
       style="font-style:normal;font-weight:normal;font-size:10.58333302px;line-height:1.25;font-family:sans-serif;letter-spacing:0px;word-spacing:0px;fill:#000000;fill-opacity:1;stroke:none;stroke-width:0.26458332"
       x="159.87448"
       y="76.337502"
       id="text5049"><tspan
         sodipodi:role="line"
         x="159.87448"
         y="76.337502"
         style="font-style:normal;font-variant:normal;font-weight:normal;font-stretch:normal;font-size:4.23333311px;font-family:sans-serif;-inkscape-font-specification:'sans-serif, Normal';font-variant-ligatures:normal;font-variant-caps:normal;font-variant-numeric:normal;font-feature-settings:normal;text-align:start;writing-mode:lr-tb;text-anchor:start;stroke-width:0.26458332"
         id="tspan5059">Arduino</tspan></text>
    <path
       style="fill:none;stroke:#000000;stroke-width:0.26458332px;stroke-linecap:butt;stroke-linejoin:miter;stroke-opacity:1"
       d="m 151.88195,56.683729 c -5.14015,-0.272115 -3.87882,2.385777 -2.65695,5.498563"
       id="path5069"
       inkscape:connector-curvature="0"
       sodipodi:nodetypes="cc" />
    <path
       style="fill:none;stroke:#000000;stroke-width:0.26458332px;stroke-linecap:butt;stroke-linejoin:miter;stroke-opacity:1"
       d="m 149.82031,63.670573 c 0.15434,0.324047 0.30868,0.590783 0.46302,0.826823"
       id="path5071"
       inkscape:connector-curvature="0"
       sodipodi:nodetypes="cc" />
    <path
       style="fill:none;stroke:#000000;stroke-width:0.26458332px;stroke-linecap:butt;stroke-linejoin:miter;stroke-opacity:1"
       d="m 150.74635,65.225 c 3.29647,3.227999 9.93815,-0.90779 9.65734,3.307292"
       id="path5073"
       inkscape:connector-curvature="0"
       sodipodi:nodetypes="cc" />
    <path
       style="fill:none;stroke:#ff0000;stroke-width:0.26458332px;stroke-linecap:butt;stroke-linejoin:miter;stroke-opacity:1"
       d="m 155.6739,56.613699 c 7.04956,-0.4913 6.23919,4.573193 6.7803,11.852447"
       id="path5075"
       inkscape:connector-curvature="0"
       sodipodi:nodetypes="cc" />
    <text
       xml:space="preserve"
       style="font-style:normal;font-weight:normal;font-size:10.58333302px;line-height:1.25;font-family:sans-serif;letter-spacing:0px;word-spacing:0px;fill:#000000;fill-opacity:1;stroke:none;stroke-width:0.26458332"
       x="115.62292"
       y="53.054165"
       id="text903"><tspan
         sodipodi:role="line"
         id="tspan901"
         x="115.62292"
         y="53.054165"
         style="font-style:normal;font-variant:normal;font-weight:normal;font-stretch:normal;font-size:3.88055563px;font-family:sans-serif;-inkscape-font-specification:'sans-serif, Normal';font-variant-ligatures:normal;font-variant-caps:normal;font-variant-numeric:normal;font-feature-settings:normal;text-align:start;writing-mode:lr-tb;text-anchor:start;stroke-width:0.26458332">drop counter</tspan></text>
    <text
       xml:space="preserve"
       style="font-style:normal;font-variant:normal;font-weight:normal;font-stretch:normal;font-size:3.88055563px;line-height:1.25;font-family:sans-serif;-inkscape-font-specification:'sans-serif, Normal';font-variant-ligatures:normal;font-variant-caps:normal;font-variant-numeric:normal;font-feature-settings:normal;text-align:start;letter-spacing:0px;word-spacing:0px;writing-mode:lr-tb;text-anchor:start;fill:#000000;fill-opacity:1;stroke:none;stroke-width:0.26458332"
       x="112.5802"
       y="92.344795"
       id="text907"><tspan
         sodipodi:role="line"
         id="tspan905"
         x="112.5802"
         y="92.344795"
         style="font-style:normal;font-variant:normal;font-weight:normal;font-stretch:normal;font-size:3.88055563px;font-family:sans-serif;-inkscape-font-specification:'sans-serif, Normal';font-variant-ligatures:normal;font-variant-caps:normal;font-variant-numeric:normal;font-feature-settings:normal;text-align:start;writing-mode:lr-tb;text-anchor:start;stroke-width:0.26458332">cuvette</tspan></text>
    <text
       xml:space="preserve"
       style="font-style:normal;font-variant:normal;font-weight:normal;font-stretch:normal;font-size:3.88055563px;line-height:1.25;font-family:sans-serif;-inkscape-font-specification:'sans-serif, Normal';font-variant-ligatures:normal;font-variant-caps:normal;font-variant-numeric:normal;font-feature-settings:normal;text-align:start;letter-spacing:0px;word-spacing:0px;writing-mode:lr-tb;text-anchor:start;fill:#000000;fill-opacity:1;stroke:none;stroke-width:0.26458332"
       x="115.35833"
       y="73.427078"
       id="text911"><tspan
         sodipodi:role="line"
         id="tspan909"
         x="115.35833"
         y="73.427078"
         style="stroke-width:0.26458332">siphon</tspan><tspan
         sodipodi:role="line"
         x="115.35833"
         y="78.277771"
         style="stroke-width:0.26458332"
         id="tspan913" /></text>
    <path
       style="fill:none;fill-opacity:1;stroke:#000000;stroke-width:0.15000001;stroke-miterlimit:4;stroke-dasharray:none;stroke-opacity:1"
       id="path3717-9-6-0"
       sodipodi:type="arc"
       sodipodi:cx="154.15443"
       sodipodi:cy="41.560947"
       sodipodi:rx="20.010935"
       sodipodi:ry="1.2546569"
       sodipodi:start="0"
       sodipodi:end="3.0623825"
       sodipodi:open="true"
       d="M 174.16537,41.560947 A 20.010935,1.2546569 0 0 1 154.94676,42.81462 20.010935,1.2546569 0 0 1 134.20624,41.660225" />
    <path
       style="fill:none;fill-opacity:0.46261686;stroke:#000000;stroke-width:0.15;stroke-miterlimit:4;stroke-dasharray:0.45,0.45;stroke-dashoffset:0;stroke-opacity:1"
       id="path930"
       sodipodi:type="arc"
       sodipodi:cx="153.79877"
       sodipodi:cy="52.78685"
       sodipodi:rx="1.8966458"
       sodipodi:ry="0.34113979"
       sodipodi:start="3.1527802"
       sodipodi:end="6.0280182"
       sodipodi:open="true"
       d="m 151.90224,52.783034 a 1.8966458,0.34113979 0 0 1 1.66573,-0.334789 1.8966458,0.34113979 0 0 1 2.06603,0.252499" />
    <path
       style="fill:none;fill-opacity:1;stroke:#000000;stroke-width:0.15076648;stroke-miterlimit:4;stroke-dasharray:none;stroke-opacity:1"
       id="path4645-4"
       sodipodi:type="arc"
       sodipodi:cx="153.78838"
       sodipodi:cy="59.778698"
       sodipodi:rx="1.9055204"
       sodipodi:ry="0.29585931"
       sodipodi:start="6.1354369"
       sodipodi:end="3.1237809"
       sodipodi:open="true"
       d="m 155.67314,59.735144 a 1.9055204,0.29585931 0 0 1 -0.76516,0.282958 1.9055204,0.29585931 0 0 1 -1.96978,0.02538 1.9055204,0.29585931 0 0 1 -1.05504,-0.259511" />
    <path
       style="fill:none;fill-opacity:0.46261686;stroke:#000000;stroke-width:0.15000001;stroke-miterlimit:4;stroke-dasharray:0.45, 0.45;stroke-dashoffset:0;stroke-opacity:1"
       id="path930-3"
       sodipodi:type="arc"
       sodipodi:cx="153.7697"
       sodipodi:cy="59.809437"
       sodipodi:rx="1.8966458"
       sodipodi:ry="0.34113979"
       sodipodi:start="3.1527802"
       sodipodi:end="6.0280182"
       sodipodi:open="true"
       d="m 151.87317,59.80562 a 1.8966458,0.34113979 0 0 1 1.66573,-0.334788 1.8966458,0.34113979 0 0 1 2.06603,0.252499" />
    <path
       style="fill:none;fill-opacity:0.53271024;stroke:#000000;stroke-width:0.1;stroke-miterlimit:4;stroke-dasharray:0.1,0.1;stroke-dashoffset:0;stroke-opacity:1"
       id="path962"
       sodipodi:type="arc"
       sodipodi:cx="130.11337"
       sodipodi:cy="88.194916"
       sodipodi:rx="0.28590339"
       sodipodi:ry="0.12881811"
       sodipodi:start="3.0461863"
       sodipodi:end="6.1705321"
       sodipodi:open="true"
       d="m 129.82877,88.207187 a 0.28590339,0.12881811 0 0 1 0.25491,-0.140393 0.28590339,0.12881811 0 0 1 0.31378,0.113641" />
    <path
       style="fill:none;fill-opacity:0.53271024;stroke:#000000;stroke-width:0.1;stroke-miterlimit:4;stroke-dasharray:none;stroke-dashoffset:0;stroke-opacity:1"
       id="path968"
       sodipodi:type="arc"
       sodipodi:cx="130.12335"
       sodipodi:cy="-88.164146"
       sodipodi:rx="0.26149917"
       sodipodi:ry="0.10747588"
       sodipodi:start="3.1977309"
       sodipodi:end="6.2320362"
       sodipodi:open="true"
       d="m 129.86226,-88.170177 a 0.26149917,0.10747588 0 0 1 0.26174,-0.101445 0.26149917,0.10747588 0 0 1 0.26051,0.101981"
       transform="scale(1,-1)" />
    <path
       style="fill:none;fill-opacity:0.53271024;stroke:#005cff;stroke-width:0.02362205;stroke-miterlimit:4;stroke-dasharray:none;stroke-dashoffset:0;stroke-opacity:0.39215686"
       d="m 518.70603,301.46626 c -1.00967,-3.92019 -1.82409,-7.1393 -1.80981,-7.15357 0.0143,-0.0143 0.20755,0.0307 0.42951,0.1 1.92127,0.59945 6.25307,0.65437 8.58647,0.10887 0.30685,-0.0717 0.65047,-0.1691 0.76362,-0.21638 0.11314,-0.0473 0.21483,-0.0859 0.22596,-0.0859 0.0199,0 -2.35715,9.52671 -3.17496,12.72462 l -0.41707,1.63087 -0.35272,-0.083 c -0.57926,-0.13634 -1.88309,-0.0988 -2.32148,0.0668 -0.0769,0.0291 -0.42296,-1.2428 -1.92952,-7.0922 z m 3.89172,4.52275 c 0.46805,-0.72816 0.867,-1.36562 0.88655,-1.41657 0.0276,-0.072 -0.0701,-0.11616 -0.43785,-0.19798 -0.42325,-0.0942 -0.4734,-0.12068 -0.4734,-0.25034 0,-0.14413 0.34125,-3.29499 0.40312,-3.72217 l 0.0324,-0.22349 -0.75293,-0.11113 c -0.41411,-0.0611 -0.76945,-0.0946 -0.78965,-0.0744 -0.0202,0.0202 -0.0859,0.94421 -0.1461,2.05337 -0.0602,1.10915 -0.11217,2.02652 -0.1156,2.0386 -0.003,0.0121 -0.20309,0.002 -0.44372,-0.022 -0.24062,-0.0242 -0.4375,-0.0239 -0.4375,6.2e-4 0,0.0245 0.28677,0.8013 0.63726,1.72623 0.50044,1.32063 0.65327,1.66467 0.71185,1.60243 0.041,-0.0436 0.45754,-0.67503 0.92559,-1.40319 z"
       id="path974"
       inkscape:connector-curvature="0"
       transform="scale(0.26458333)" />
    <path
       style="fill:none;fill-opacity:0.53271024;stroke:#005cff;stroke-width:0.02362205;stroke-miterlimit:4;stroke-dasharray:none;stroke-dashoffset:0;stroke-opacity:0.39215686"
       d="m 520.57265,308.37438 c -0.2237,-0.58836 -3.66534,-13.94779 -3.60799,-14.00514 0.0139,-0.0139 0.16351,0.0171 0.33246,0.069 1.11867,0.34315 2.8472,0.49588 5.10354,0.45095 1.84875,-0.0368 2.94877,-0.16188 3.93393,-0.44722 0.28554,-0.0827 0.52761,-0.14191 0.53795,-0.13158 0.0103,0.0103 -0.0685,0.35265 -0.1751,0.76069 -0.10663,0.40805 -0.91498,3.60387 -1.79633,7.10183 l -1.60245,6.35992 -0.22218,-0.0474 c -0.29075,-0.0621 -2.0473,-0.0614 -2.27005,8.9e-4 -0.14923,0.0417 -0.18121,0.0264 -0.23378,-0.11187 z m 2.03618,-2.35463 c 0.86574,-1.35337 0.93605,-1.47457 0.88499,-1.52563 -0.0228,-0.0228 -0.21817,-0.0896 -0.43421,-0.14854 -0.37448,-0.10214 -0.39377,-0.1169 -0.4133,-0.31642 -0.0113,-0.11511 0.0692,-1.02286 0.17892,-2.01722 0.1549,-1.40443 0.18229,-1.8185 0.12272,-1.85531 -0.0422,-0.0261 -0.3857,-0.083 -0.76337,-0.1265 -0.54041,-0.0622 -0.69674,-0.0628 -0.73389,-0.003 -0.026,0.042 -0.0825,0.68593 -0.12572,1.43095 -0.0432,0.74502 -0.0964,1.63381 -0.11834,1.97509 l -0.0398,0.62052 -0.42187,-0.0154 c -0.26852,-0.01 -0.42188,0.009 -0.42188,0.0517 0,0.0841 0.5041,1.45474 0.94179,2.56068 l 0.33163,0.83793 0.16016,-0.19362 c 0.0881,-0.10649 0.47158,-0.68044 0.8522,-1.27543 z"
       id="path976"
       inkscape:connector-curvature="0"
       transform="scale(0.26458333)" />
    <path
       style="fill:#008bff;fill-opacity:0.35046729;stroke:#005cff;stroke-width:0.02362205;stroke-miterlimit:4;stroke-dasharray:none;stroke-dashoffset:0;stroke-opacity:0.39215686"
       d="m 520.54523,308.15669 c -0.30101,-0.94089 -3.53468,-13.46944 -3.53468,-13.69477 0,-0.0433 0.0535,-0.0537 0.14063,-0.0275 0.44238,0.13297 1.68148,0.34781 2.33888,0.40552 0.95833,0.0841 3.62555,0.0856 4.61424,0.002 0.79327,-0.0667 1.85776,-0.24844 2.36968,-0.40466 0.16895,-0.0516 0.31833,-0.0826 0.33196,-0.069 0.0136,0.0136 -0.77148,3.18136 -1.74468,7.0394 l -1.76946,7.01463 -1.3283,0.008 -1.32829,0.008 z m 1.73001,-1.57838 c 0.87738,-1.32783 1.25487,-1.96802 1.21764,-2.06503 -0.0183,-0.0478 -0.20468,-0.13497 -0.41409,-0.19373 l -0.38074,-0.10683 -9.4e-4,-0.29364 c -5.2e-4,-0.1615 0.0741,-1.04259 0.16583,-1.95798 0.0917,-0.91538 0.15051,-1.70671 0.13063,-1.7585 -0.0414,-0.10797 -0.92301,-0.25546 -1.32909,-0.22235 l -0.24768,0.0202 -0.0403,0.375 c -0.0222,0.20625 -0.0715,0.90937 -0.10965,1.5625 -0.0382,0.65312 -0.0866,1.3914 -0.10771,1.64062 l -0.0383,0.45313 h -0.3989 c -0.3074,0 -0.39891,0.0208 -0.39891,0.0909 0,0.24419 1.23518,3.42561 1.31164,3.37836 0.0287,-0.0177 0.31697,-0.43295 0.64055,-0.92266 z"
       id="path978"
       inkscape:connector-curvature="0"
       transform="scale(0.26458333)" />
    <path
       style="fill:#008bff;fill-opacity:0.3504674;stroke:#008aff;stroke-width:0.02362205;stroke-miterlimit:4;stroke-dasharray:none;stroke-dashoffset:0;stroke-opacity:0.34901961"
       d="m 521.30622,309.22217 c -0.71734,-0.101 -0.80546,-0.2015 -0.27083,-0.30887 0.654,-0.13134 2.14583,-0.0461 2.14583,0.12259 0,0.14759 -1.26043,0.27281 -1.875,0.18628 z"
       id="path980"
       inkscape:connector-curvature="0"
       transform="scale(0.26458333)" />
    <path
       style="fill:#008bff;fill-opacity:0.3504674;stroke:#008aff;stroke-width:0.02362205;stroke-miterlimit:4;stroke-dasharray:none;stroke-dashoffset:0;stroke-opacity:0.34901961"
       d="m 503.55622,358.99742 c -0.54162,-0.11067 -0.87365,-0.23495 -1.43126,-0.53572 -3.66691,-1.9779 -7.00952,-8.72167 -9.75558,-19.68203 -0.44751,-1.78614 -1.12566,-4.73452 -1.12566,-4.89398 0,-0.0739 0.0756,-0.0859 0.39062,-0.062 0.21484,0.0163 0.50927,0.002 0.65429,-0.0314 0.22375,-0.0518 0.26826,-0.0455 0.29402,0.0413 0.0167,0.0563 0.14703,0.6226 0.28964,1.25854 0.6288,2.80396 1.71317,6.84392 2.45766,9.15625 1.85093,5.74889 3.64251,9.38542 5.65911,11.48679 1.20015,1.2506 2.32396,1.81763 3.59841,1.8156 0.97493,-0.002 1.81045,-0.31623 2.7883,-1.05011 5.74895,-4.31466 11.25822,-23.28128 13.11728,-45.15853 0.0686,-0.80781 0.12501,-1.5491 0.12524,-1.64731 3.1e-4,-0.1351 0.0239,-0.16956 0.0968,-0.14158 0.2969,0.11393 1.24857,0.16918 1.78679,0.10374 0.31386,-0.0382 0.58629,-0.0537 0.60541,-0.0346 0.0191,0.0191 -1.2e-4,0.67404 -0.0428,1.45539 -0.76455,14.00081 -4.37346,29.1503 -9.22762,38.73571 -3.34894,6.61308 -6.9814,9.85804 -10.28062,9.18392 z"
       id="path982"
       inkscape:connector-curvature="0"
       transform="scale(0.26458333)" />
    <path
       style="fill:#008bff;fill-opacity:0.3504674;stroke:#008aff;stroke-width:0.02362205;stroke-miterlimit:4;stroke-dasharray:none;stroke-dashoffset:0;stroke-opacity:0.34901961"
       d="m 491.35098,333.36118 c -0.0613,-0.0159 -0.3707,-0.29992 -0.6875,-0.63107 -0.31681,-0.33114 -1.26108,-1.30624 -2.09839,-2.16688 l -1.52238,-1.56481 4.64177,-0.016 c 2.55297,-0.009 4.65433,-0.003 4.66968,0.0119 0.0154,0.0154 -0.73935,0.85226 -1.67712,1.85978 -0.93777,1.00752 -1.82947,1.9672 -1.98156,2.13262 -0.15209,0.16541 -0.34591,0.32713 -0.43072,0.35937 -0.15595,0.0593 -0.70874,0.0684 -0.91378,0.0151 z m 0.99302,-0.65868 c -0.038,-0.0252 -0.14638,-0.0463 -0.24091,-0.0469 -0.15431,-8.6e-4 -0.17187,0.021 -0.17187,0.21364 0,0.18765 0.0216,0.21708 0.17187,0.23438 0.14205,0.0163 0.18386,-0.0128 0.24091,-0.16773 0.0504,-0.13683 0.0504,-0.19991 0,-0.23342 z m -0.72528,0.17092 c 0,-0.1972 -0.0169,-0.21865 -0.17188,-0.21779 -0.27014,0.002 -0.34364,0.0751 -0.26959,0.26985 0.0494,0.12988 0.10512,0.16669 0.25242,0.16669 0.17439,0 0.18905,-0.017 0.18905,-0.21875 z m 0.024,-0.44471 c 0.16534,-0.0563 0.28445,-0.1323 0.26949,-0.17187 -0.0147,-0.039 -0.14753,-0.41738 -0.29507,-0.84083 -0.29305,-0.84106 -0.25904,-0.81053 -0.71126,-0.6386 l -0.15582,0.0593 0.29369,0.84598 c 0.16153,0.46529 0.29571,0.84622 0.29818,0.84651 0.002,2.8e-4 0.13783,-0.0449 0.30079,-0.10044 z"
       id="path984"
       inkscape:connector-curvature="0"
       transform="scale(0.26458333)" />
    <path
       style="fill:#008bff;fill-opacity:0.3504674;stroke:#008aff;stroke-width:0.02362205;stroke-miterlimit:4;stroke-dasharray:none;stroke-dashoffset:0;stroke-opacity:0.34901961"
       d="m 487.95725,328.00009 c 0.27031,-0.18815 0.50498,-0.3556 0.5215,-0.37212 0.0165,-0.0165 -0.0525,-0.14225 -0.15338,-0.27942 l -0.18341,-0.24939 -0.66195,0.46525 c -0.36408,0.2559 -0.67868,0.46526 -0.69913,0.46526 -0.0204,0 -0.0372,-6.25781 -0.0372,-13.90625 v -13.90625 h 4.9375 4.9375 v 14.0631 14.06309 l -3.03834,-0.0162 -3.03834,-0.0162 -0.2666,-0.76562 -0.2666,-0.76563 h 0.35784 c 0.19681,0 0.61528,-0.0183 0.92993,-0.0406 l 0.57211,-0.0406 v -0.2682 c 0,-0.14751 -0.0229,-0.28233 -0.0508,-0.29961 -0.0279,-0.0173 -0.56232,-0.0146 -1.1875,0.006 -1.13294,0.0373 -1.13668,0.0379 -1.13668,0.18086 0,0.0789 -0.0474,0.16999 -0.1053,0.2024 -0.0955,0.0535 -0.0801,0.13343 0.16632,0.86248 0.14939,0.44195 0.28416,0.83871 0.29948,0.88168 0.0217,0.0608 -0.24056,0.0781 -1.18028,0.0781 h -1.20815 z m 8.41147,-1.59542 v -0.3125 h -1.15625 -1.15625 v 0.3125 0.3125 h 1.15625 1.15625 z m -6.47824,-1.04687 c 0.0219,-0.23203 0.04,-0.75235 0.0403,-1.15625 l 4.5e-4,-0.73438 h -0.3125 -0.3125 v 0.77208 c 0,0.42465 -0.0181,0.94496 -0.0402,1.15625 l -0.0401,0.38417 h 0.31236 0.31237 z m 0.0705,-4.65625 c 0.0228,-0.31797 0.0325,-0.84532 0.0215,-1.17188 l -0.02,-0.59375 -0.28838,-0.0187 -0.28838,-0.0187 -0.0316,1.1437 c -0.0174,0.62904 -0.0195,1.1648 -0.005,1.19058 0.0147,0.0258 0.14906,0.0469 0.29851,0.0469 h 0.27173 z m 0.0545,-4.40625 c 0.0219,-0.23203 0.04,-0.75235 0.0403,-1.15625 l 4.5e-4,-0.73438 h -0.3125 -0.3125 l -4.5e-4,0.73438 c -2.4e-4,0.4039 -0.0184,0.92422 -0.0403,1.15625 l -0.0398,0.42187 h 0.3125 0.3125 z m 0.0628,-4.55631 c 0.0222,-0.263 0.0404,-0.79737 0.0404,-1.1875 v -0.70932 h -0.3125 -0.3125 v 0.77208 c 0,0.42465 -0.0179,0.9429 -0.0397,1.15167 l -0.0397,0.37958 0.21155,0.0258 c 0.11635,0.0142 0.25664,0.0303 0.31175,0.0358 0.081,0.008 0.10795,-0.0816 0.14063,-0.46818 z m 0.0622,-4.50619 c 0.0219,-0.23203 0.04,-0.75235 0.0403,-1.15625 l 4.5e-4,-0.73438 h -0.3125 -0.3125 l -4.5e-4,0.73438 c -2.4e-4,0.4039 -0.0184,0.92422 -0.0403,1.15625 l -0.0398,0.42187 h 0.3125 0.3125 z m 0.0625,-4.5625 c 0.0219,-0.23203 0.04,-0.75235 0.0403,-1.15625 l 4.5e-4,-0.73438 h -0.3125 -0.3125 l -4.5e-4,0.73438 c -2.4e-4,0.4039 -0.0184,0.92422 -0.0403,1.15625 l -0.0398,0.42187 h 0.3125 0.3125 z"
       id="path986"
       inkscape:connector-curvature="0"
       transform="scale(0.26458333)" />
    <path
       style="fill:#008bff;fill-opacity:0.3504674;stroke:#008aff;stroke-width:0.02362205;stroke-miterlimit:4;stroke-dasharray:none;stroke-dashoffset:0;stroke-opacity:0.34901961"
       d="M 497.24372,314.26583 V 300.3105 l 1.44197,-0.8651 c 0.79309,-0.47581 1.45731,-0.84978 1.47605,-0.83104 0.031,0.031 0.2617,22.42565 0.26716,25.93094 l 0.002,1.48437 h -0.90625 -0.90625 v 0.31007 0.31007 l 0.53076,0.0181 0.53076,0.0181 -1.07271,0.6875 c -0.58999,0.37813 -1.13821,0.72356 -1.21826,0.76762 l -0.14555,0.0801 z"
       id="path988"
       inkscape:connector-curvature="0"
       transform="scale(0.26458333)" />
    <path
       style="fill:#008bff;fill-opacity:0.3504674;stroke:#008aff;stroke-width:0.02362205;stroke-miterlimit:4;stroke-dasharray:none;stroke-dashoffset:0;stroke-opacity:0.34901961"
       d="m 488.58953,298.9691 c 0.86397,-0.53943 1.00062,-0.60655 1.01791,-0.5 0.0167,0.10309 0.07,0.12307 0.32812,0.12307 h 0.30816 l -10e-6,-0.26562 v -0.26563 l 2.39063,0.0181 2.39063,0.018 0.36632,0.38821 c 0.20148,0.21351 0.5066,0.54992 0.67806,0.74758 l 0.31173,0.35937 h -4.39474 -4.39474 z"
       id="path990"
       inkscape:connector-curvature="0"
       transform="scale(0.26458333)" />
    <path
       style="fill:#008bff;fill-opacity:0.3504674;stroke:#008aff;stroke-width:0.02362205;stroke-miterlimit:4;stroke-dasharray:none;stroke-dashoffset:0;stroke-opacity:0.34901961"
       d="m 489.2935,297.2953 c 1.26564,-1.31912 1.57589,-1.6236 1.57323,-1.54394 -0.001,0.0328 -0.0433,0.11416 -0.0937,0.18088 -0.12378,0.16365 -0.11917,0.17929 0.089,0.30226 l 0.18076,0.10677 0.20987,-0.34822 0.20987,-0.34822 0.70772,-0.003 0.70772,-0.003 0.37976,0.42991 c 0.20886,0.23644 0.57916,0.65204 0.82287,0.92354 l 0.44312,0.49364 -2.31185,-0.0335 -2.31184,-0.0335 -0.79788,0.49298 c -0.43884,0.27114 -0.81478,0.49298 -0.83543,0.49298 -0.0207,0 0.44142,-0.49922 1.02684,-1.10937 z"
       id="path992"
       inkscape:connector-curvature="0"
       transform="scale(0.26458333)" />
    <path
       style="fill:#008bff;fill-opacity:0.3504674;stroke:#008aff;stroke-width:0.02362205;stroke-miterlimit:4;stroke-dasharray:none;stroke-dashoffset:0;stroke-opacity:0.34901961"
       d="m 494.43972,296.48364 c -0.48113,-0.54094 -0.8673,-0.991 -0.85817,-1.00014 0.009,-0.009 1.20952,0.43221 2.66751,0.98076 l 2.65091,0.99737 -1.79274,0.003 -1.79273,0.003 z"
       id="path994"
       inkscape:connector-curvature="0"
       transform="scale(0.26458333)" />
    <path
       style="fill:#008bff;fill-opacity:0.3504674;stroke:#008aff;stroke-width:0.02362205;stroke-miterlimit:4;stroke-dasharray:none;stroke-dashoffset:0;stroke-opacity:0.34901961"
       d="m 496.53268,298.84217 -0.66941,-0.75 h 1.92147 c 1.06907,0 1.89514,0.0237 1.8621,0.0535 -0.0736,0.0662 -2.38067,1.44653 -2.41783,1.44653 -0.0148,0 -0.32816,-0.3375 -0.69633,-0.75 z"
       id="path996"
       inkscape:connector-curvature="0"
       transform="scale(0.26458333)" />
    <path
       style="fill:#008bff;fill-opacity:0.3504674;stroke:#008aff;stroke-width:0.02362205;stroke-miterlimit:4;stroke-dasharray:none;stroke-dashoffset:0;stroke-opacity:0.34901961"
       d="m 491.03627,293.82723 c -0.14486,-1.05598 -0.3547,-1.98992 -0.60752,-2.70381 -0.39389,-1.11224 -0.74275,-1.65148 -1.71257,-2.6471 -1.13235,-1.16248 -2.01305,-1.73979 -3.06421,-2.00864 -1.21198,-0.30997 -3.48936,-0.0183 -4.8145,0.61665 -1.15652,0.55413 -2.45123,1.75488 -3.37942,3.13416 -0.3118,0.46334 -0.69149,1.01747 -0.84375,1.23139 l -0.27683,0.38897 -0.64063,0.002 c -0.35234,9.1e-4 -0.64062,-0.0127 -0.64062,-0.0302 0,-0.12045 2.52806,-3.66338 2.90851,-4.0761 0.82204,-0.8918 1.82687,-1.62633 2.75729,-2.01559 0.53542,-0.22401 1.71035,-0.53458 2.35417,-0.6223 1.39522,-0.19008 3.09796,-0.14031 3.99713,0.11683 0.93416,0.26714 2.26844,1.17414 2.92295,1.98693 1.16992,1.45282 2.28625,4.14512 2.65079,6.39298 0.0529,0.32609 0.0963,0.66669 0.0964,0.75689 l 2.5e-4,0.16401 -0.70312,0.0307 c -0.38672,0.0169 -0.74531,0.0489 -0.79688,0.071 -0.0777,0.0334 -0.11318,-0.10138 -0.20744,-0.78848 z"
       id="path998"
       inkscape:connector-curvature="0"
       transform="scale(0.26458333)" />
    <path
       style="fill:#008bff;fill-opacity:0.3504674;stroke:#008aff;stroke-width:0.00590551;stroke-miterlimit:4;stroke-dasharray:none;stroke-dashoffset:0;stroke-opacity:0.34901961"
       d="m 491.7586,295.23757 c -0.0451,-0.004 -0.082,-0.009 -0.082,-0.0124 0,-0.003 0.0289,-0.0558 0.0643,-0.11721 0.0609,-0.10559 0.0628,-0.11271 0.0358,-0.13246 -0.0247,-0.0181 -0.006,-0.0224 0.1427,-0.0326 0.3244,-0.0222 0.80976,0.0173 1.07897,0.0878 0.14903,0.039 0.19252,0.0598 0.16117,0.077 -0.0447,0.0244 -0.26203,0.0784 -0.41323,0.10259 -0.15304,0.0245 -0.80302,0.0425 -0.98771,0.0273 z"
       id="path1000"
       inkscape:connector-curvature="0"
       transform="scale(0.26458333)" />
    <path
       style="fill:#008bff;fill-opacity:0.3504674;stroke:#008aff;stroke-width:0.00295276;stroke-miterlimit:4;stroke-dasharray:none;stroke-dashoffset:0;stroke-opacity:0.34901961"
       d="m 491.20168,295.13532 c -0.0299,-0.0101 -0.0665,-0.0236 -0.0814,-0.0299 l -0.027,-0.0115 0.0293,-0.0122 c 0.0642,-0.0268 0.21616,-0.0714 0.21616,-0.0633 0,0.007 -0.0709,0.12813 -0.0772,0.132 -0.003,0.002 -0.03,-0.005 -0.0599,-0.015 z"
       id="path1002"
       inkscape:connector-curvature="0"
       transform="scale(0.26458333)" />
    <path
       style="fill:none;stroke:#000000;stroke-width:0.26458332px;stroke-linecap:butt;stroke-linejoin:miter;stroke-opacity:1"
       d="m 119.64321,89.425121 8.32544,-5.61266"
       id="path1004"
       inkscape:connector-curvature="0"
       sodipodi:nodetypes="cc" />
    <path
       style="fill:none;stroke:#000000;stroke-width:0.26458332px;stroke-linecap:butt;stroke-linejoin:miter;stroke-opacity:1"
       d="m 121.79472,74.177394 5.23848,0.841899"
       id="path1006"
       inkscape:connector-curvature="0" />
    <path
       style="fill:none;stroke:#000000;stroke-width:0.26870388px;stroke-linecap:butt;stroke-linejoin:miter;stroke-opacity:1"
       d="m 128.81055,53.78473 22.26355,1.870887"
       id="path1008"
       inkscape:connector-curvature="0"
       sodipodi:nodetypes="cc" />
  </g>
</svg>
