ind;val;datetime
0;0;17062021165902
1;160;17062021165902
2;170;17062021165902
3;159;17062021165902
4;164;17062021165902
5;161;17062021165902
6;164;17062021165902
7;170;17062021165902
8;169;17062021165902
9;161;17062021165902
10;165;17062021165902
11;169;17062021165902
12;165;17062021165902
13;172;17062021165902
14;169;17062021165902
15;176;17062021165902
16;176;17062021165902
17;182;17062021165902
18;205;17062021165902
19;246;17062021165902
20;325;17062021165902
21;535;17062021165902
22;1023;17062021165902
23;1023;17062021165902
24;1023;17062021165902
25;1023;17062021165902
26;1023;17062021165902
27;1023;17062021165902
28;1023;17062021165902
29;1023;17062021165902
30;1023;17062021165902
31;1023;17062021165902
32;1023;17062021165902
33;852;17062021165902
34;654;17062021165902
35;507;17062021165902
36;395;17062021165902
37;337;17062021165902
38;281;17062021165902
39;259;17062021165902
40;234;17062021165902
41;218;17062021165902
42;216;17062021165902
43;214;17062021165902
44;222;17062021165902
45;243;17062021165902
46;236;17062021165902
47;234;17062021165902
48;223;17062021165902
49;215;17062021165902
50;212;17062021165902
51;205;17062021165902
52;196;17062021165902
53;190;17062021165902
54;182;17062021165902
55;183;17062021165902
56;181;17062021165902
57;181;17062021165902
58;183;17062021165902
59;183;17062021165902
60;186;17062021165902
61;188;17062021165902
62;185;17062021165902
63;182;17062021165902
64;190;17062021165902
65;178;17062021165902
66;180;17062021165902
67;177;17062021165902
68;178;17062021165902
69;179;17062021165902
70;179;17062021165902
71;172;17062021165902
72;175;17062021165902
73;177;17062021165902
74;174;17062021165902
75;178;17062021165902
76;175;17062021165902
77;176;17062021165902
78;176;17062021165902
79;186;17062021165902
80;175;17062021165902
81;166;17062021165902
82;170;17062021165902
83;166;17062021165902
84;165;17062021165902
85;165;17062021165902
86;170;17062021165902
87;171;17062021165902
88;163;17062021165902
89;156;17062021165902
90;167;17062021165902
91;158;17062021165902
92;158;17062021165902
93;167;17062021165902
94;162;17062021165902
95;158;17062021165902
96;159;17062021165902
97;156;17062021165902
98;154;17062021165902
99;157;17062021165902
100;151;17062021165902
101;168;17062021165902
102;163;17062021165902
103;156;17062021165902
104;157;17062021165902
105;154;17062021165902
106;156;17062021165902
107;154;17062021165902
108;159;17062021165902
109;156;17062021165902
110;152;17062021165902
111;150;17062021165902
112;153;17062021165902
113;150;17062021165902
114;150;17062021165902
115;157;17062021165902
116;160;17062021165902
117;156;17062021165902
118;152;17062021165902
119;159;17062021165902
120;155;17062021165902
121;152;17062021165902
122;155;17062021165902
123;152;17062021165902
124;158;17062021165902
125;153;17062021165902
126;152;17062021165902
127;160;17062021165902
128;163;17062021165902
129;157;17062021165902
130;155;17062021165902
131;153;17062021165902
132;150;17062021165902
133;169;17062021165902
134;152;17062021165902
135;155;17062021165902
136;154;17062021165902
137;153;17062021165902
138;161;17062021165902
139;152;17062021165902
140;156;17062021165902
141;159;17062021165902
142;157;17062021165902
143;151;17062021165902
144;159;17062021165902
145;155;17062021165902
146;156;17062021165902
147;161;17062021165902
148;154;17062021165902
149;159;17062021165902
150;163;17062021165902
151;161;17062021165902
152;154;17062021165902
153;156;17062021165902
154;158;17062021165902
155;163;17062021165902
156;158;17062021165902
157;153;17062021165902
158;152;17062021165902
159;153;17062021165902
160;153;17062021165902
161;155;17062021165902
162;156;17062021165902
163;158;17062021165902
164;159;17062021165902
165;159;17062021165902
166;155;17062021165902
167;160;17062021165902
168;162;17062021165902
169;150;17062021165902
170;159;17062021165902
171;154;17062021165902
172;154;17062021165902
173;162;17062021165902
174;154;17062021165902
175;156;17062021165902
176;158;17062021165902
177;153;17062021165902
178;162;17062021165902
179;159;17062021165902
180;156;17062021165902
181;156;17062021165902
182;162;17062021165902
183;154;17062021165902
184;156;17062021165902
185;151;17062021165902
186;160;17062021165902
187;155;17062021165902
188;157;17062021165902
189;161;17062021165902
190;153;17062021165902
191;162;17062021165902
192;162;17062021165902
193;155;17062021165902
194;164;17062021165902
195;160;17062021165902
196;157;17062021165902
197;154;17062021165902
198;158;17062021165902
199;153;17062021165902
200;0;17062021165902
0;0;17062021165903
1;160;17062021165903
2;169;17062021165903
3;158;17062021165903
4;165;17062021165903
5;161;17062021165903
6;164;17062021165903
7;169;17062021165903
8;170;17062021165903
9;160;17062021165903
10;167;17062021165903
11;167;17062021165903
12;164;17062021165903
13;174;17062021165903
14;169;17062021165903
15;173;17062021165903
16;179;17062021165903
17;183;17062021165903
18;204;17062021165903
19;247;17062021165903
20;324;17062021165903
21;532;17062021165903
22;1023;17062021165903
23;1023;17062021165903
24;1023;17062021165903
25;1023;17062021165903
26;1023;17062021165903
27;1023;17062021165903
28;1023;17062021165903
29;1023;17062021165903
30;1023;17062021165903
31;1023;17062021165903
32;1023;17062021165903
33;869;17062021165903
34;661;17062021165903
35;512;17062021165903
36;402;17062021165903
37;339;17062021165903
38;284;17062021165903
39;259;17062021165903
40;235;17062021165903
41;218;17062021165903
42;217;17062021165903
43;215;17062021165903
44;219;17062021165903
45;243;17062021165903
46;241;17062021165903
47;234;17062021165903
48;223;17062021165903
49;218;17062021165903
50;211;17062021165903
51;204;17062021165903
52;195;17062021165903
53;189;17062021165903
54;182;17062021165903
55;181;17062021165903
56;180;17062021165903
57;182;17062021165903
58;182;17062021165903
59;183;17062021165903
60;185;17062021165903
61;187;17062021165903
62;186;17062021165903
63;181;17062021165903
64;188;17062021165903
65;176;17062021165903
66;179;17062021165903
67;176;17062021165903
68;177;17062021165903
69;177;17062021165903
70;180;17062021165903
71;172;17062021165903
72;176;17062021165903
73;176;17062021165903
74;175;17062021165903
75;178;17062021165903
76;175;17062021165903
77;176;17062021165903
78;175;17062021165903
79;184;17062021165903
80;174;17062021165903
81;165;17062021165903
82;169;17062021165903
83;167;17062021165903
84;164;17062021165903
85;165;17062021165903
86;170;17062021165903
87;172;17062021165903
88;162;17062021165903
89;155;17062021165903
90;166;17062021165903
91;158;17062021165903
92;158;17062021165903
93;167;17062021165903
94;164;17062021165903
95;157;17062021165903
96;159;17062021165903
97;156;17062021165903
98;154;17062021165903
99;157;17062021165903
100;152;17062021165903
101;165;17062021165903
102;165;17062021165903
103;155;17062021165903
104;159;17062021165903
105;154;17062021165903
106;155;17062021165903
107;154;17062021165903
108;157;17062021165903
109;156;17062021165903
110;151;17062021165903
111;150;17062021165903
112;154;17062021165903
113;150;17062021165903
114;150;17062021165903
115;154;17062021165903
116;158;17062021165903
117;156;17062021165903
118;151;17062021165903
119;158;17062021165903
120;155;17062021165903
121;151;17062021165903
122;154;17062021165903
123;152;17062021165903
124;159;17062021165903
125;153;17062021165903
126;150;17062021165903
127;159;17062021165903
128;163;17062021165903
129;156;17062021165903
130;155;17062021165903
131;153;17062021165903
132;149;17062021165903
133;168;17062021165903
134;152;17062021165903
135;155;17062021165903
136;155;17062021165903
137;151;17062021165903
138;159;17062021165903
139;152;17062021165903
140;155;17062021165903
141;159;17062021165903
142;156;17062021165903
143;150;17062021165903
144;158;17062021165903
145;154;17062021165903
146;155;17062021165903
147;159;17062021165903
148;153;17062021165903
149;157;17062021165903
150;161;17062021165903
151;159;17062021165903
152;153;17062021165903
153;155;17062021165903
154;156;17062021165903
155;163;17062021165903
156;159;17062021165903
157;154;17062021165903
158;152;17062021165903
159;152;17062021165903
160;153;17062021165903
161;153;17062021165903
162;156;17062021165903
163;157;17062021165903
164;158;17062021165903
165;159;17062021165903
166;153;17062021165903
167;159;17062021165903
168;161;17062021165903
169;150;17062021165903
170;157;17062021165903
171;152;17062021165903
172;152;17062021165903
173;160;17062021165903
174;152;17062021165903
175;155;17062021165903
176;157;17062021165903
177;153;17062021165903
178;161;17062021165903
179;156;17062021165903
180;155;17062021165903
181;155;17062021165903
182;161;17062021165903
183;154;17062021165903
184;156;17062021165903
185;150;17062021165903
186;159;17062021165903
187;154;17062021165903
188;156;17062021165903
189;159;17062021165903
190;153;17062021165903
191;162;17062021165903
192;161;17062021165903
193;152;17062021165903
194;163;17062021165903
195;156;17062021165903
196;155;17062021165903
197;155;17062021165903
198;159;17062021165903
199;155;17062021165903
200;0;17062021165903
0;0;17062021165905
1;160;17062021165905
2;169;17062021165905
3;159;17062021165905
4;163;17062021165905
5;161;17062021165905
6;163;17062021165905
7;167;17062021165905
8;169;17062021165905
9;160;17062021165905
10;167;17062021165905
11;167;17062021165905
12;165;17062021165905
13;172;17062021165905
14;168;17062021165905
15;175;17062021165905
16;176;17062021165905
17;183;17062021165905
18;206;17062021165905
19;247;17062021165905
20;324;17062021165905
21;533;17062021165905
22;1023;17062021165905
23;1023;17062021165905
24;1023;17062021165905
25;1023;17062021165905
26;1023;17062021165905
27;1023;17062021165905
28;1023;17062021165905
29;1023;17062021165905
30;1023;17062021165905
31;1023;17062021165905
32;1023;17062021165905
33;874;17062021165905
34;663;17062021165905
35;513;17062021165905
36;405;17062021165905
37;341;17062021165905
38;287;17062021165905
39;262;17062021165905
40;236;17062021165905
41;221;17062021165905
42;217;17062021165905
43;216;17062021165905
44;220;17062021165905
45;244;17062021165905
46;237;17062021165905
47;234;17062021165905
48;226;17062021165905
49;217;17062021165905
50;214;17062021165905
51;203;17062021165905
52;195;17062021165905
53;190;17062021165905
54;184;17062021165905
55;183;17062021165905
56;179;17062021165905
57;182;17062021165905
58;183;17062021165905
59;183;17062021165905
60;185;17062021165905
61;187;17062021165905
62;187;17062021165905
63;182;17062021165905
64;190;17062021165905
65;178;17062021165905
66;180;17062021165905
67;177;17062021165905
68;177;17062021165905
69;179;17062021165905
70;180;17062021165905
71;174;17062021165905
72;174;17062021165905
73;174;17062021165905
74;174;17062021165905
75;177;17062021165905
76;174;17062021165905
77;178;17062021165905
78;175;17062021165905
79;185;17062021165905
80;175;17062021165905
81;165;17062021165905
82;170;17062021165905
83;165;17062021165905
84;165;17062021165905
85;164;17062021165905
86;169;17062021165905
87;171;17062021165905
88;163;17062021165905
89;155;17062021165905
90;166;17062021165905
91;157;17062021165905
92;158;17062021165905
93;166;17062021165905
94;162;17062021165905
95;157;17062021165905
96;157;17062021165905
97;157;17062021165905
98;154;17062021165905
99;158;17062021165905
100;151;17062021165905
101;170;17062021165905
102;165;17062021165905
103;157;17062021165905
104;158;17062021165905
105;154;17062021165905
106;155;17062021165905
107;154;17062021165905
108;158;17062021165905
109;157;17062021165905
110;152;17062021165905
111;151;17062021165905
112;152;17062021165905
113;151;17062021165905
114;151;17062021165905
115;154;17062021165905
116;159;17062021165905
117;158;17062021165905
118;153;17062021165905
119;159;17062021165905
120;154;17062021165905
121;150;17062021165905
122;154;17062021165905
123;152;17062021165905
124;159;17062021165905
125;154;17062021165905
126;151;17062021165905
127;157;17062021165905
128;160;17062021165905
129;156;17062021165905
130;154;17062021165905
131;153;17062021165905
132;151;17062021165905
133;168;17062021165905
134;151;17062021165905
135;154;17062021165905
136;154;17062021165905
137;152;17062021165905
138;159;17062021165905
139;155;17062021165905
140;157;17062021165905
141;159;17062021165905
142;154;17062021165905
143;150;17062021165905
144;159;17062021165905
145;154;17062021165905
146;156;17062021165905
147;162;17062021165905
148;155;17062021165905
149;159;17062021165905
150;161;17062021165905
151;160;17062021165905
152;152;17062021165905
153;154;17062021165905
154;157;17062021165905
155;164;17062021165905
156;158;17062021165905
157;154;17062021165905
158;153;17062021165905
159;153;17062021165905
160;151;17062021165905
161;153;17062021165905
162;155;17062021165905
163;158;17062021165905
164;160;17062021165905
165;160;17062021165905
166;154;17062021165905
167;159;17062021165905
168;162;17062021165905
169;150;17062021165905
170;157;17062021165905
171;153;17062021165905
172;153;17062021165905
173;161;17062021165905
174;153;17062021165905
175;154;17062021165905
176;158;17062021165905
177;154;17062021165905
178;163;17062021165905
179;159;17062021165905
180;154;17062021165905
181;154;17062021165905
182;163;17062021165905
183;153;17062021165905
184;155;17062021165905
185;151;17062021165905
186;159;17062021165905
187;156;17062021165905
188;157;17062021165905
189;160;17062021165905
190;153;17062021165905
191;161;17062021165905
192;161;17062021165905
193;154;17062021165905
194;164;17062021165905
195;158;17062021165905
196;156;17062021165905
197;154;17062021165905
198;158;17062021165905
199;154;17062021165905
200;0;17062021165905
0;0;17062021165906
1;160;17062021165906
2;169;17062021165906
3;160;17062021165906
4;164;17062021165906
5;161;17062021165906
6;163;17062021165906
7;167;17062021165906
8;169;17062021165906
9;159;17062021165906
10;167;17062021165906
11;168;17062021165906
12;164;17062021165906
13;173;17062021165906
14;170;17062021165906
15;176;17062021165906
16;179;17062021165906
17;182;17062021165906
18;206;17062021165906
19;248;17062021165906
20;325;17062021165906
21;528;17062021165906
22;1023;17062021165906
23;1023;17062021165906
24;1023;17062021165906
25;1023;17062021165906
26;1023;17062021165906
27;1023;17062021165906
28;1023;17062021165906
29;1023;17062021165906
30;1023;17062021165906
31;1023;17062021165906
32;1023;17062021165906
33;874;17062021165906
34;660;17062021165906
35;516;17062021165906
36;409;17062021165906
37;337;17062021165906
38;284;17062021165906
39;261;17062021165906
40;234;17062021165906
41;220;17062021165906
42;217;17062021165906
43;215;17062021165906
44;220;17062021165906
45;242;17062021165906
46;238;17062021165906
47;236;17062021165906
48;224;17062021165906
49;216;17062021165906
50;211;17062021165906
51;203;17062021165906
52;196;17062021165906
53;188;17062021165906
54;184;17062021165906
55;183;17062021165906
56;180;17062021165906
57;180;17062021165906
58;183;17062021165906
59;184;17062021165906
60;185;17062021165906
61;188;17062021165906
62;186;17062021165906
63;182;17062021165906
64;190;17062021165906
65;175;17062021165906
66;179;17062021165906
67;177;17062021165906
68;177;17062021165906
69;177;17062021165906
70;181;17062021165906
71;173;17062021165906
72;176;17062021165906
73;175;17062021165906
74;177;17062021165906
75;179;17062021165906
76;173;17062021165906
77;178;17062021165906
78;174;17062021165906
79;184;17062021165906
80;175;17062021165906
81;164;17062021165906
82;168;17062021165906
83;165;17062021165906
84;165;17062021165906
85;166;17062021165906
86;171;17062021165906
87;172;17062021165906
88;163;17062021165906
89;156;17062021165906
90;166;17062021165906
91;158;17062021165906
92;158;17062021165906
93;166;17062021165906
94;161;17062021165906
95;156;17062021165906
96;158;17062021165906
97;156;17062021165906
98;153;17062021165906
99;158;17062021165906
100;152;17062021165906
101;167;17062021165906
102;166;17062021165906
103;155;17062021165906
104;158;17062021165906
105;154;17062021165906
106;155;17062021165906
107;153;17062021165906
108;158;17062021165906
109;156;17062021165906
110;151;17062021165906
111;149;17062021165906
112;153;17062021165906
113;150;17062021165906
114;150;17062021165906
115;156;17062021165906
116;159;17062021165906
117;156;17062021165906
118;151;17062021165906
119;159;17062021165906
120;155;17062021165906
121;150;17062021165906
122;154;17062021165906
123;152;17062021165906
124;157;17062021165906
125;153;17062021165906
126;151;17062021165906
127;158;17062021165906
128;162;17062021165906
129;156;17062021165906
130;155;17062021165906
131;153;17062021165906
132;150;17062021165906
133;167;17062021165906
134;153;17062021165906
135;154;17062021165906
136;154;17062021165906
137;152;17062021165906
138;159;17062021165906
139;152;17062021165906
140;155;17062021165906
141;160;17062021165906
142;155;17062021165906
143;151;17062021165906
144;157;17062021165906
145;155;17062021165906
146;155;17062021165906
147;162;17062021165906
148;154;17062021165906
149;159;17062021165906
150;161;17062021165906
151;160;17062021165906
152;153;17062021165906
153;153;17062021165906
154;157;17062021165906
155;164;17062021165906
156;157;17062021165906
157;153;17062021165906
158;154;17062021165906
159;153;17062021165906
160;153;17062021165906
161;155;17062021165906
162;155;17062021165906
163;157;17062021165906
164;158;17062021165906
165;159;17062021165906
166;154;17062021165906
167;159;17062021165906
168;162;17062021165906
169;149;17062021165906
170;158;17062021165906
171;152;17062021165906
172;154;17062021165906
173;161;17062021165906
174;152;17062021165906
175;155;17062021165906
176;156;17062021165906
177;153;17062021165906
178;161;17062021165906
179;158;17062021165906
180;154;17062021165906
181;155;17062021165906
182;163;17062021165906
183;154;17062021165906
184;156;17062021165906
185;151;17062021165906
186;159;17062021165906
187;156;17062021165906
188;157;17062021165906
189;160;17062021165906
190;152;17062021165906
191;160;17062021165906
192;160;17062021165906
193;153;17062021165906
194;164;17062021165906
195;157;17062021165906
196;156;17062021165906
197;153;17062021165906
198;158;17062021165906
199;154;17062021165906
200;0;17062021165906
0;0;17062021165907
1;159;17062021165907
2;168;17062021165907
3;158;17062021165907
4;164;17062021165907
5;159;17062021165907
6;163;17062021165907
7;169;17062021165907
8;169;17062021165907
9;160;17062021165907
10;168;17062021165907
11;168;17062021165907
12;165;17062021165907
13;171;17062021165907
14;168;17062021165907
15;175;17062021165907
16;176;17062021165907
17;183;17062021165907
18;206;17062021165907
19;248;17062021165907
20;326;17062021165907
21;525;17062021165907
22;1018;17062021165907
23;1023;17062021165907
24;1023;17062021165907
25;1023;17062021165907
26;1023;17062021165907
27;1023;17062021165907
28;1023;17062021165907
29;1023;17062021165907
30;1023;17062021165907
31;1023;17062021165907
32;1023;17062021165907
33;888;17062021165907
34;671;17062021165907
35;525;17062021165907
36;410;17062021165907
37;346;17062021165907
38;289;17062021165907
39;263;17062021165907
40;236;17062021165907
41;221;17062021165907
42;220;17062021165907
43;215;17062021165907
44;222;17062021165907
45;241;17062021165907
46;239;17062021165907
47;236;17062021165907
48;227;17062021165907
49;217;17062021165907
50;211;17062021165907
51;204;17062021165907
52;194;17062021165907
53;191;17062021165907
54;182;17062021165907
55;181;17062021165907
56;182;17062021165907
57;181;17062021165907
58;181;17062021165907
59;184;17062021165907
60;185;17062021165907
61;187;17062021165907
62;185;17062021165907
63;183;17062021165907
64;190;17062021165907
65;175;17062021165907
66;176;17062021165907
67;177;17062021165907
68;177;17062021165907
69;178;17062021165907
70;180;17062021165907
71;171;17062021165907
72;175;17062021165907
73;174;17062021165907
74;175;17062021165907
75;176;17062021165907
76;174;17062021165907
77;176;17062021165907
78;173;17062021165907
79;184;17062021165907
80;174;17062021165907
81;164;17062021165907
82;167;17062021165907
83;164;17062021165907
84;163;17062021165907
85;167;17062021165907
86;171;17062021165907
87;172;17062021165907
88;162;17062021165907
89;154;17062021165907
90;165;17062021165907
91;157;17062021165907
92;157;17062021165907
93;167;17062021165907
94;162;17062021165907
95;156;17062021165907
96;158;17062021165907
97;156;17062021165907
98;154;17062021165907
99;157;17062021165907
100;151;17062021165907
101;168;17062021165907
102;165;17062021165907
103;154;17062021165907
104;156;17062021165907
105;154;17062021165907
106;154;17062021165907
107;152;17062021165907
108;157;17062021165907
109;156;17062021165907
110;151;17062021165907
111;150;17062021165907
112;152;17062021165907
113;150;17062021165907
114;151;17062021165907
115;154;17062021165907
116;157;17062021165907
117;155;17062021165907
118;151;17062021165907
119;158;17062021165907
120;153;17062021165907
121;151;17062021165907
122;153;17062021165907
123;152;17062021165907
124;158;17062021165907
125;153;17062021165907
126;150;17062021165907
127;157;17062021165907
128;161;17062021165907
129;156;17062021165907
130;152;17062021165907
131;153;17062021165907
132;149;17062021165907
133;165;17062021165907
134;151;17062021165907
135;154;17062021165907
136;153;17062021165907
137;151;17062021165907
138;159;17062021165907
139;151;17062021165907
140;156;17062021165907
141;159;17062021165907
142;154;17062021165907
143;150;17062021165907
144;156;17062021165907
145;154;17062021165907
146;155;17062021165907
147;161;17062021165907
148;153;17062021165907
149;158;17062021165907
150;159;17062021165907
151;159;17062021165907
152;153;17062021165907
153;153;17062021165907
154;157;17062021165907
155;162;17062021165907
156;156;17062021165907
157;153;17062021165907
158;152;17062021165907
159;150;17062021165907
160;152;17062021165907
161;153;17062021165907
162;153;17062021165907
163;155;17062021165907
164;156;17062021165907
165;157;17062021165907
166;152;17062021165907
167;158;17062021165907
168;161;17062021165907
169;149;17062021165907
170;157;17062021165907
171;152;17062021165907
172;152;17062021165907
173;160;17062021165907
174;153;17062021165907
175;154;17062021165907
176;157;17062021165907
177;152;17062021165907
178;160;17062021165907
179;157;17062021165907
180;154;17062021165907
181;153;17062021165907
182;161;17062021165907
183;153;17062021165907
184;156;17062021165907
185;149;17062021165907
186;158;17062021165907
187;156;17062021165907
188;157;17062021165907
189;159;17062021165907
190;151;17062021165907
191;160;17062021165907
192;160;17062021165907
193;153;17062021165907
194;163;17062021165907
195;157;17062021165907
196;153;17062021165907
197;153;17062021165907
198;157;17062021165907
199;155;17062021165907
200;0;17062021165907
0;0;17062021165908
1;159;17062021165908
2;169;17062021165908
3;159;17062021165908
4;163;17062021165908
5;160;17062021165908
6;164;17062021165908
7;168;17062021165908
8;168;17062021165908
9;159;17062021165908
10;168;17062021165908
11;167;17062021165908
12;166;17062021165908
13;172;17062021165908
14;168;17062021165908
15;174;17062021165908
16;178;17062021165908
17;181;17062021165908
18;205;17062021165908
19;251;17062021165908
20;330;17062021165908
21;538;17062021165908
22;1023;17062021165908
23;1023;17062021165908
24;1023;17062021165908
25;1023;17062021165908
26;1023;17062021165908
27;1023;17062021165908
28;1023;17062021165908
29;1023;17062021165908
30;1023;17062021165908
31;1023;17062021165908
32;1023;17062021165908
33;906;17062021165908
34;688;17062021165908
35;535;17062021165908
36;416;17062021165908
37;354;17062021165908
38;296;17062021165908
39;269;17062021165908
40;243;17062021165908
41;228;17062021165908
42;225;17062021165908
43;223;17062021165908
44;230;17062021165908
45;249;17062021165908
46;244;17062021165908
47;242;17062021165908
48;231;17062021165908
49;223;17062021165908
50;217;17062021165908
51;208;17062021165908
52;201;17062021165908
53;195;17062021165908
54;188;17062021165908
55;187;17062021165908
56;185;17062021165908
57;183;17062021165908
58;186;17062021165908
59;189;17062021165908
60;189;17062021165908
61;193;17062021165908
62;189;17062021165908
63;185;17062021165908
64;192;17062021165908
65;179;17062021165908
66;182;17062021165908
67;179;17062021165908
68;179;17062021165908
69;178;17062021165908
70;182;17062021165908
71;174;17062021165908
72;176;17062021165908
73;176;17062021165908
74;176;17062021165908
75;177;17062021165908
76;174;17062021165908
77;179;17062021165908
78;176;17062021165908
79;185;17062021165908
80;173;17062021165908
81;164;17062021165908
82;169;17062021165908
83;166;17062021165908
84;163;17062021165908
85;164;17062021165908
86;171;17062021165908
87;172;17062021165908
88;162;17062021165908
89;155;17062021165908
90;166;17062021165908
91;155;17062021165908
92;158;17062021165908
93;167;17062021165908
94;162;17062021165908
95;157;17062021165908
96;159;17062021165908
97;157;17062021165908
98;152;17062021165908
99;158;17062021165908
100;150;17062021165908
101;168;17062021165908
102;165;17062021165908
103;154;17062021165908
104;157;17062021165908
105;153;17062021165908
106;153;17062021165908
107;153;17062021165908
108;156;17062021165908
109;156;17062021165908
110;151;17062021165908
111;150;17062021165908
112;151;17062021165908
113;150;17062021165908
114;151;17062021165908
115;153;17062021165908
116;158;17062021165908
117;157;17062021165908
118;153;17062021165908
119;157;17062021165908
120;153;17062021165908
121;151;17062021165908
122;153;17062021165908
123;150;17062021165908
124;156;17062021165908
125;152;17062021165908
126;151;17062021165908
127;157;17062021165908
128;161;17062021165908
129;155;17062021165908
130;154;17062021165908
131;152;17062021165908
132;149;17062021165908
133;167;17062021165908
134;153;17062021165908
135;153;17062021165908
136;154;17062021165908
137;151;17062021165908
138;158;17062021165908
139;152;17062021165908
140;155;17062021165908
141;158;17062021165908
142;156;17062021165908
143;150;17062021165908
144;157;17062021165908
145;156;17062021165908
146;155;17062021165908
147;160;17062021165908
148;153;17062021165908
149;156;17062021165908
150;160;17062021165908
151;159;17062021165908
152;152;17062021165908
153;153;17062021165908
154;156;17062021165908
155;162;17062021165908
156;155;17062021165908
157;154;17062021165908
158;152;17062021165908
159;151;17062021165908
160;151;17062021165908
161;152;17062021165908
162;153;17062021165908
163;156;17062021165908
164;158;17062021165908
165;158;17062021165908
166;152;17062021165908
167;158;17062021165908
168;160;17062021165908
169;149;17062021165908
170;156;17062021165908
171;151;17062021165908
172;152;17062021165908
173;160;17062021165908
174;151;17062021165908
175;154;17062021165908
176;156;17062021165908
177;152;17062021165908
178;160;17062021165908
179;157;17062021165908
180;152;17062021165908
181;153;17062021165908
182;160;17062021165908
183;154;17062021165908
184;156;17062021165908
185;149;17062021165908
186;159;17062021165908
187;155;17062021165908
188;156;17062021165908
189;158;17062021165908
190;152;17062021165908
191;160;17062021165908
192;159;17062021165908
193;152;17062021165908
194;164;17062021165908
195;156;17062021165908
196;155;17062021165908
197;153;17062021165908
198;157;17062021165908
199;153;17062021165908
200;0;17062021165908
0;0;17062021165909
1;159;17062021165909
2;167;17062021165909
3;159;17062021165909
4;163;17062021165909
5;160;17062021165909
6;163;17062021165909
7;166;17062021165909
8;169;17062021165909
9;160;17062021165909
10;168;17062021165909
11;167;17062021165909
12;165;17062021165909
13;172;17062021165909
14;169;17062021165909
15;175;17062021165909
16;179;17062021165909
17;182;17062021165909
18;207;17062021165909
19;249;17062021165909
20;333;17062021165909
21;539;17062021165909
22;1023;17062021165909
23;1023;17062021165909
24;1023;17062021165909
25;1023;17062021165909
26;1023;17062021165909
27;1023;17062021165909
28;1023;17062021165909
29;1023;17062021165909
30;1023;17062021165909
31;1023;17062021165909
32;1023;17062021165909
33;912;17062021165909
34;693;17062021165909
35;540;17062021165909
36;423;17062021165909
37;357;17062021165909
38;298;17062021165909
39;269;17062021165909
40;247;17062021165909
41;230;17062021165909
42;226;17062021165909
43;223;17062021165909
44;229;17062021165909
45;247;17062021165909
46;246;17062021165909
47;240;17062021165909
48;230;17062021165909
49;225;17062021165909
50;217;17062021165909
51;210;17062021165909
52;201;17062021165909
53;196;17062021165909
54;187;17062021165909
55;185;17062021165909
56;187;17062021165909
57;186;17062021165909
58;188;17062021165909
59;187;17062021165909
60;190;17062021165909
61;191;17062021165909
62;190;17062021165909
63;186;17062021165909
64;194;17062021165909
65;180;17062021165909
66;183;17062021165909
67;180;17062021165909
68;180;17062021165909
69;179;17062021165909
70;182;17062021165909
71;174;17062021165909
72;177;17062021165909
73;177;17062021165909
74;175;17062021165909
75;180;17062021165909
76;175;17062021165909
77;177;17062021165909
78;177;17062021165909
79;185;17062021165909
80;175;17062021165909
81;165;17062021165909
82;169;17062021165909
83;167;17062021165909
84;164;17062021165909
85;164;17062021165909
86;170;17062021165909
87;170;17062021165909
88;163;17062021165909
89;156;17062021165909
90;166;17062021165909
91;156;17062021165909
92;157;17062021165909
93;167;17062021165909
94;161;17062021165909
95;157;17062021165909
96;159;17062021165909
97;156;17062021165909
98;154;17062021165909
99;157;17062021165909
100;150;17062021165909
101;167;17062021165909
102;164;17062021165909
103;155;17062021165909
104;158;17062021165909
105;153;17062021165909
106;155;17062021165909
107;152;17062021165909
108;156;17062021165909
109;155;17062021165909
110;149;17062021165909
111;150;17062021165909
112;151;17062021165909
113;150;17062021165909
114;149;17062021165909
115;154;17062021165909
116;157;17062021165909
117;155;17062021165909
118;151;17062021165909
119;157;17062021165909
120;154;17062021165909
121;151;17062021165909
122;154;17062021165909
123;150;17062021165909
124;158;17062021165909
125;153;17062021165909
126;151;17062021165909
127;157;17062021165909
128;161;17062021165909
129;155;17062021165909
130;155;17062021165909
131;152;17062021165909
132;150;17062021165909
133;166;17062021165909
134;151;17062021165909
135;154;17062021165909
136;154;17062021165909
137;152;17062021165909
138;160;17062021165909
139;152;17062021165909
140;154;17062021165909
141;158;17062021165909
142;155;17062021165909
143;149;17062021165909
144;158;17062021165909
145;154;17062021165909
146;156;17062021165909
147;160;17062021165909
148;153;17062021165909
149;157;17062021165909
150;160;17062021165909
151;158;17062021165909
152;152;17062021165909
153;153;17062021165909
154;156;17062021165909
155;162;17062021165909
156;156;17062021165909
157;153;17062021165909
158;152;17062021165909
159;152;17062021165909
160;150;17062021165909
161;153;17062021165909
162;154;17062021165909
163;157;17062021165909
164;158;17062021165909
165;159;17062021165909
166;153;17062021165909
167;159;17062021165909
168;160;17062021165909
169;150;17062021165909
170;158;17062021165909
171;152;17062021165909
172;152;17062021165909
173;160;17062021165909
174;152;17062021165909
175;154;17062021165909
176;154;17062021165909
177;152;17062021165909
178;160;17062021165909
179;159;17062021165909
180;155;17062021165909
181;154;17062021165909
182;161;17062021165909
183;152;17062021165909
184;154;17062021165909
185;149;17062021165909
186;160;17062021165909
187;154;17062021165909
188;156;17062021165909
189;158;17062021165909
190;151;17062021165909
191;161;17062021165909
192;161;17062021165909
193;152;17062021165909
194;161;17062021165909
195;156;17062021165909
196;154;17062021165909
197;153;17062021165909
198;157;17062021165909
199;151;17062021165909
200;0;17062021165909
0;0;17062021165910
1;159;17062021165910
2;167;17062021165910
3;157;17062021165910
4;163;17062021165910
5;161;17062021165910
6;165;17062021165910
7;166;17062021165910
8;168;17062021165910
9;160;17062021165910
10;165;17062021165910
11;166;17062021165910
12;164;17062021165910
13;171;17062021165910
14;168;17062021165910
15;176;17062021165910
16;176;17062021165910
17;183;17062021165910
18;206;17062021165910
19;248;17062021165910
20;326;17062021165910
21;533;17062021165910
22;1021;17062021165910
23;1023;17062021165910
24;1023;17062021165910
25;1023;17062021165910
26;1023;17062021165910
27;1023;17062021165910
28;1023;17062021165910
29;1023;17062021165910
30;1023;17062021165910
31;1023;17062021165910
32;1023;17062021165910
33;925;17062021165910
34;700;17062021165910
35;541;17062021165910
36;427;17062021165910
37;354;17062021165910
38;299;17062021165910
39;270;17062021165910
40;247;17062021165910
41;230;17062021165910
42;230;17062021165910
43;224;17062021165910
44;231;17062021165910
45;250;17062021165910
46;246;17062021165910
47;240;17062021165910
48;234;17062021165910
49;225;17062021165910
50;221;17062021165910
51;210;17062021165910
52;203;17062021165910
53;198;17062021165910
54;191;17062021165910
55;187;17062021165910
56;186;17062021165910
57;187;17062021165910
58;188;17062021165910
59;191;17062021165910
60;191;17062021165910
61;192;17062021165910
62;191;17062021165910
63;188;17062021165910
64;192;17062021165910
65;182;17062021165910
66;184;17062021165910
67;180;17062021165910
68;181;17062021165910
69;179;17062021165910
70;183;17062021165910
71;174;17062021165910
72;178;17062021165910
73;177;17062021165910
74;178;17062021165910
75;177;17062021165910
76;176;17062021165910
77;178;17062021165910
78;176;17062021165910
79;186;17062021165910
80;175;17062021165910
81;166;17062021165910
82;169;17062021165910
83;167;17062021165910
84;165;17062021165910
85;166;17062021165910
86;171;17062021165910
87;173;17062021165910
88;162;17062021165910
89;156;17062021165910
90;165;17062021165910
91;157;17062021165910
92;157;17062021165910
93;166;17062021165910
94;162;17062021165910
95;157;17062021165910
96;158;17062021165910
97;157;17062021165910
98;153;17062021165910
99;158;17062021165910
100;150;17062021165910
101;168;17062021165910
102;165;17062021165910
103;155;17062021165910
104;158;17062021165910
105;152;17062021165910
106;154;17062021165910
107;152;17062021165910
108;157;17062021165910
109;155;17062021165910
110;150;17062021165910
111;150;17062021165910
112;152;17062021165910
113;150;17062021165910
114;150;17062021165910
115;154;17062021165910
116;157;17062021165910
117;155;17062021165910
118;152;17062021165910
119;157;17062021165910
120;153;17062021165910
121;150;17062021165910
122;153;17062021165910
123;150;17062021165910
124;157;17062021165910
125;153;17062021165910
126;150;17062021165910
127;158;17062021165910
128;161;17062021165910
129;156;17062021165910
130;152;17062021165910
131;153;17062021165910
132;149;17062021165910
133;166;17062021165910
134;151;17062021165910
135;153;17062021165910
136;154;17062021165910
137;151;17062021165910
138;159;17062021165910
139;152;17062021165910
140;155;17062021165910
141;157;17062021165910
142;154;17062021165910
143;150;17062021165910
144;158;17062021165910
145;154;17062021165910
146;155;17062021165910
147;161;17062021165910
148;153;17062021165910
149;158;17062021165910
150;160;17062021165910
151;159;17062021165910
152;152;17062021165910
153;153;17062021165910
154;157;17062021165910
155;161;17062021165910
156;156;17062021165910
157;153;17062021165910
158;152;17062021165910
159;151;17062021165910
160;151;17062021165910
161;152;17062021165910
162;152;17062021165910
163;157;17062021165910
164;159;17062021165910
165;158;17062021165910
166;152;17062021165910
167;158;17062021165910
168;160;17062021165910
169;150;17062021165910
170;157;17062021165910
171;153;17062021165910
172;152;17062021165910
173;160;17062021165910
174;150;17062021165910
175;153;17062021165910
176;156;17062021165910
177;151;17062021165910
178;161;17062021165910
179;158;17062021165910
180;154;17062021165910
181;154;17062021165910
182;160;17062021165910
183;153;17062021165910
184;154;17062021165910
185;149;17062021165910
186;159;17062021165910
187;156;17062021165910
188;156;17062021165910
189;158;17062021165910
190;151;17062021165910
191;162;17062021165910
192;159;17062021165910
193;152;17062021165910
194;162;17062021165910
195;156;17062021165910
196;155;17062021165910
197;151;17062021165910
198;157;17062021165910
199;152;17062021165910
200;0;17062021165910
0;0;17062021165911
1;159;17062021165911
2;167;17062021165911
3;158;17062021165911
4;164;17062021165911
5;161;17062021165911
6;163;17062021165911
7;168;17062021165911
8;168;17062021165911
9;159;17062021165911
10;166;17062021165911
11;167;17062021165911
12;164;17062021165911
13;171;17062021165911
14;168;17062021165911
15;175;17062021165911
16;177;17062021165911
17;184;17062021165911
18;206;17062021165911
19;247;17062021165911
20;329;17062021165911
21;531;17062021165911
22;1023;17062021165911
23;1023;17062021165911
24;1023;17062021165911
25;1023;17062021165911
26;1023;17062021165911
27;1023;17062021165911
28;1023;17062021165911
29;1023;17062021165911
30;1023;17062021165911
31;1023;17062021165911
32;1023;17062021165911
33;918;17062021165911
34;700;17062021165911
35;541;17062021165911
36;426;17062021165911
37;356;17062021165911
38;298;17062021165911
39;272;17062021165911
40;248;17062021165911
41;233;17062021165911
42;230;17062021165911
43;227;17062021165911
44;231;17062021165911
45;250;17062021165911
46;249;17062021165911
47;244;17062021165911
48;233;17062021165911
49;226;17062021165911
50;221;17062021165911
51;213;17062021165911
52;203;17062021165911
53;198;17062021165911
54;189;17062021165911
55;190;17062021165911
56;187;17062021165911
57;187;17062021165911
58;187;17062021165911
59;191;17062021165911
60;190;17062021165911
61;192;17062021165911
62;191;17062021165911
63;187;17062021165911
64;194;17062021165911
65;180;17062021165911
66;182;17062021165911
67;181;17062021165911
68;183;17062021165911
69;180;17062021165911
70;183;17062021165911
71;176;17062021165911
72;179;17062021165911
73;177;17062021165911
74;177;17062021165911
75;179;17062021165911
76;174;17062021165911
77;179;17062021165911
78;175;17062021165911
79;185;17062021165911
80;175;17062021165911
81;166;17062021165911
82;169;17062021165911
83;167;17062021165911
84;164;17062021165911
85;168;17062021165911
86;171;17062021165911
87;172;17062021165911
88;163;17062021165911
89;155;17062021165911
90;165;17062021165911
91;157;17062021165911
92;157;17062021165911
93;166;17062021165911
94;161;17062021165911
95;156;17062021165911
96;159;17062021165911
97;157;17062021165911
98;154;17062021165911
99;157;17062021165911
100;150;17062021165911
101;168;17062021165911
102;165;17062021165911
103;154;17062021165911
104;158;17062021165911
105;152;17062021165911
106;155;17062021165911
107;152;17062021165911
108;156;17062021165911
109;156;17062021165911
110;150;17062021165911
111;149;17062021165911
112;151;17062021165911
113;150;17062021165911
114;150;17062021165911
115;154;17062021165911
116;158;17062021165911
117;154;17062021165911
118;151;17062021165911
119;157;17062021165911
120;152;17062021165911
121;150;17062021165911
122;154;17062021165911
123;151;17062021165911
124;157;17062021165911
125;151;17062021165911
126;149;17062021165911
127;157;17062021165911
128;160;17062021165911
129;156;17062021165911
130;154;17062021165911
131;153;17062021165911
132;148;17062021165911
133;167;17062021165911
134;151;17062021165911
135;153;17062021165911
136;152;17062021165911
137;152;17062021165911
138;159;17062021165911
139;153;17062021165911
140;154;17062021165911
141;159;17062021165911
142;154;17062021165911
143;148;17062021165911
144;157;17062021165911
145;155;17062021165911
146;155;17062021165911
147;159;17062021165911
148;152;17062021165911
149;156;17062021165911
150;160;17062021165911
151;159;17062021165911
152;152;17062021165911
153;153;17062021165911
154;157;17062021165911
155;162;17062021165911
156;157;17062021165911
157;152;17062021165911
158;152;17062021165911
159;151;17062021165911
160;151;17062021165911
161;153;17062021165911
162;154;17062021165911
163;156;17062021165911
164;158;17062021165911
165;156;17062021165911
166;151;17062021165911
167;157;17062021165911
168;159;17062021165911
169;148;17062021165911
170;157;17062021165911
171;152;17062021165911
172;151;17062021165911
173;160;17062021165911
174;152;17062021165911
175;154;17062021165911
176;158;17062021165911
177;151;17062021165911
178;160;17062021165911
179;157;17062021165911
180;154;17062021165911
181;153;17062021165911
182;161;17062021165911
183;154;17062021165911
184;155;17062021165911
185;148;17062021165911
186;157;17062021165911
187;154;17062021165911
188;156;17062021165911
189;158;17062021165911
190;151;17062021165911
191;158;17062021165911
192;160;17062021165911
193;152;17062021165911
194;163;17062021165911
195;156;17062021165911
196;154;17062021165911
197;156;17062021165911
198;157;17062021165911
199;155;17062021165911
200;0;17062021165911
0;0;17062021165912
1;159;17062021165912
2;168;17062021165912
3;157;17062021165912
4;163;17062021165912
5;159;17062021165912
6;162;17062021165912
7;166;17062021165912
8;169;17062021165912
9;160;17062021165912
10;167;17062021165912
11;168;17062021165912
12;164;17062021165912
13;173;17062021165912
14;169;17062021165912
15;175;17062021165912
16;177;17062021165912
17;182;17062021165912
18;205;17062021165912
19;250;17062021165912
20;328;17062021165912
21;536;17062021165912
22;1023;17062021165912
23;1023;17062021165912
24;1023;17062021165912
25;1023;17062021165912
26;1023;17062021165912
27;1023;17062021165912
28;1023;17062021165912
29;1023;17062021165912
30;1023;17062021165912
31;1023;17062021165912
32;1023;17062021165912
33;921;17062021165912
34;702;17062021165912
35;541;17062021165912
36;425;17062021165912
37;355;17062021165912
38;300;17062021165912
39;275;17062021165912
40;249;17062021165912
41;232;17062021165912
42;230;17062021165912
43;227;17062021165912
44;233;17062021165912
45;251;17062021165912
46;248;17062021165912
47;246;17062021165912
48;234;17062021165912
49;226;17062021165912
50;222;17062021165912
51;212;17062021165912
52;205;17062021165912
53;200;17062021165912
54;192;17062021165912
55;190;17062021165912
56;189;17062021165912
57;188;17062021165912
58;189;17062021165912
59;189;17062021165912
60;193;17062021165912
61;193;17062021165912
62;191;17062021165912
63;188;17062021165912
64;195;17062021165912
65;181;17062021165912
66;185;17062021165912
67;182;17062021165912
68;181;17062021165912
69;182;17062021165912
70;184;17062021165912
71;176;17062021165912
72;179;17062021165912
73;178;17062021165912
74;177;17062021165912
75;179;17062021165912
76;176;17062021165912
77;179;17062021165912
78;175;17062021165912
79;185;17062021165912
80;174;17062021165912
81;167;17062021165912
82;171;17062021165912
83;165;17062021165912
84;166;17062021165912
85;165;17062021165912
86;171;17062021165912
87;171;17062021165912
88;161;17062021165912
89;155;17062021165912
90;165;17062021165912
91;158;17062021165912
92;158;17062021165912
93;166;17062021165912
94;161;17062021165912
95;157;17062021165912
96;159;17062021165912
97;155;17062021165912
98;153;17062021165912
99;157;17062021165912
100;150;17062021165912
101;167;17062021165912
102;163;17062021165912
103;154;17062021165912
104;157;17062021165912
105;153;17062021165912
106;154;17062021165912
107;152;17062021165912
108;155;17062021165912
109;156;17062021165912
110;151;17062021165912
111;150;17062021165912
112;151;17062021165912
113;150;17062021165912
114;150;17062021165912
115;153;17062021165912
116;155;17062021165912
117;156;17062021165912
118;152;17062021165912
119;157;17062021165912
120;153;17062021165912
121;149;17062021165912
122;154;17062021165912
123;150;17062021165912
124;157;17062021165912
125;152;17062021165912
126;151;17062021165912
127;157;17062021165912
128;161;17062021165912
129;154;17062021165912
130;153;17062021165912
131;152;17062021165912
132;150;17062021165912
133;167;17062021165912
134;152;17062021165912
135;155;17062021165912
136;154;17062021165912
137;151;17062021165912
138;159;17062021165912
139;153;17062021165912
140;156;17062021165912
141;158;17062021165912
142;155;17062021165912
143;148;17062021165912
144;157;17062021165912
145;153;17062021165912
146;156;17062021165912
147;159;17062021165912
148;153;17062021165912
149;158;17062021165912
150;160;17062021165912
151;159;17062021165912
152;152;17062021165912
153;153;17062021165912
154;156;17062021165912
155;163;17062021165912
156;157;17062021165912
157;154;17062021165912
158;152;17062021165912
159;150;17062021165912
160;151;17062021165912
161;152;17062021165912
162;154;17062021165912
163;157;17062021165912
164;158;17062021165912
165;159;17062021165912
166;153;17062021165912
167;158;17062021165912
168;160;17062021165912
169;148;17062021165912
170;157;17062021165912
171;152;17062021165912
172;151;17062021165912
173;160;17062021165912
174;151;17062021165912
175;153;17062021165912
176;156;17062021165912
177;153;17062021165912
178;159;17062021165912
179;157;17062021165912
180;153;17062021165912
181;154;17062021165912
182;162;17062021165912
183;153;17062021165912
184;155;17062021165912
185;148;17062021165912
186;159;17062021165912
187;154;17062021165912
188;157;17062021165912
189;158;17062021165912
190;150;17062021165912
191;160;17062021165912
192;161;17062021165912
193;152;17062021165912
194;162;17062021165912
195;155;17062021165912
196;154;17062021165912
197;153;17062021165912
198;158;17062021165912
199;151;17062021165912
200;0;17062021165912
0;0;17062021165913
1;160;17062021165913
2;169;17062021165913
3;160;17062021165913
4;164;17062021165913
5;159;17062021165913
6;164;17062021165913
7;169;17062021165913
8;168;17062021165913
9;160;17062021165913
10;167;17062021165913
11;168;17062021165913
12;165;17062021165913
13;173;17062021165913
14;167;17062021165913
15;176;17062021165913
16;178;17062021165913
17;182;17062021165913
18;208;17062021165913
19;248;17062021165913
20;328;17062021165913
21;534;17062021165913
22;1023;17062021165913
23;1023;17062021165913
24;1023;17062021165913
25;1023;17062021165913
26;1023;17062021165913
27;1023;17062021165913
28;1023;17062021165913
29;1023;17062021165913
30;1023;17062021165913
31;1023;17062021165913
32;1023;17062021165913
33;920;17062021165913
34;701;17062021165913
35;543;17062021165913
36;424;17062021165913
37;355;17062021165913
38;299;17062021165913
39;272;17062021165913
40;248;17062021165913
41;232;17062021165913
42;230;17062021165913
43;226;17062021165913
44;234;17062021165913
45;252;17062021165913
46;249;17062021165913
47;244;17062021165913
48;237;17062021165913
49;226;17062021165913
50;221;17062021165913
51;211;17062021165913
52;204;17062021165913
53;198;17062021165913
54;190;17062021165913
55;191;17062021165913
56;187;17062021165913
57;189;17062021165913
58;188;17062021165913
59;190;17062021165913
60;192;17062021165913
61;195;17062021165913
62;191;17062021165913
63;188;17062021165913
64;196;17062021165913
65;181;17062021165913
66;183;17062021165913
67;182;17062021165913
68;182;17062021165913
69;182;17062021165913
70;184;17062021165913
71;176;17062021165913
72;179;17062021165913
73;179;17062021165913
74;178;17062021165913
75;179;17062021165913
76;177;17062021165913
77;177;17062021165913
78;177;17062021165913
79;186;17062021165913
80;175;17062021165913
81;168;17062021165913
82;170;17062021165913
83;168;17062021165913
84;165;17062021165913
85;166;17062021165913
86;171;17062021165913
87;172;17062021165913
88;164;17062021165913
89;156;17062021165913
90;167;17062021165913
91;158;17062021165913
92;159;17062021165913
93;167;17062021165913
94;162;17062021165913
95;158;17062021165913
96;158;17062021165913
97;156;17062021165913
98;155;17062021165913
99;159;17062021165913
100;152;17062021165913
101;168;17062021165913
102;164;17062021165913
103;155;17062021165913
104;159;17062021165913
105;154;17062021165913
106;154;17062021165913
107;153;17062021165913
108;158;17062021165913
109;156;17062021165913
110;151;17062021165913
111;149;17062021165913
112;153;17062021165913
113;150;17062021165913
114;151;17062021165913
115;155;17062021165913
116;157;17062021165913
117;156;17062021165913
118;152;17062021165913
119;157;17062021165913
120;153;17062021165913
121;152;17062021165913
122;153;17062021165913
123;152;17062021165913
124;158;17062021165913
125;153;17062021165913
126;151;17062021165913
127;159;17062021165913
128;161;17062021165913
129;157;17062021165913
130;154;17062021165913
131;153;17062021165913
132;150;17062021165913
133;166;17062021165913
134;151;17062021165913
135;154;17062021165913
136;154;17062021165913
137;152;17062021165913
138;160;17062021165913
139;153;17062021165913
140;155;17062021165913
141;158;17062021165913
142;154;17062021165913
143;151;17062021165913
144;158;17062021165913
145;154;17062021165913
146;155;17062021165913
147;161;17062021165913
148;153;17062021165913
149;158;17062021165913
150;161;17062021165913
151;160;17062021165913
152;153;17062021165913
153;155;17062021165913
154;157;17062021165913
155;162;17062021165913
156;157;17062021165913
157;153;17062021165913
158;153;17062021165913
159;153;17062021165913
160;153;17062021165913
161;153;17062021165913
162;155;17062021165913
163;158;17062021165913
164;159;17062021165913
165;160;17062021165913
166;153;17062021165913
167;158;17062021165913
168;160;17062021165913
169;150;17062021165913
170;158;17062021165913
171;154;17062021165913
172;152;17062021165913
173;161;17062021165913
174;153;17062021165913
175;154;17062021165913
176;157;17062021165913
177;153;17062021165913
178;161;17062021165913
179;157;17062021165913
180;154;17062021165913
181;153;17062021165913
182;161;17062021165913
183;153;17062021165913
184;155;17062021165913
185;150;17062021165913
186;160;17062021165913
187;155;17062021165913
188;157;17062021165913
189;159;17062021165913
190;152;17062021165913
191;159;17062021165913
192;161;17062021165913
193;155;17062021165913
194;162;17062021165913
195;156;17062021165913
196;156;17062021165913
197;153;17062021165913
198;157;17062021165913
199;154;17062021165913
200;0;17062021165913
