ind;val;datetime
0;0;29062021171055
1;142;29062021171055
2;123;29062021171055
3;121;29062021171055
4;122;29062021171055
5;123;29062021171055
6;120;29062021171055
7;122;29062021171055
8;123;29062021171055
9;122;29062021171055
10;125;29062021171055
11;122;29062021171055
12;122;29062021171055
13;126;29062021171055
14;124;29062021171055
15;128;29062021171055
16;130;29062021171055
17;134;29062021171055
18;146;29062021171055
19;165;29062021171055
20;213;29062021171055
21;331;29062021171055
22;642;29062021171055
23;1023;29062021171055
24;1023;29062021171055
25;1023;29062021171055
26;1023;29062021171055
27;1023;29062021171055
28;1023;29062021171055
29;1023;29062021171055
30;1023;29062021171055
31;1023;29062021171055
32;836;29062021171055
33;619;29062021171055
34;467;29062021171055
35;366;29062021171055
36;291;29062021171055
37;247;29062021171055
38;212;29062021171055
39;190;29062021171055
40;180;29062021171055
41;168;29062021171055
42;167;29062021171055
43;161;29062021171055
44;159;29062021171055
45;159;29062021171055
46;156;29062021171055
47;157;29062021171055
48;156;29062021171055
49;156;29062021171055
50;157;29062021171055
51;155;29062021171055
52;155;29062021171055
53;158;29062021171055
54;157;29062021171055
55;158;29062021171055
56;158;29062021171055
57;158;29062021171055
58;160;29062021171055
59;161;29062021171055
60;162;29062021171055
61;165;29062021171055
62;166;29062021171055
63;166;29062021171055
64;168;29062021171055
65;165;29062021171055
66;168;29062021171055
67;166;29062021171055
68;165;29062021171055
69;164;29062021171055
70;162;29062021171055
71;161;29062021171055
72;162;29062021171055
73;156;29062021171055
74;159;29062021171055
75;154;29062021171055
76;153;29062021171055
77;154;29062021171055
78;150;29062021171055
79;148;29062021171055
80;150;29062021171055
81;145;29062021171055
82;146;29062021171055
83;144;29062021171055
84;143;29062021171055
85;144;29062021171055
86;141;29062021171055
87;141;29062021171055
88;142;29062021171055
89;137;29062021171055
90;140;29062021171055
91;138;29062021171055
92;135;29062021171055
93;138;29062021171055
94;136;29062021171055
95;134;29062021171055
96;136;29062021171055
97;132;29062021171055
98;134;29062021171055
99;133;29062021171055
100;131;29062021171055
101;132;29062021171055
102;131;29062021171055
103;131;29062021171055
104;130;29062021171055
105;128;29062021171055
106;130;29062021171055
107;129;29062021171055
108;128;29062021171055
109;128;29062021171055
110;126;29062021171055
111;127;29062021171055
112;129;29062021171055
113;125;29062021171055
114;127;29062021171055
115;127;29062021171055
116;124;29062021171055
117;128;29062021171055
118;124;29062021171055
119;125;29062021171055
120;124;29062021171055
121;124;29062021171055
122;125;29062021171055
123;125;29062021171055
124;123;29062021171055
125;125;29062021171055
126;123;29062021171055
127;123;29062021171055
128;125;29062021171055
129;122;29062021171055
130;125;29062021171055
131;124;29062021171055
132;122;29062021171055
133;126;29062021171055
134;121;29062021171055
135;121;29062021171055
136;123;29062021171055
137;120;29062021171055
138;122;29062021171055
139;122;29062021171055
140;121;29062021171055
141;123;29062021171055
142;121;29062021171055
143;120;29062021171055
144;123;29062021171055
145;120;29062021171055
146;122;29062021171055
147;121;29062021171055
148;120;29062021171055
149;120;29062021171055
150;121;29062021171055
151;120;29062021171055
152;122;29062021171055
153;119;29062021171055
154;121;29062021171055
155;119;29062021171055
156;119;29062021171055
157;121;29062021171055
158;120;29062021171055
159;120;29062021171055
160;122;29062021171055
161;119;29062021171055
162;122;29062021171055
163;120;29062021171055
164;119;29062021171055
165;122;29062021171055
166;121;29062021171055
167;121;29062021171055
168;122;29062021171055
169;119;29062021171055
170;122;29062021171055
171;120;29062021171055
172;120;29062021171055
173;121;29062021171055
174;119;29062021171055
175;119;29062021171055
176;120;29062021171055
177;119;29062021171055
178;121;29062021171055
179;120;29062021171055
180;120;29062021171055
181;122;29062021171055
182;120;29062021171055
183;120;29062021171055
184;121;29062021171055
185;118;29062021171055
186;121;29062021171055
187;121;29062021171055
188;118;29062021171055
189;120;29062021171055
190;120;29062021171055
191;119;29062021171055
192;122;29062021171055
193;119;29062021171055
194;120;29062021171055
195;120;29062021171055
196;119;29062021171055
197;121;29062021171055
198;120;29062021171055
199;120;29062021171055
200;0;29062021171055
0;0;29062021171056
1;143;29062021171056
2;121;29062021171056
3;121;29062021171056
4;121;29062021171056
5;122;29062021171056
6;121;29062021171056
7;122;29062021171056
8;123;29062021171056
9;120;29062021171056
10;124;29062021171056
11;121;29062021171056
12;123;29062021171056
13;125;29062021171056
14;125;29062021171056
15;128;29062021171056
16;131;29062021171056
17;133;29062021171056
18;146;29062021171056
19;166;29062021171056
20;212;29062021171056
21;332;29062021171056
22;639;29062021171056
23;1023;29062021171056
24;1023;29062021171056
25;1023;29062021171056
26;1023;29062021171056
27;1023;29062021171056
28;1023;29062021171056
29;1023;29062021171056
30;1023;29062021171056
31;1023;29062021171056
32;841;29062021171056
33;622;29062021171056
34;467;29062021171056
35;365;29062021171056
36;291;29062021171056
37;245;29062021171056
38;214;29062021171056
39;193;29062021171056
40;179;29062021171056
41;168;29062021171056
42;167;29062021171056
43;158;29062021171056
44;159;29062021171056
45;157;29062021171056
46;157;29062021171056
47;157;29062021171056
48;158;29062021171056
49;154;29062021171056
50;158;29062021171056
51;155;29062021171056
52;155;29062021171056
53;158;29062021171056
54;156;29062021171056
55;157;29062021171056
56;158;29062021171056
57;158;29062021171056
58;162;29062021171056
59;163;29062021171056
60;163;29062021171056
61;164;29062021171056
62;163;29062021171056
63;167;29062021171056
64;169;29062021171056
65;165;29062021171056
66;168;29062021171056
67;166;29062021171056
68;163;29062021171056
69;166;29062021171056
70;161;29062021171056
71;162;29062021171056
72;161;29062021171056
73;156;29062021171056
74;158;29062021171056
75;153;29062021171056
76;153;29062021171056
77;152;29062021171056
78;149;29062021171056
79;150;29062021171056
80;148;29062021171056
81;145;29062021171056
82;147;29062021171056
83;144;29062021171056
84;143;29062021171056
85;142;29062021171056
86;141;29062021171056
87;141;29062021171056
88;142;29062021171056
89;138;29062021171056
90;140;29062021171056
91;138;29062021171056
92;136;29062021171056
93;137;29062021171056
94;136;29062021171056
95;134;29062021171056
96;135;29062021171056
97;134;29062021171056
98;133;29062021171056
99;132;29062021171056
100;130;29062021171056
101;133;29062021171056
102;130;29062021171056
103;131;29062021171056
104;130;29062021171056
105;128;29062021171056
106;130;29062021171056
107;127;29062021171056
108;128;29062021171056
109;130;29062021171056
110;125;29062021171056
111;127;29062021171056
112;128;29062021171056
113;124;29062021171056
114;126;29062021171056
115;127;29062021171056
116;125;29062021171056
117;127;29062021171056
118;125;29062021171056
119;124;29062021171056
120;123;29062021171056
121;123;29062021171056
122;124;29062021171056
123;124;29062021171056
124;122;29062021171056
125;124;29062021171056
126;122;29062021171056
127;123;29062021171056
128;125;29062021171056
129;121;29062021171056
130;122;29062021171056
131;123;29062021171056
132;121;29062021171056
133;125;29062021171056
134;121;29062021171056
135;122;29062021171056
136;124;29062021171056
137;120;29062021171056
138;123;29062021171056
139;121;29062021171056
140;120;29062021171056
141;122;29062021171056
142;120;29062021171056
143;121;29062021171056
144;122;29062021171056
145;119;29062021171056
146;123;29062021171056
147;121;29062021171056
148;119;29062021171056
149;121;29062021171056
150;120;29062021171056
151;120;29062021171056
152;121;29062021171056
153;119;29062021171056
154;121;29062021171056
155;120;29062021171056
156;119;29062021171056
157;121;29062021171056
158;119;29062021171056
159;119;29062021171056
160;122;29062021171056
161;119;29062021171056
162;121;29062021171056
163;120;29062021171056
164;119;29062021171056
165;122;29062021171056
166;120;29062021171056
167;120;29062021171056
168;122;29062021171056
169;118;29062021171056
170;121;29062021171056
171;121;29062021171056
172;119;29062021171056
173;121;29062021171056
174;119;29062021171056
175;119;29062021171056
176;120;29062021171056
177;118;29062021171056
178;121;29062021171056
179;120;29062021171056
180;119;29062021171056
181;121;29062021171056
182;120;29062021171056
183;120;29062021171056
184;121;29062021171056
185;118;29062021171056
186;121;29062021171056
187;119;29062021171056
188;118;29062021171056
189;119;29062021171056
190;119;29062021171056
191;119;29062021171056
192;122;29062021171056
193;119;29062021171056
194;120;29062021171056
195;120;29062021171056
196;119;29062021171056
197;121;29062021171056
198;120;29062021171056
199;118;29062021171056
200;0;29062021171056
0;0;29062021171057
1;142;29062021171057
2;121;29062021171057
3;121;29062021171057
4;121;29062021171057
5;122;29062021171057
6;120;29062021171057
7;122;29062021171057
8;123;29062021171057
9;121;29062021171057
10;124;29062021171057
11;121;29062021171057
12;123;29062021171057
13;126;29062021171057
14;124;29062021171057
15;129;29062021171057
16;130;29062021171057
17;134;29062021171057
18;144;29062021171057
19;166;29062021171057
20;215;29062021171057
21;331;29062021171057
22;638;29062021171057
23;1023;29062021171057
24;1023;29062021171057
25;1023;29062021171057
26;1023;29062021171057
27;1023;29062021171057
28;1023;29062021171057
29;1023;29062021171057
30;1023;29062021171057
31;1023;29062021171057
32;838;29062021171057
33;620;29062021171057
34;472;29062021171057
35;366;29062021171057
36;292;29062021171057
37;247;29062021171057
38;214;29062021171057
39;193;29062021171057
40;179;29062021171057
41;169;29062021171057
42;165;29062021171057
43;160;29062021171057
44;158;29062021171057
45;158;29062021171057
46;155;29062021171057
47;156;29062021171057
48;157;29062021171057
49;154;29062021171057
50;157;29062021171057
51;155;29062021171057
52;154;29062021171057
53;158;29062021171057
54;157;29062021171057
55;155;29062021171057
56;157;29062021171057
57;157;29062021171057
58;161;29062021171057
59;163;29062021171057
60;163;29062021171057
61;165;29062021171057
62;164;29062021171057
63;167;29062021171057
64;168;29062021171057
65;163;29062021171057
66;166;29062021171057
67;164;29062021171057
68;163;29062021171057
69;167;29062021171057
70;162;29062021171057
71;160;29062021171057
72;161;29062021171057
73;156;29062021171057
74;156;29062021171057
75;153;29062021171057
76;154;29062021171057
77;154;29062021171057
78;148;29062021171057
79;150;29062021171057
80;149;29062021171057
81;145;29062021171057
82;146;29062021171057
83;143;29062021171057
84;142;29062021171057
85;142;29062021171057
86;140;29062021171057
87;141;29062021171057
88;141;29062021171057
89;138;29062021171057
90;141;29062021171057
91;140;29062021171057
92;136;29062021171057
93;137;29062021171057
94;136;29062021171057
95;134;29062021171057
96;136;29062021171057
97;133;29062021171057
98;132;29062021171057
99;133;29062021171057
100;130;29062021171057
101;132;29062021171057
102;130;29062021171057
103;130;29062021171057
104;130;29062021171057
105;129;29062021171057
106;130;29062021171057
107;128;29062021171057
108;128;29062021171057
109;129;29062021171057
110;125;29062021171057
111;127;29062021171057
112;129;29062021171057
113;125;29062021171057
114;127;29062021171057
115;127;29062021171057
116;125;29062021171057
117;128;29062021171057
118;124;29062021171057
119;125;29062021171057
120;124;29062021171057
121;122;29062021171057
122;123;29062021171057
123;123;29062021171057
124;122;29062021171057
125;124;29062021171057
126;122;29062021171057
127;123;29062021171057
128;125;29062021171057
129;121;29062021171057
130;123;29062021171057
131;123;29062021171057
132;122;29062021171057
133;125;29062021171057
134;120;29062021171057
135;122;29062021171057
136;123;29062021171057
137;120;29062021171057
138;123;29062021171057
139;122;29062021171057
140;120;29062021171057
141;122;29062021171057
142;120;29062021171057
143;120;29062021171057
144;121;29062021171057
145;119;29062021171057
146;122;29062021171057
147;120;29062021171057
148;119;29062021171057
149;121;29062021171057
150;120;29062021171057
151;120;29062021171057
152;120;29062021171057
153;118;29062021171057
154;121;29062021171057
155;119;29062021171057
156;120;29062021171057
157;120;29062021171057
158;119;29062021171057
159;119;29062021171057
160;120;29062021171057
161;119;29062021171057
162;120;29062021171057
163;120;29062021171057
164;118;29062021171057
165;121;29062021171057
166;119;29062021171057
167;120;29062021171057
168;121;29062021171057
169;119;29062021171057
170;121;29062021171057
171;120;29062021171057
172;119;29062021171057
173;120;29062021171057
174;119;29062021171057
175;118;29062021171057
176;121;29062021171057
177;118;29062021171057
178;121;29062021171057
179;120;29062021171057
180;119;29062021171057
181;121;29062021171057
182;119;29062021171057
183;118;29062021171057
184;120;29062021171057
185;118;29062021171057
186;122;29062021171057
187;121;29062021171057
188;118;29062021171057
189;120;29062021171057
190;118;29062021171057
191;119;29062021171057
192;122;29062021171057
193;119;29062021171057
194;119;29062021171057
195;120;29062021171057
196;118;29062021171057
197;120;29062021171057
198;120;29062021171057
199;119;29062021171057
200;0;29062021171057
0;0;29062021171058
1;143;29062021171058
2;123;29062021171058
3;122;29062021171058
4;123;29062021171058
5;123;29062021171058
6;120;29062021171058
7;122;29062021171058
8;123;29062021171058
9;121;29062021171058
10;125;29062021171058
11;122;29062021171058
12;124;29062021171058
13;126;29062021171058
14;124;29062021171058
15;128;29062021171058
16;131;29062021171058
17;134;29062021171058
18;148;29062021171058
19;166;29062021171058
20;213;29062021171058
21;329;29062021171058
22;638;29062021171058
23;1023;29062021171058
24;1023;29062021171058
25;1023;29062021171058
26;1023;29062021171058
27;1023;29062021171058
28;1023;29062021171058
29;1023;29062021171058
30;1023;29062021171058
31;1023;29062021171058
32;847;29062021171058
33;619;29062021171058
34;468;29062021171058
35;365;29062021171058
36;292;29062021171058
37;247;29062021171058
38;212;29062021171058
39;194;29062021171058
40;180;29062021171058
41;168;29062021171058
42;165;29062021171058
43;161;29062021171058
44;159;29062021171058
45;160;29062021171058
46;156;29062021171058
47;156;29062021171058
48;157;29062021171058
49;154;29062021171058
50;158;29062021171058
51;155;29062021171058
52;154;29062021171058
53;156;29062021171058
54;156;29062021171058
55;157;29062021171058
56;159;29062021171058
57;159;29062021171058
58;163;29062021171058
59;162;29062021171058
60;164;29062021171058
61;165;29062021171058
62;166;29062021171058
63;167;29062021171058
64;167;29062021171058
65;164;29062021171058
66;168;29062021171058
67;166;29062021171058
68;166;29062021171058
69;166;29062021171058
70;162;29062021171058
71;162;29062021171058
72;162;29062021171058
73;156;29062021171058
74;158;29062021171058
75;155;29062021171058
76;154;29062021171058
77;154;29062021171058
78;150;29062021171058
79;149;29062021171058
80;150;29062021171058
81;144;29062021171058
82;148;29062021171058
83;145;29062021171058
84;143;29062021171058
85;144;29062021171058
86;141;29062021171058
87;142;29062021171058
88;143;29062021171058
89;137;29062021171058
90;140;29062021171058
91;139;29062021171058
92;135;29062021171058
93;138;29062021171058
94;136;29062021171058
95;134;29062021171058
96;136;29062021171058
97;134;29062021171058
98;134;29062021171058
99;132;29062021171058
100;132;29062021171058
101;133;29062021171058
102;131;29062021171058
103;130;29062021171058
104;130;29062021171058
105;128;29062021171058
106;131;29062021171058
107;128;29062021171058
108;128;29062021171058
109;128;29062021171058
110;126;29062021171058
111;127;29062021171058
112;128;29062021171058
113;124;29062021171058
114;126;29062021171058
115;126;29062021171058
116;125;29062021171058
117;128;29062021171058
118;125;29062021171058
119;127;29062021171058
120;125;29062021171058
121;123;29062021171058
122;125;29062021171058
123;124;29062021171058
124;122;29062021171058
125;125;29062021171058
126;122;29062021171058
127;123;29062021171058
128;125;29062021171058
129;122;29062021171058
130;124;29062021171058
131;125;29062021171058
132;121;29062021171058
133;125;29062021171058
134;122;29062021171058
135;121;29062021171058
136;123;29062021171058
137;120;29062021171058
138;123;29062021171058
139;123;29062021171058
140;121;29062021171058
141;123;29062021171058
142;121;29062021171058
143;121;29062021171058
144;123;29062021171058
145;120;29062021171058
146;123;29062021171058
147;122;29062021171058
148;121;29062021171058
149;122;29062021171058
150;121;29062021171058
151;121;29062021171058
152;121;29062021171058
153;120;29062021171058
154;120;29062021171058
155;119;29062021171058
156;119;29062021171058
157;120;29062021171058
158;119;29062021171058
159;120;29062021171058
160;121;29062021171058
161;120;29062021171058
162;121;29062021171058
163;121;29062021171058
164;120;29062021171058
165;122;29062021171058
166;120;29062021171058
167;120;29062021171058
168;121;29062021171058
169;118;29062021171058
170;121;29062021171058
171;121;29062021171058
172;120;29062021171058
173;120;29062021171058
174;120;29062021171058
175;118;29062021171058
176;121;29062021171058
177;119;29062021171058
178;121;29062021171058
179;121;29062021171058
180;120;29062021171058
181;121;29062021171058
182;120;29062021171058
183;119;29062021171058
184;121;29062021171058
185;118;29062021171058
186;121;29062021171058
187;120;29062021171058
188;118;29062021171058
189;121;29062021171058
190;119;29062021171058
191;119;29062021171058
192;122;29062021171058
193;119;29062021171058
194;119;29062021171058
195;121;29062021171058
196;119;29062021171058
197;121;29062021171058
198;119;29062021171058
199;120;29062021171058
200;0;29062021171058
0;0;29062021171058
1;142;29062021171058
2;121;29062021171058
3;121;29062021171058
4;122;29062021171058
5;122;29062021171058
6;120;29062021171058
7;122;29062021171058
8;123;29062021171058
9;122;29062021171058
10;125;29062021171058
11;122;29062021171058
12;123;29062021171058
13;126;29062021171058
14;124;29062021171058
15;128;29062021171058
16;130;29062021171058
17;133;29062021171058
18;147;29062021171058
19;166;29062021171058
20;210;29062021171058
21;328;29062021171058
22;632;29062021171058
23;1023;29062021171058
24;1023;29062021171058
25;1023;29062021171058
26;1023;29062021171058
27;1023;29062021171058
28;1023;29062021171058
29;1023;29062021171058
30;1023;29062021171058
31;1023;29062021171058
32;857;29062021171058
33;626;29062021171058
34;473;29062021171058
35;373;29062021171058
36;295;29062021171058
37;248;29062021171058
38;212;29062021171058
39;192;29062021171058
40;179;29062021171058
41;168;29062021171058
42;165;29062021171058
43;160;29062021171058
44;160;29062021171058
45;158;29062021171058
46;156;29062021171058
47;156;29062021171058
48;156;29062021171058
49;154;29062021171058
50;155;29062021171058
51;155;29062021171058
52;155;29062021171058
53;156;29062021171058
54;156;29062021171058
55;156;29062021171058
56;158;29062021171058
57;158;29062021171058
58;162;29062021171058
59;160;29062021171058
60;163;29062021171058
61;166;29062021171058
62;163;29062021171058
63;164;29062021171058
64;168;29062021171058
65;165;29062021171058
66;167;29062021171058
67;165;29062021171058
68;164;29062021171058
69;166;29062021171058
70;162;29062021171058
71;160;29062021171058
72;162;29062021171058
73;157;29062021171058
74;157;29062021171058
75;155;29062021171058
76;152;29062021171058
77;153;29062021171058
78;150;29062021171058
79;149;29062021171058
80;147;29062021171058
81;144;29062021171058
82;146;29062021171058
83;143;29062021171058
84;142;29062021171058
85;143;29062021171058
86;140;29062021171058
87;140;29062021171058
88;141;29062021171058
89;137;29062021171058
90;140;29062021171058
91;138;29062021171058
92;135;29062021171058
93;138;29062021171058
94;136;29062021171058
95;133;29062021171058
96;136;29062021171058
97;132;29062021171058
98;133;29062021171058
99;132;29062021171058
100;130;29062021171058
101;132;29062021171058
102;130;29062021171058
103;130;29062021171058
104;130;29062021171058
105;128;29062021171058
106;131;29062021171058
107;127;29062021171058
108;127;29062021171058
109;128;29062021171058
110;126;29062021171058
111;126;29062021171058
112;128;29062021171058
113;124;29062021171058
114;127;29062021171058
115;127;29062021171058
116;124;29062021171058
117;127;29062021171058
118;124;29062021171058
119;125;29062021171058
120;123;29062021171058
121;124;29062021171058
122;124;29062021171058
123;123;29062021171058
124;122;29062021171058
125;125;29062021171058
126;121;29062021171058
127;122;29062021171058
128;124;29062021171058
129;122;29062021171058
130;122;29062021171058
131;122;29062021171058
132;121;29062021171058
133;125;29062021171058
134;121;29062021171058
135;121;29062021171058
136;122;29062021171058
137;119;29062021171058
138;122;29062021171058
139;121;29062021171058
140;120;29062021171058
141;122;29062021171058
142;120;29062021171058
143;121;29062021171058
144;122;29062021171058
145;119;29062021171058
146;122;29062021171058
147;120;29062021171058
148;118;29062021171058
149;120;29062021171058
150;119;29062021171058
151;121;29062021171058
152;121;29062021171058
153;119;29062021171058
154;121;29062021171058
155;120;29062021171058
156;118;29062021171058
157;120;29062021171058
158;120;29062021171058
159;119;29062021171058
160;121;29062021171058
161;119;29062021171058
162;120;29062021171058
163;120;29062021171058
164;119;29062021171058
165;122;29062021171058
166;119;29062021171058
167;120;29062021171058
168;122;29062021171058
169;118;29062021171058
170;120;29062021171058
171;120;29062021171058
172;120;29062021171058
173;121;29062021171058
174;118;29062021171058
175;118;29062021171058
176;120;29062021171058
177;119;29062021171058
178;121;29062021171058
179;119;29062021171058
180;119;29062021171058
181;121;29062021171058
182;119;29062021171058
183;119;29062021171058
184;121;29062021171058
185;118;29062021171058
186;121;29062021171058
187;120;29062021171058
188;118;29062021171058
189;120;29062021171058
190;119;29062021171058
191;119;29062021171058
192;122;29062021171058
193;120;29062021171058
194;120;29062021171058
195;121;29062021171058
196;119;29062021171058
197;120;29062021171058
198;118;29062021171058
199;118;29062021171058
200;0;29062021171058
0;0;29062021171058
1;142;29062021171058
2;122;29062021171058
3;121;29062021171058
4;121;29062021171058
5;123;29062021171058
6;119;29062021171058
7;122;29062021171058
8;122;29062021171058
9;120;29062021171058
10;124;29062021171058
11;122;29062021171058
12;122;29062021171058
13;125;29062021171058
14;125;29062021171058
15;128;29062021171058
16;130;29062021171058
17;133;29062021171058
18;146;29062021171058
19;166;29062021171058
20;210;29062021171058
21;331;29062021171058
22;633;29062021171058
23;1023;29062021171058
24;1023;29062021171058
25;1023;29062021171058
26;1023;29062021171058
27;1023;29062021171058
28;1023;29062021171058
29;1023;29062021171058
30;1023;29062021171058
31;1023;29062021171058
32;844;29062021171058
33;623;29062021171058
34;473;29062021171058
35;369;29062021171058
36;292;29062021171058
37;246;29062021171058
38;211;29062021171058
39;193;29062021171058
40;179;29062021171058
41;169;29062021171058
42;166;29062021171058
43;161;29062021171058
44;159;29062021171058
45;159;29062021171058
46;156;29062021171058
47;156;29062021171058
48;158;29062021171058
49;154;29062021171058
50;158;29062021171058
51;155;29062021171058
52;155;29062021171058
53;156;29062021171058
54;157;29062021171058
55;156;29062021171058
56;160;29062021171058
57;158;29062021171058
58;163;29062021171058
59;162;29062021171058
60;164;29062021171058
61;166;29062021171058
62;164;29062021171058
63;166;29062021171058
64;168;29062021171058
65;165;29062021171058
66;167;29062021171058
67;165;29062021171058
68;165;29062021171058
69;167;29062021171058
70;160;29062021171058
71;161;29062021171058
72;161;29062021171058
73;157;29062021171058
74;157;29062021171058
75;154;29062021171058
76;152;29062021171058
77;153;29062021171058
78;149;29062021171058
79;149;29062021171058
80;147;29062021171058
81;144;29062021171058
82;146;29062021171058
83;145;29062021171058
84;142;29062021171058
85;143;29062021171058
86;141;29062021171058
87;141;29062021171058
88;141;29062021171058
89;138;29062021171058
90;140;29062021171058
91;139;29062021171058
92;135;29062021171058
93;137;29062021171058
94;136;29062021171058
95;135;29062021171058
96;135;29062021171058
97;132;29062021171058
98;133;29062021171058
99;132;29062021171058
100;130;29062021171058
101;134;29062021171058
102;130;29062021171058
103;129;29062021171058
104;130;29062021171058
105;128;29062021171058
106;130;29062021171058
107;128;29062021171058
108;127;29062021171058
109;128;29062021171058
110;125;29062021171058
111;127;29062021171058
112;129;29062021171058
113;124;29062021171058
114;126;29062021171058
115;126;29062021171058
116;125;29062021171058
117;128;29062021171058
118;125;29062021171058
119;124;29062021171058
120;125;29062021171058
121;123;29062021171058
122;125;29062021171058
123;124;29062021171058
124;121;29062021171058
125;125;29062021171058
126;122;29062021171058
127;123;29062021171058
128;124;29062021171058
129;122;29062021171058
130;123;29062021171058
131;123;29062021171058
132;120;29062021171058
133;125;29062021171058
134;121;29062021171058
135;121;29062021171058
136;124;29062021171058
137;120;29062021171058
138;122;29062021171058
139;121;29062021171058
140;120;29062021171058
141;122;29062021171058
142;121;29062021171058
143;121;29062021171058
144;122;29062021171058
145;119;29062021171058
146;122;29062021171058
147;121;29062021171058
148;120;29062021171058
149;120;29062021171058
150;120;29062021171058
151;120;29062021171058
152;121;29062021171058
153;118;29062021171058
154;122;29062021171058
155;119;29062021171058
156;120;29062021171058
157;120;29062021171058
158;119;29062021171058
159;120;29062021171058
160;121;29062021171058
161;120;29062021171058
162;120;29062021171058
163;120;29062021171058
164;119;29062021171058
165;121;29062021171058
166;120;29062021171058
167;120;29062021171058
168;121;29062021171058
169;119;29062021171058
170;121;29062021171058
171;120;29062021171058
172;119;29062021171058
173;120;29062021171058
174;120;29062021171058
175;118;29062021171058
176;120;29062021171058
177;118;29062021171058
178;121;29062021171058
179;119;29062021171058
180;119;29062021171058
181;121;29062021171058
182;120;29062021171058
183;119;29062021171058
184;121;29062021171058
185;116;29062021171058
186;121;29062021171058
187;120;29062021171058
188;118;29062021171058
189;120;29062021171058
190;119;29062021171058
191;119;29062021171058
192;123;29062021171058
193;119;29062021171058
194;118;29062021171058
195;119;29062021171058
196;118;29062021171058
197;120;29062021171058
198;119;29062021171058
199;119;29062021171058
200;0;29062021171058
0;0;29062021171059
1;142;29062021171059
2;122;29062021171059
3;121;29062021171059
4;121;29062021171059
5;123;29062021171059
6;119;29062021171059
7;122;29062021171059
8;123;29062021171059
9;121;29062021171059
10;124;29062021171059
11;121;29062021171059
12;123;29062021171059
13;125;29062021171059
14;125;29062021171059
15;129;29062021171059
16;130;29062021171059
17;133;29062021171059
18;146;29062021171059
19;165;29062021171059
20;212;29062021171059
21;328;29062021171059
22;632;29062021171059
23;1023;29062021171059
24;1023;29062021171059
25;1023;29062021171059
26;1023;29062021171059
27;1023;29062021171059
28;1023;29062021171059
29;1023;29062021171059
30;1023;29062021171059
31;1023;29062021171059
32;847;29062021171059
33;627;29062021171059
34;470;29062021171059
35;371;29062021171059
36;293;29062021171059
37;247;29062021171059
38;216;29062021171059
39;192;29062021171059
40;179;29062021171059
41;168;29062021171059
42;167;29062021171059
43;162;29062021171059
44;160;29062021171059
45;157;29062021171059
46;156;29062021171059
47;155;29062021171059
48;157;29062021171059
49;153;29062021171059
50;159;29062021171059
51;155;29062021171059
52;154;29062021171059
53;157;29062021171059
54;157;29062021171059
55;156;29062021171059
56;159;29062021171059
57;159;29062021171059
58;161;29062021171059
59;163;29062021171059
60;162;29062021171059
61;165;29062021171059
62;165;29062021171059
63;167;29062021171059
64;168;29062021171059
65;163;29062021171059
66;167;29062021171059
67;164;29062021171059
68;164;29062021171059
69;166;29062021171059
70;161;29062021171059
71;161;29062021171059
72;163;29062021171059
73;157;29062021171059
74;158;29062021171059
75;153;29062021171059
76;151;29062021171059
77;152;29062021171059
78;149;29062021171059
79;149;29062021171059
80;148;29062021171059
81;144;29062021171059
82;146;29062021171059
83;144;29062021171059
84;141;29062021171059
85;143;29062021171059
86;140;29062021171059
87;141;29062021171059
88;141;29062021171059
89;136;29062021171059
90;139;29062021171059
91;137;29062021171059
92;136;29062021171059
93;137;29062021171059
94;136;29062021171059
95;133;29062021171059
96;135;29062021171059
97;132;29062021171059
98;134;29062021171059
99;132;29062021171059
100;131;29062021171059
101;133;29062021171059
102;129;29062021171059
103;129;29062021171059
104;130;29062021171059
105;127;29062021171059
106;131;29062021171059
107;127;29062021171059
108;128;29062021171059
109;129;29062021171059
110;125;29062021171059
111;127;29062021171059
112;128;29062021171059
113;125;29062021171059
114;126;29062021171059
115;126;29062021171059
116;125;29062021171059
117;128;29062021171059
118;124;29062021171059
119;124;29062021171059
120;124;29062021171059
121;122;29062021171059
122;124;29062021171059
123;124;29062021171059
124;123;29062021171059
125;124;29062021171059
126;122;29062021171059
127;122;29062021171059
128;124;29062021171059
129;122;29062021171059
130;122;29062021171059
131;123;29062021171059
132;121;29062021171059
133;125;29062021171059
134;122;29062021171059
135;121;29062021171059
136;122;29062021171059
137;121;29062021171059
138;122;29062021171059
139;121;29062021171059
140;119;29062021171059
141;122;29062021171059
142;120;29062021171059
143;120;29062021171059
144;122;29062021171059
145;119;29062021171059
146;121;29062021171059
147;120;29062021171059
148;119;29062021171059
149;120;29062021171059
150;120;29062021171059
151;121;29062021171059
152;121;29062021171059
153;119;29062021171059
154;121;29062021171059
155;119;29062021171059
156;119;29062021171059
157;119;29062021171059
158;119;29062021171059
159;119;29062021171059
160;121;29062021171059
161;119;29062021171059
162;121;29062021171059
163;121;29062021171059
164;119;29062021171059
165;121;29062021171059
166;120;29062021171059
167;121;29062021171059
168;121;29062021171059
169;118;29062021171059
170;120;29062021171059
171;119;29062021171059
172;119;29062021171059
173;121;29062021171059
174;120;29062021171059
175;119;29062021171059
176;121;29062021171059
177;118;29062021171059
178;121;29062021171059
179;120;29062021171059
180;119;29062021171059
181;121;29062021171059
182;120;29062021171059
183;119;29062021171059
184;120;29062021171059
185;118;29062021171059
186;120;29062021171059
187;120;29062021171059
188;117;29062021171059
189;120;29062021171059
190;119;29062021171059
191;118;29062021171059
192;122;29062021171059
193;119;29062021171059
194;120;29062021171059
195;120;29062021171059
196;118;29062021171059
197;120;29062021171059
198;120;29062021171059
199;117;29062021171059
200;0;29062021171059
0;0;29062021171100
1;143;29062021171100
2;123;29062021171100
3;121;29062021171100
4;122;29062021171100
5;122;29062021171100
6;120;29062021171100
7;122;29062021171100
8;124;29062021171100
9;121;29062021171100
10;124;29062021171100
11;122;29062021171100
12;122;29062021171100
13;126;29062021171100
14;126;29062021171100
15;128;29062021171100
16;131;29062021171100
17;134;29062021171100
18;146;29062021171100
19;165;29062021171100
20;210;29062021171100
21;326;29062021171100
22;630;29062021171100
23;1023;29062021171100
24;1023;29062021171100
25;1023;29062021171100
26;1023;29062021171100
27;1023;29062021171100
28;1023;29062021171100
29;1023;29062021171100
30;1023;29062021171100
31;1023;29062021171100
32;844;29062021171100
33;626;29062021171100
34;471;29062021171100
35;368;29062021171100
36;294;29062021171100
37;248;29062021171100
38;215;29062021171100
39;194;29062021171100
40;178;29062021171100
41;169;29062021171100
42;166;29062021171100
43;161;29062021171100
44;160;29062021171100
45;159;29062021171100
46;155;29062021171100
47;156;29062021171100
48;157;29062021171100
49;155;29062021171100
50;157;29062021171100
51;156;29062021171100
52;154;29062021171100
53;157;29062021171100
54;156;29062021171100
55;156;29062021171100
56;159;29062021171100
57;157;29062021171100
58;162;29062021171100
59;161;29062021171100
60;162;29062021171100
61;165;29062021171100
62;165;29062021171100
63;166;29062021171100
64;166;29062021171100
65;164;29062021171100
66;167;29062021171100
67;166;29062021171100
68;165;29062021171100
69;165;29062021171100
70;160;29062021171100
71;161;29062021171100
72;161;29062021171100
73;157;29062021171100
74;159;29062021171100
75;154;29062021171100
76;154;29062021171100
77;153;29062021171100
78;150;29062021171100
79;149;29062021171100
80;148;29062021171100
81;145;29062021171100
82;146;29062021171100
83;143;29062021171100
84;142;29062021171100
85;142;29062021171100
86;141;29062021171100
87;140;29062021171100
88;143;29062021171100
89;138;29062021171100
90;140;29062021171100
91;139;29062021171100
92;135;29062021171100
93;137;29062021171100
94;137;29062021171100
95;134;29062021171100
96;137;29062021171100
97;133;29062021171100
98;134;29062021171100
99;132;29062021171100
100;130;29062021171100
101;133;29062021171100
102;130;29062021171100
103;129;29062021171100
104;129;29062021171100
105;128;29062021171100
106;131;29062021171100
107;127;29062021171100
108;127;29062021171100
109;128;29062021171100
110;125;29062021171100
111;126;29062021171100
112;128;29062021171100
113;124;29062021171100
114;126;29062021171100
115;127;29062021171100
116;126;29062021171100
117;128;29062021171100
118;125;29062021171100
119;125;29062021171100
120;123;29062021171100
121;122;29062021171100
122;124;29062021171100
123;124;29062021171100
124;122;29062021171100
125;125;29062021171100
126;123;29062021171100
127;124;29062021171100
128;124;29062021171100
129;122;29062021171100
130;123;29062021171100
131;123;29062021171100
132;121;29062021171100
133;126;29062021171100
134;121;29062021171100
135;122;29062021171100
136;124;29062021171100
137;121;29062021171100
138;123;29062021171100
139;121;29062021171100
140;120;29062021171100
141;123;29062021171100
142;121;29062021171100
143;120;29062021171100
144;123;29062021171100
145;120;29062021171100
146;122;29062021171100
147;122;29062021171100
148;120;29062021171100
149;120;29062021171100
150;120;29062021171100
151;120;29062021171100
152;121;29062021171100
153;119;29062021171100
154;121;29062021171100
155;119;29062021171100
156;119;29062021171100
157;120;29062021171100
158;120;29062021171100
159;120;29062021171100
160;121;29062021171100
161;120;29062021171100
162;121;29062021171100
163;121;29062021171100
164;120;29062021171100
165;121;29062021171100
166;120;29062021171100
167;120;29062021171100
168;121;29062021171100
169;118;29062021171100
170;121;29062021171100
171;120;29062021171100
172;119;29062021171100
173;121;29062021171100
174;120;29062021171100
175;119;29062021171100
176;121;29062021171100
177;119;29062021171100
178;121;29062021171100
179;119;29062021171100
180;120;29062021171100
181;121;29062021171100
182;119;29062021171100
183;119;29062021171100
184;120;29062021171100
185;118;29062021171100
186;122;29062021171100
187;121;29062021171100
188;119;29062021171100
189;120;29062021171100
190;118;29062021171100
191;118;29062021171100
192;123;29062021171100
193;119;29062021171100
194;120;29062021171100
195;119;29062021171100
196;119;29062021171100
197;120;29062021171100
198;120;29062021171100
199;119;29062021171100
200;0;29062021171100
0;0;29062021171100
1;142;29062021171100
2;122;29062021171100
3;119;29062021171100
4;121;29062021171100
5;123;29062021171100
6;120;29062021171100
7;123;29062021171100
8;123;29062021171100
9;120;29062021171100
10;125;29062021171100
11;122;29062021171100
12;123;29062021171100
13;125;29062021171100
14;123;29062021171100
15;129;29062021171100
16;130;29062021171100
17;133;29062021171100
18;146;29062021171100
19;166;29062021171100
20;211;29062021171100
21;326;29062021171100
22;622;29062021171100
23;1023;29062021171100
24;1023;29062021171100
25;1023;29062021171100
26;1023;29062021171100
27;1023;29062021171100
28;1023;29062021171100
29;1023;29062021171100
30;1023;29062021171100
31;1023;29062021171100
32;857;29062021171100
33;633;29062021171100
34;476;29062021171100
35;371;29062021171100
36;296;29062021171100
37;248;29062021171100
38;215;29062021171100
39;194;29062021171100
40;179;29062021171100
41;169;29062021171100
42;166;29062021171100
43;161;29062021171100
44;159;29062021171100
45;159;29062021171100
46;155;29062021171100
47;156;29062021171100
48;157;29062021171100
49;155;29062021171100
50;156;29062021171100
51;154;29062021171100
52;155;29062021171100
53;157;29062021171100
54;157;29062021171100
55;156;29062021171100
56;158;29062021171100
57;158;29062021171100
58;161;29062021171100
59;162;29062021171100
60;163;29062021171100
61;164;29062021171100
62;164;29062021171100
63;167;29062021171100
64;167;29062021171100
65;164;29062021171100
66;167;29062021171100
67;168;29062021171100
68;164;29062021171100
69;166;29062021171100
70;162;29062021171100
71;160;29062021171100
72;162;29062021171100
73;156;29062021171100
74;159;29062021171100
75;154;29062021171100
76;153;29062021171100
77;153;29062021171100
78;148;29062021171100
79;148;29062021171100
80;147;29062021171100
81;145;29062021171100
82;146;29062021171100
83;143;29062021171100
84;142;29062021171100
85;142;29062021171100
86;141;29062021171100
87;141;29062021171100
88;140;29062021171100
89;137;29062021171100
90;141;29062021171100
91;139;29062021171100
92;134;29062021171100
93;137;29062021171100
94;135;29062021171100
95;134;29062021171100
96;136;29062021171100
97;133;29062021171100
98;133;29062021171100
99;132;29062021171100
100;130;29062021171100
101;133;29062021171100
102;129;29062021171100
103;130;29062021171100
104;129;29062021171100
105;128;29062021171100
106;131;29062021171100
107;129;29062021171100
108;128;29062021171100
109;128;29062021171100
110;125;29062021171100
111;125;29062021171100
112;128;29062021171100
113;125;29062021171100
114;126;29062021171100
115;126;29062021171100
116;126;29062021171100
117;128;29062021171100
118;126;29062021171100
119;125;29062021171100
120;123;29062021171100
121;123;29062021171100
122;123;29062021171100
123;124;29062021171100
124;123;29062021171100
125;124;29062021171100
126;123;29062021171100
127;122;29062021171100
128;124;29062021171100
129;121;29062021171100
130;122;29062021171100
131;123;29062021171100
132;120;29062021171100
133;124;29062021171100
134;121;29062021171100
135;121;29062021171100
136;123;29062021171100
137;120;29062021171100
138;123;29062021171100
139;121;29062021171100
140;120;29062021171100
141;122;29062021171100
142;120;29062021171100
143;120;29062021171100
144;122;29062021171100
145;119;29062021171100
146;122;29062021171100
147;121;29062021171100
148;120;29062021171100
149;121;29062021171100
150;119;29062021171100
151;121;29062021171100
152;120;29062021171100
153;118;29062021171100
154;122;29062021171100
155;120;29062021171100
156;119;29062021171100
157;120;29062021171100
158;119;29062021171100
159;119;29062021171100
160;121;29062021171100
161;119;29062021171100
162;121;29062021171100
163;121;29062021171100
164;119;29062021171100
165;121;29062021171100
166;120;29062021171100
167;121;29062021171100
168;122;29062021171100
169;118;29062021171100
170;120;29062021171100
171;120;29062021171100
172;119;29062021171100
173;121;29062021171100
174;120;29062021171100
175;119;29062021171100
176;120;29062021171100
177;119;29062021171100
178;120;29062021171100
179;119;29062021171100
180;119;29062021171100
181;121;29062021171100
182;119;29062021171100
183;119;29062021171100
184;120;29062021171100
185;118;29062021171100
186;121;29062021171100
187;120;29062021171100
188;117;29062021171100
189;120;29062021171100
190;118;29062021171100
191;118;29062021171100
192;122;29062021171100
193;119;29062021171100
194;119;29062021171100
195;119;29062021171100
196;119;29062021171100
197;120;29062021171100
198;119;29062021171100
199;119;29062021171100
200;0;29062021171100
0;0;29062021171100
1;142;29062021171100
2;122;29062021171100
3;121;29062021171100
4;121;29062021171100
5;123;29062021171100
6;121;29062021171100
7;123;29062021171100
8;123;29062021171100
9;121;29062021171100
10;124;29062021171100
11;122;29062021171100
12;122;29062021171100
13;125;29062021171100
14;124;29062021171100
15;128;29062021171100
16;129;29062021171100
17;133;29062021171100
18;146;29062021171100
19;167;29062021171100
20;212;29062021171100
21;327;29062021171100
22;630;29062021171100
23;1023;29062021171100
24;1023;29062021171100
25;1023;29062021171100
26;1023;29062021171100
27;1023;29062021171100
28;1023;29062021171100
29;1023;29062021171100
30;1023;29062021171100
31;1023;29062021171100
32;851;29062021171100
33;629;29062021171100
34;475;29062021171100
35;374;29062021171100
36;294;29062021171100
37;249;29062021171100
38;215;29062021171100
39;194;29062021171100
40;179;29062021171100
41;167;29062021171100
42;166;29062021171100
43;160;29062021171100
44;158;29062021171100
45;157;29062021171100
46;155;29062021171100
47;156;29062021171100
48;157;29062021171100
49;154;29062021171100
50;156;29062021171100
51;154;29062021171100
52;154;29062021171100
53;157;29062021171100
54;157;29062021171100
55;157;29062021171100
56;159;29062021171100
57;157;29062021171100
58;163;29062021171100
59;159;29062021171100
60;164;29062021171100
61;165;29062021171100
62;163;29062021171100
63;166;29062021171100
64;167;29062021171100
65;165;29062021171100
66;168;29062021171100
67;165;29062021171100
68;164;29062021171100
69;165;29062021171100
70;162;29062021171100
71;159;29062021171100
72;160;29062021171100
73;156;29062021171100
74;159;29062021171100
75;155;29062021171100
76;152;29062021171100
77;153;29062021171100
78;150;29062021171100
79;149;29062021171100
80;149;29062021171100
81;144;29062021171100
82;146;29062021171100
83;143;29062021171100
84;142;29062021171100
85;142;29062021171100
86;141;29062021171100
87;141;29062021171100
88;142;29062021171100
89;139;29062021171100
90;139;29062021171100
91;139;29062021171100
92;134;29062021171100
93;138;29062021171100
94;135;29062021171100
95;134;29062021171100
96;137;29062021171100
97;134;29062021171100
98;133;29062021171100
99;133;29062021171100
100;130;29062021171100
101;132;29062021171100
102;130;29062021171100
103;130;29062021171100
104;129;29062021171100
105;128;29062021171100
106;131;29062021171100
107;126;29062021171100
108;127;29062021171100
109;129;29062021171100
110;125;29062021171100
111;126;29062021171100
112;128;29062021171100
113;124;29062021171100
114;126;29062021171100
115;127;29062021171100
116;125;29062021171100
117;128;29062021171100
118;125;29062021171100
119;125;29062021171100
120;124;29062021171100
121;122;29062021171100
122;123;29062021171100
123;124;29062021171100
124;123;29062021171100
125;125;29062021171100
126;123;29062021171100
127;122;29062021171100
128;124;29062021171100
129;121;29062021171100
130;124;29062021171100
131;123;29062021171100
132;121;29062021171100
133;125;29062021171100
134;121;29062021171100
135;121;29062021171100
136;123;29062021171100
137;121;29062021171100
138;123;29062021171100
139;121;29062021171100
140;120;29062021171100
141;123;29062021171100
142;121;29062021171100
143;121;29062021171100
144;121;29062021171100
145;119;29062021171100
146;123;29062021171100
147;121;29062021171100
148;120;29062021171100
149;121;29062021171100
150;119;29062021171100
151;119;29062021171100
152;120;29062021171100
153;119;29062021171100
154;122;29062021171100
155;119;29062021171100
156;119;29062021171100
157;120;29062021171100
158;119;29062021171100
159;119;29062021171100
160;120;29062021171100
161;119;29062021171100
162;122;29062021171100
163;121;29062021171100
164;119;29062021171100
165;121;29062021171100
166;120;29062021171100
167;120;29062021171100
168;121;29062021171100
169;118;29062021171100
170;120;29062021171100
171;119;29062021171100
172;119;29062021171100
173;120;29062021171100
174;119;29062021171100
175;119;29062021171100
176;121;29062021171100
177;118;29062021171100
178;120;29062021171100
179;120;29062021171100
180;119;29062021171100
181;120;29062021171100
182;120;29062021171100
183;118;29062021171100
184;120;29062021171100
185;117;29062021171100
186;121;29062021171100
187;119;29062021171100
188;118;29062021171100
189;120;29062021171100
190;119;29062021171100
191;119;29062021171100
192;122;29062021171100
193;119;29062021171100
194;120;29062021171100
195;119;29062021171100
196;119;29062021171100
197;121;29062021171100
198;120;29062021171100
199;118;29062021171100
200;0;29062021171100
0;0;29062021171101
1;142;29062021171101
2;122;29062021171101
3;120;29062021171101
4;122;29062021171101
5;123;29062021171101
6;121;29062021171101
7;123;29062021171101
8;123;29062021171101
9;121;29062021171101
10;123;29062021171101
11;121;29062021171101
12;122;29062021171101
13;126;29062021171101
14;124;29062021171101
15;128;29062021171101
16;130;29062021171101
17;132;29062021171101
18;146;29062021171101
19;166;29062021171101
20;211;29062021171101
21;329;29062021171101
22;630;29062021171101
23;1023;29062021171101
24;1023;29062021171101
25;1023;29062021171101
26;1023;29062021171101
27;1023;29062021171101
28;1023;29062021171101
29;1023;29062021171101
30;1023;29062021171101
31;1023;29062021171101
32;850;29062021171101
33;625;29062021171101
34;474;29062021171101
35;372;29062021171101
36;295;29062021171101
37;247;29062021171101
38;214;29062021171101
39;194;29062021171101
40;181;29062021171101
41;167;29062021171101
42;166;29062021171101
43;162;29062021171101
44;158;29062021171101
45;157;29062021171101
46;154;29062021171101
47;157;29062021171101
48;157;29062021171101
49;154;29062021171101
50;156;29062021171101
51;156;29062021171101
52;154;29062021171101
53;156;29062021171101
54;155;29062021171101
55;156;29062021171101
56;160;29062021171101
57;157;29062021171101
58;162;29062021171101
59;161;29062021171101
60;163;29062021171101
61;163;29062021171101
62;164;29062021171101
63;165;29062021171101
64;167;29062021171101
65;166;29062021171101
66;169;29062021171101
67;166;29062021171101
68;165;29062021171101
69;166;29062021171101
70;161;29062021171101
71;161;29062021171101
72;161;29062021171101
73;156;29062021171101
74;158;29062021171101
75;155;29062021171101
76;152;29062021171101
77;153;29062021171101
78;150;29062021171101
79;147;29062021171101
80;147;29062021171101
81;144;29062021171101
82;148;29062021171101
83;144;29062021171101
84;142;29062021171101
85;142;29062021171101
86;140;29062021171101
87;140;29062021171101
88;142;29062021171101
89;137;29062021171101
90;139;29062021171101
91;139;29062021171101
92;136;29062021171101
93;139;29062021171101
94;136;29062021171101
95;135;29062021171101
96;134;29062021171101
97;134;29062021171101
98;133;29062021171101
99;132;29062021171101
100;131;29062021171101
101;133;29062021171101
102;130;29062021171101
103;130;29062021171101
104;130;29062021171101
105;128;29062021171101
106;131;29062021171101
107;129;29062021171101
108;127;29062021171101
109;129;29062021171101
110;126;29062021171101
111;127;29062021171101
112;129;29062021171101
113;124;29062021171101
114;126;29062021171101
115;127;29062021171101
116;125;29062021171101
117;128;29062021171101
118;125;29062021171101
119;125;29062021171101
120;124;29062021171101
121;122;29062021171101
122;124;29062021171101
123;122;29062021171101
124;121;29062021171101
125;125;29062021171101
126;123;29062021171101
127;122;29062021171101
128;124;29062021171101
129;122;29062021171101
130;122;29062021171101
131;123;29062021171101
132;121;29062021171101
133;125;29062021171101
134;121;29062021171101
135;122;29062021171101
136;123;29062021171101
137;120;29062021171101
138;122;29062021171101
139;121;29062021171101
140;120;29062021171101
141;122;29062021171101
142;120;29062021171101
143;120;29062021171101
144;122;29062021171101
145;118;29062021171101
146;123;29062021171101
147;120;29062021171101
148;120;29062021171101
149;120;29062021171101
150;119;29062021171101
151;120;29062021171101
152;121;29062021171101
153;119;29062021171101
154;121;29062021171101
155;119;29062021171101
156;119;29062021171101
157;119;29062021171101
158;119;29062021171101
159;119;29062021171101
160;121;29062021171101
161;119;29062021171101
162;121;29062021171101
163;120;29062021171101
164;119;29062021171101
165;122;29062021171101
166;120;29062021171101
167;120;29062021171101
168;120;29062021171101
169;118;29062021171101
170;121;29062021171101
171;121;29062021171101
172;119;29062021171101
173;120;29062021171101
174;119;29062021171101
175;119;29062021171101
176;120;29062021171101
177;118;29062021171101
178;120;29062021171101
179;119;29062021171101
180;119;29062021171101
181;121;29062021171101
182;120;29062021171101
183;119;29062021171101
184;120;29062021171101
185;118;29062021171101
186;121;29062021171101
187;120;29062021171101
188;118;29062021171101
189;119;29062021171101
190;119;29062021171101
191;119;29062021171101
192;122;29062021171101
193;120;29062021171101
194;120;29062021171101
195;119;29062021171101
196;118;29062021171101
197;120;29062021171101
198;119;29062021171101
199;118;29062021171101
200;0;29062021171101
0;0;29062021171102
1;142;29062021171102
2;122;29062021171102
3;120;29062021171102
4;122;29062021171102
5;123;29062021171102
6;121;29062021171102
7;122;29062021171102
8;124;29062021171102
9;121;29062021171102
10;124;29062021171102
11;122;29062021171102
12;123;29062021171102
13;125;29062021171102
14;124;29062021171102
15;128;29062021171102
16;130;29062021171102
17;133;29062021171102
18;145;29062021171102
19;164;29062021171102
20;212;29062021171102
21;328;29062021171102
22;628;29062021171102
23;1023;29062021171102
24;1023;29062021171102
25;1023;29062021171102
26;1023;29062021171102
27;1023;29062021171102
28;1023;29062021171102
29;1023;29062021171102
30;1023;29062021171102
31;1023;29062021171102
32;852;29062021171102
33;621;29062021171102
34;472;29062021171102
35;370;29062021171102
36;294;29062021171102
37;248;29062021171102
38;215;29062021171102
39;191;29062021171102
40;180;29062021171102
41;168;29062021171102
42;166;29062021171102
43;160;29062021171102
44;159;29062021171102
45;158;29062021171102
46;154;29062021171102
47;155;29062021171102
48;158;29062021171102
49;154;29062021171102
50;158;29062021171102
51;154;29062021171102
52;155;29062021171102
53;159;29062021171102
54;155;29062021171102
55;155;29062021171102
56;158;29062021171102
57;158;29062021171102
58;162;29062021171102
59;161;29062021171102
60;163;29062021171102
61;164;29062021171102
62;163;29062021171102
63;166;29062021171102
64;168;29062021171102
65;165;29062021171102
66;166;29062021171102
67;165;29062021171102
68;164;29062021171102
69;165;29062021171102
70;162;29062021171102
71;162;29062021171102
72;161;29062021171102
73;157;29062021171102
74;157;29062021171102
75;154;29062021171102
76;153;29062021171102
77;153;29062021171102
78;149;29062021171102
79;149;29062021171102
80;148;29062021171102
81;144;29062021171102
82;146;29062021171102
83;144;29062021171102
84;143;29062021171102
85;142;29062021171102
86;140;29062021171102
87;140;29062021171102
88;141;29062021171102
89;137;29062021171102
90;140;29062021171102
91;139;29062021171102
92;135;29062021171102
93;137;29062021171102
94;134;29062021171102
95;133;29062021171102
96;136;29062021171102
97;133;29062021171102
98;134;29062021171102
99;133;29062021171102
100;130;29062021171102
101;131;29062021171102
102;129;29062021171102
103;130;29062021171102
104;130;29062021171102
105;127;29062021171102
106;131;29062021171102
107;129;29062021171102
108;127;29062021171102
109;128;29062021171102
110;125;29062021171102
111;126;29062021171102
112;127;29062021171102
113;123;29062021171102
114;125;29062021171102
115;126;29062021171102
116;124;29062021171102
117;128;29062021171102
118;124;29062021171102
119;125;29062021171102
120;124;29062021171102
121;122;29062021171102
122;123;29062021171102
123;124;29062021171102
124;122;29062021171102
125;124;29062021171102
126;123;29062021171102
127;123;29062021171102
128;124;29062021171102
129;122;29062021171102
130;122;29062021171102
131;122;29062021171102
132;122;29062021171102
133;124;29062021171102
134;121;29062021171102
135;122;29062021171102
136;123;29062021171102
137;120;29062021171102
138;123;29062021171102
139;121;29062021171102
140;119;29062021171102
141;123;29062021171102
142;120;29062021171102
143;120;29062021171102
144;122;29062021171102
145;119;29062021171102
146;123;29062021171102
147;119;29062021171102
148;120;29062021171102
149;120;29062021171102
150;120;29062021171102
151;120;29062021171102
152;120;29062021171102
153;119;29062021171102
154;120;29062021171102
155;119;29062021171102
156;119;29062021171102
157;121;29062021171102
158;119;29062021171102
159;119;29062021171102
160;121;29062021171102
161;119;29062021171102
162;120;29062021171102
163;121;29062021171102
164;119;29062021171102
165;121;29062021171102
166;119;29062021171102
167;120;29062021171102
168;121;29062021171102
169;118;29062021171102
170;121;29062021171102
171;120;29062021171102
172;119;29062021171102
173;121;29062021171102
174;120;29062021171102
175;118;29062021171102
176;121;29062021171102
177;119;29062021171102
178;121;29062021171102
179;119;29062021171102
180;119;29062021171102
181;121;29062021171102
182;120;29062021171102
183;118;29062021171102
184;120;29062021171102
185;117;29062021171102
186;120;29062021171102
187;120;29062021171102
188;118;29062021171102
189;120;29062021171102
190;118;29062021171102
191;118;29062021171102
192;122;29062021171102
193;118;29062021171102
194;119;29062021171102
195;120;29062021171102
196;119;29062021171102
197;120;29062021171102
198;119;29062021171102
199;118;29062021171102
200;0;29062021171102
