ind;val;datetime
0;0;30062021115107
1;153;30062021115107
2;189;30062021115107
3;188;30062021115107
4;190;30062021115107
5;192;30062021115107
6;196;30062021115107
7;203;30062021115107
8;211;30062021115107
9;212;30062021115107
10;227;30062021115107
11;234;30062021115107
12;247;30062021115107
13;263;30062021115107
14;284;30062021115107
15;322;30062021115107
16;380;30062021115107
17;493;30062021115107
18;712;30062021115107
19;1023;30062021115107
20;1023;30062021115107
21;1023;30062021115107
22;1023;30062021115107
23;1023;30062021115107
24;979;30062021115107
25;917;30062021115107
26;880;30062021115107
27;886;30062021115107
28;919;30062021115107
29;964;30062021115107
30;1011;30062021115107
31;1023;30062021115107
32;1023;30062021115107
33;1023;30062021115107
34;1023;30062021115107
35;1023;30062021115107
36;1023;30062021115107
37;1023;30062021115107
38;1023;30062021115107
39;1023;30062021115107
40;1023;30062021115107
41;1023;30062021115107
42;1023;30062021115107
43;1023;30062021115107
44;1012;30062021115107
45;977;30062021115107
46;959;30062021115107
47;950;30062021115107
48;947;30062021115107
49;946;30062021115107
50;944;30062021115107
51;951;30062021115107
52;952;30062021115107
53;968;30062021115107
54;986;30062021115107
55;998;30062021115107
56;1019;30062021115107
57;1023;30062021115107
58;1023;30062021115107
59;1023;30062021115107
60;1023;30062021115107
61;1023;30062021115107
62;1023;30062021115107
63;1023;30062021115107
64;1023;30062021115107
65;1023;30062021115107
66;1023;30062021115107
67;1023;30062021115107
68;1023;30062021115107
69;1023;30062021115107
70;1023;30062021115107
71;1023;30062021115107
72;1023;30062021115107
73;1023;30062021115107
74;1023;30062021115107
75;1011;30062021115107
76;995;30062021115107
77;971;30062021115107
78;942;30062021115107
79;919;30062021115107
80;879;30062021115107
81;843;30062021115107
82;825;30062021115107
83;801;30062021115107
84;786;30062021115107
85;763;30062021115107
86;760;30062021115107
87;747;30062021115107
88;731;30062021115107
89;719;30062021115107
90;705;30062021115107
91;682;30062021115107
92;658;30062021115107
93;643;30062021115107
94;619;30062021115107
95;596;30062021115107
96;577;30062021115107
97;560;30062021115107
98;542;30062021115107
99;522;30062021115107
100;510;30062021115107
101;496;30062021115107
102;484;30062021115107
103;471;30062021115107
104;456;30062021115107
105;439;30062021115107
106;433;30062021115107
107;416;30062021115107
108;408;30062021115107
109;394;30062021115107
110;381;30062021115107
111;374;30062021115107
112;365;30062021115107
113;353;30062021115107
114;347;30062021115107
115;342;30062021115107
116;337;30062021115107
117;330;30062021115107
118;317;30062021115107
119;315;30062021115107
120;305;30062021115107
121;301;30062021115107
122;297;30062021115107
123;286;30062021115107
124;278;30062021115107
125;274;30062021115107
126;264;30062021115107
127;260;30062021115107
128;256;30062021115107
129;246;30062021115107
130;242;30062021115107
131;240;30062021115107
132;231;30062021115107
133;234;30062021115107
134;222;30062021115107
135;219;30062021115107
136;218;30062021115107
137;208;30062021115107
138;209;30062021115107
139;203;30062021115107
140;199;30062021115107
141;200;30062021115107
142;193;30062021115107
143;191;30062021115107
144;190;30062021115107
145;185;30062021115107
146;186;30062021115107
147;184;30062021115107
148;180;30062021115107
149;178;30062021115107
150;174;30062021115107
151;173;30062021115107
152;172;30062021115107
153;169;30062021115107
154;169;30062021115107
155;166;30062021115107
156;165;30062021115107
157;165;30062021115107
158;162;30062021115107
159;160;30062021115107
160;160;30062021115107
161;158;30062021115107
162;157;30062021115107
163;157;30062021115107
164;155;30062021115107
165;156;30062021115107
166;152;30062021115107
167;152;30062021115107
168;153;30062021115107
169;148;30062021115107
170;152;30062021115107
171;148;30062021115107
172;147;30062021115107
173;150;30062021115107
174;146;30062021115107
175;145;30062021115107
176;147;30062021115107
177;145;30062021115107
178;147;30062021115107
179;143;30062021115107
180;143;30062021115107
181;144;30062021115107
182;144;30062021115107
183;141;30062021115107
184;142;30062021115107
185;138;30062021115107
186;143;30062021115107
187;142;30062021115107
188;139;30062021115107
189;142;30062021115107
190;140;30062021115107
191;140;30062021115107
192;143;30062021115107
193;139;30062021115107
194;142;30062021115107
195;138;30062021115107
196;138;30062021115107
197;138;30062021115107
198;139;30062021115107
199;136;30062021115107
200;0;30062021115107
0;0;30062021115109
1;153;30062021115109
2;190;30062021115109
3;189;30062021115109
4;189;30062021115109
5;194;30062021115109
6;197;30062021115109
7;204;30062021115109
8;210;30062021115109
9;213;30062021115109
10;225;30062021115109
11;231;30062021115109
12;243;30062021115109
13;264;30062021115109
14;286;30062021115109
15;324;30062021115109
16;382;30062021115109
17;493;30062021115109
18;717;30062021115109
19;1023;30062021115109
20;1023;30062021115109
21;1023;30062021115109
22;1023;30062021115109
23;1023;30062021115109
24;979;30062021115109
25;915;30062021115109
26;879;30062021115109
27;882;30062021115109
28;920;30062021115109
29;960;30062021115109
30;1010;30062021115109
31;1023;30062021115109
32;1023;30062021115109
33;1023;30062021115109
34;1023;30062021115109
35;1023;30062021115109
36;1023;30062021115109
37;1023;30062021115109
38;1023;30062021115109
39;1023;30062021115109
40;1023;30062021115109
41;1023;30062021115109
42;1023;30062021115109
43;1023;30062021115109
44;1012;30062021115109
45;984;30062021115109
46;962;30062021115109
47;958;30062021115109
48;950;30062021115109
49;948;30062021115109
50;943;30062021115109
51;954;30062021115109
52;959;30062021115109
53;972;30062021115109
54;987;30062021115109
55;1002;30062021115109
56;1017;30062021115109
57;1023;30062021115109
58;1023;30062021115109
59;1023;30062021115109
60;1023;30062021115109
61;1023;30062021115109
62;1023;30062021115109
63;1023;30062021115109
64;1023;30062021115109
65;1023;30062021115109
66;1023;30062021115109
67;1023;30062021115109
68;1023;30062021115109
69;1023;30062021115109
70;1023;30062021115109
71;1023;30062021115109
72;1023;30062021115109
73;1023;30062021115109
74;1023;30062021115109
75;1012;30062021115109
76;1002;30062021115109
77;974;30062021115109
78;945;30062021115109
79;920;30062021115109
80;881;30062021115109
81;851;30062021115109
82;830;30062021115109
83;802;30062021115109
84;784;30062021115109
85;773;30062021115109
86;764;30062021115109
87;749;30062021115109
88;735;30062021115109
89;720;30062021115109
90;706;30062021115109
91;685;30062021115109
92;666;30062021115109
93;646;30062021115109
94;620;30062021115109
95;596;30062021115109
96;581;30062021115109
97;558;30062021115109
98;540;30062021115109
99;525;30062021115109
100;509;30062021115109
101;499;30062021115109
102;485;30062021115109
103;467;30062021115109
104;455;30062021115109
105;443;30062021115109
106;434;30062021115109
107;418;30062021115109
108;409;30062021115109
109;396;30062021115109
110;385;30062021115109
111;374;30062021115109
112;366;30062021115109
113;354;30062021115109
114;349;30062021115109
115;341;30062021115109
116;335;30062021115109
117;329;30062021115109
118;320;30062021115109
119;313;30062021115109
120;305;30062021115109
121;296;30062021115109
122;296;30062021115109
123;288;30062021115109
124;280;30062021115109
125;273;30062021115109
126;266;30062021115109
127;263;30062021115109
128;257;30062021115109
129;247;30062021115109
130;245;30062021115109
131;238;30062021115109
132;232;30062021115109
133;233;30062021115109
134;227;30062021115109
135;221;30062021115109
136;218;30062021115109
137;211;30062021115109
138;208;30062021115109
139;204;30062021115109
140;201;30062021115109
141;201;30062021115109
142;194;30062021115109
143;190;30062021115109
144;191;30062021115109
145;185;30062021115109
146;184;30062021115109
147;182;30062021115109
148;179;30062021115109
149;177;30062021115109
150;176;30062021115109
151;174;30062021115109
152;172;30062021115109
153;170;30062021115109
154;167;30062021115109
155;168;30062021115109
156;163;30062021115109
157;163;30062021115109
158;161;30062021115109
159;159;30062021115109
160;159;30062021115109
161;158;30062021115109
162;159;30062021115109
163;157;30062021115109
164;156;30062021115109
165;156;30062021115109
166;152;30062021115109
167;152;30062021115109
168;153;30062021115109
169;147;30062021115109
170;149;30062021115109
171;149;30062021115109
172;147;30062021115109
173;149;30062021115109
174;146;30062021115109
175;145;30062021115109
176;146;30062021115109
177;143;30062021115109
178;145;30062021115109
179;143;30062021115109
180;142;30062021115109
181;142;30062021115109
182;143;30062021115109
183;142;30062021115109
184;143;30062021115109
185;139;30062021115109
186;142;30062021115109
187;141;30062021115109
188;139;30062021115109
189;140;30062021115109
190;140;30062021115109
191;140;30062021115109
192;142;30062021115109
193;137;30062021115109
194;140;30062021115109
195;139;30062021115109
196;138;30062021115109
197;139;30062021115109
198;138;30062021115109
199;137;30062021115109
200;0;30062021115109
0;0;30062021115110
1;152;30062021115110
2;190;30062021115110
3;188;30062021115110
4;192;30062021115110
5;196;30062021115110
6;197;30062021115110
7;205;30062021115110
8;210;30062021115110
9;213;30062021115110
10;224;30062021115110
11;234;30062021115110
12;245;30062021115110
13;266;30062021115110
14;286;30062021115110
15;323;30062021115110
16;386;30062021115110
17;500;30062021115110
18;726;30062021115110
19;1023;30062021115110
20;1023;30062021115110
21;1023;30062021115110
22;1023;30062021115110
23;1023;30062021115110
24;979;30062021115110
25;920;30062021115110
26;879;30062021115110
27;882;30062021115110
28;916;30062021115110
29;958;30062021115110
30;1003;30062021115110
31;1023;30062021115110
32;1023;30062021115110
33;1023;30062021115110
34;1023;30062021115110
35;1023;30062021115110
36;1023;30062021115110
37;1023;30062021115110
38;1023;30062021115110
39;1023;30062021115110
40;1023;30062021115110
41;1023;30062021115110
42;1023;30062021115110
43;1023;30062021115110
44;1019;30062021115110
45;991;30062021115110
46;973;30062021115110
47;959;30062021115110
48;956;30062021115110
49;953;30062021115110
50;949;30062021115110
51;964;30062021115110
52;960;30062021115110
53;978;30062021115110
54;996;30062021115110
55;1004;30062021115110
56;1019;30062021115110
57;1023;30062021115110
58;1023;30062021115110
59;1023;30062021115110
60;1023;30062021115110
61;1023;30062021115110
62;1023;30062021115110
63;1023;30062021115110
64;1023;30062021115110
65;1023;30062021115110
66;1023;30062021115110
67;1023;30062021115110
68;1023;30062021115110
69;1023;30062021115110
70;1023;30062021115110
71;1023;30062021115110
72;1023;30062021115110
73;1023;30062021115110
74;1023;30062021115110
75;1018;30062021115110
76;1000;30062021115110
77;979;30062021115110
78;954;30062021115110
79;924;30062021115110
80;884;30062021115110
81;854;30062021115110
82;835;30062021115110
83;807;30062021115110
84;795;30062021115110
85;774;30062021115110
86;765;30062021115110
87;752;30062021115110
88;743;30062021115110
89;722;30062021115110
90;712;30062021115110
91;692;30062021115110
92;664;30062021115110
93;648;30062021115110
94;624;30062021115110
95;602;30062021115110
96;587;30062021115110
97;565;30062021115110
98;547;30062021115110
99;526;30062021115110
100;516;30062021115110
101;505;30062021115110
102;486;30062021115110
103;472;30062021115110
104;461;30062021115110
105;451;30062021115110
106;437;30062021115110
107;423;30062021115110
108;413;30062021115110
109;398;30062021115110
110;389;30062021115110
111;380;30062021115110
112;367;30062021115110
113;358;30062021115110
114;348;30062021115110
115;344;30062021115110
116;335;30062021115110
117;331;30062021115110
118;323;30062021115110
119;317;30062021115110
120;308;30062021115110
121;298;30062021115110
122;298;30062021115110
123;290;30062021115110
124;283;30062021115110
125;276;30062021115110
126;265;30062021115110
127;260;30062021115110
128;256;30062021115110
129;250;30062021115110
130;248;30062021115110
131;241;30062021115110
132;234;30062021115110
133;234;30062021115110
134;225;30062021115110
135;219;30062021115110
136;218;30062021115110
137;213;30062021115110
138;211;30062021115110
139;207;30062021115110
140;202;30062021115110
141;201;30062021115110
142;196;30062021115110
143;192;30062021115110
144;189;30062021115110
145;185;30062021115110
146;186;30062021115110
147;183;30062021115110
148;179;30062021115110
149;177;30062021115110
150;176;30062021115110
151;175;30062021115110
152;172;30062021115110
153;169;30062021115110
154;171;30062021115110
155;168;30062021115110
156;165;30062021115110
157;163;30062021115110
158;161;30062021115110
159;159;30062021115110
160;159;30062021115110
161;157;30062021115110
162;158;30062021115110
163;156;30062021115110
164;155;30062021115110
165;155;30062021115110
166;153;30062021115110
167;153;30062021115110
168;152;30062021115110
169;147;30062021115110
170;149;30062021115110
171;149;30062021115110
172;146;30062021115110
173;150;30062021115110
174;146;30062021115110
175;144;30062021115110
176;146;30062021115110
177;143;30062021115110
178;146;30062021115110
179;143;30062021115110
180;142;30062021115110
181;142;30062021115110
182;144;30062021115110
183;140;30062021115110
184;142;30062021115110
185;139;30062021115110
186;143;30062021115110
187;141;30062021115110
188;139;30062021115110
189;140;30062021115110
190;138;30062021115110
191;140;30062021115110
192;141;30062021115110
193;137;30062021115110
194;139;30062021115110
195;139;30062021115110
196;138;30062021115110
197;137;30062021115110
198;138;30062021115110
199;136;30062021115110
200;0;30062021115110
0;0;30062021115111
1;152;30062021115111
2;191;30062021115111
3;188;30062021115111
4;191;30062021115111
5;195;30062021115111
6;197;30062021115111
7;205;30062021115111
8;211;30062021115111
9;214;30062021115111
10;224;30062021115111
11;233;30062021115111
12;245;30062021115111
13;263;30062021115111
14;284;30062021115111
15;323;30062021115111
16;381;30062021115111
17;497;30062021115111
18;720;30062021115111
19;1023;30062021115111
20;1023;30062021115111
21;1023;30062021115111
22;1023;30062021115111
23;1023;30062021115111
24;978;30062021115111
25;916;30062021115111
26;878;30062021115111
27;882;30062021115111
28;918;30062021115111
29;959;30062021115111
30;1003;30062021115111
31;1023;30062021115111
32;1023;30062021115111
33;1023;30062021115111
34;1023;30062021115111
35;1023;30062021115111
36;1023;30062021115111
37;1023;30062021115111
38;1023;30062021115111
39;1023;30062021115111
40;1023;30062021115111
41;1023;30062021115111
42;1023;30062021115111
43;1023;30062021115111
44;1016;30062021115111
45;986;30062021115111
46;968;30062021115111
47;955;30062021115111
48;950;30062021115111
49;951;30062021115111
50;946;30062021115111
51;957;30062021115111
52;957;30062021115111
53;975;30062021115111
54;995;30062021115111
55;1005;30062021115111
56;1019;30062021115111
57;1023;30062021115111
58;1023;30062021115111
59;1023;30062021115111
60;1023;30062021115111
61;1023;30062021115111
62;1023;30062021115111
63;1023;30062021115111
64;1023;30062021115111
65;1023;30062021115111
66;1023;30062021115111
67;1023;30062021115111
68;1023;30062021115111
69;1023;30062021115111
70;1023;30062021115111
71;1023;30062021115111
72;1023;30062021115111
73;1023;30062021115111
74;1023;30062021115111
75;1017;30062021115111
76;1002;30062021115111
77;979;30062021115111
78;953;30062021115111
79;920;30062021115111
80;882;30062021115111
81;857;30062021115111
82;834;30062021115111
83;808;30062021115111
84;790;30062021115111
85;769;30062021115111
86;764;30062021115111
87;754;30062021115111
88;740;30062021115111
89;721;30062021115111
90;709;30062021115111
91;687;30062021115111
92;664;30062021115111
93;645;30062021115111
94;621;30062021115111
95;597;30062021115111
96;583;30062021115111
97;566;30062021115111
98;541;30062021115111
99;529;30062021115111
100;513;30062021115111
101;502;30062021115111
102;486;30062021115111
103;469;30062021115111
104;460;30062021115111
105;441;30062021115111
106;439;30062021115111
107;420;30062021115111
108;411;30062021115111
109;396;30062021115111
110;384;30062021115111
111;377;30062021115111
112;367;30062021115111
113;354;30062021115111
114;349;30062021115111
115;344;30062021115111
116;336;30062021115111
117;331;30062021115111
118;320;30062021115111
119;317;30062021115111
120;304;30062021115111
121;300;30062021115111
122;296;30062021115111
123;288;30062021115111
124;281;30062021115111
125;280;30062021115111
126;267;30062021115111
127;261;30062021115111
128;258;30062021115111
129;251;30062021115111
130;246;30062021115111
131;241;30062021115111
132;233;30062021115111
133;235;30062021115111
134;224;30062021115111
135;219;30062021115111
136;217;30062021115111
137;210;30062021115111
138;210;30062021115111
139;205;30062021115111
140;203;30062021115111
141;201;30062021115111
142;194;30062021115111
143;190;30062021115111
144;191;30062021115111
145;184;30062021115111
146;185;30062021115111
147;183;30062021115111
148;179;30062021115111
149;178;30062021115111
150;174;30062021115111
151;174;30062021115111
152;171;30062021115111
153;170;30062021115111
154;169;30062021115111
155;167;30062021115111
156;166;30062021115111
157;163;30062021115111
158;161;30062021115111
159;159;30062021115111
160;160;30062021115111
161;157;30062021115111
162;159;30062021115111
163;156;30062021115111
164;152;30062021115111
165;156;30062021115111
166;152;30062021115111
167;153;30062021115111
168;152;30062021115111
169;147;30062021115111
170;150;30062021115111
171;148;30062021115111
172;146;30062021115111
173;147;30062021115111
174;145;30062021115111
175;143;30062021115111
176;145;30062021115111
177;142;30062021115111
178;145;30062021115111
179;144;30062021115111
180;141;30062021115111
181;143;30062021115111
182;143;30062021115111
183;139;30062021115111
184;141;30062021115111
185;137;30062021115111
186;140;30062021115111
187;140;30062021115111
188;138;30062021115111
189;140;30062021115111
190;137;30062021115111
191;140;30062021115111
192;142;30062021115111
193;138;30062021115111
194;139;30062021115111
195;138;30062021115111
196;137;30062021115111
197;138;30062021115111
198;138;30062021115111
199;136;30062021115111
200;0;30062021115111
0;0;30062021115112
1;152;30062021115112
2;188;30062021115112
3;187;30062021115112
4;192;30062021115112
5;195;30062021115112
6;196;30062021115112
7;202;30062021115112
8;209;30062021115112
9;213;30062021115112
10;224;30062021115112
11;232;30062021115112
12;243;30062021115112
13;263;30062021115112
14;286;30062021115112
15;323;30062021115112
16;380;30062021115112
17;489;30062021115112
18;719;30062021115112
19;1023;30062021115112
20;1023;30062021115112
21;1023;30062021115112
22;1023;30062021115112
23;1023;30062021115112
24;982;30062021115112
25;917;30062021115112
26;880;30062021115112
27;883;30062021115112
28;917;30062021115112
29;960;30062021115112
30;1005;30062021115112
31;1023;30062021115112
32;1023;30062021115112
33;1023;30062021115112
34;1023;30062021115112
35;1023;30062021115112
36;1023;30062021115112
37;1023;30062021115112
38;1023;30062021115112
39;1023;30062021115112
40;1023;30062021115112
41;1023;30062021115112
42;1023;30062021115112
43;1023;30062021115112
44;1010;30062021115112
45;981;30062021115112
46;958;30062021115112
47;951;30062021115112
48;945;30062021115112
49;949;30062021115112
50;940;30062021115112
51;955;30062021115112
52;956;30062021115112
53;971;30062021115112
54;990;30062021115112
55;1001;30062021115112
56;1018;30062021115112
57;1023;30062021115112
58;1023;30062021115112
59;1023;30062021115112
60;1023;30062021115112
61;1023;30062021115112
62;1023;30062021115112
63;1023;30062021115112
64;1023;30062021115112
65;1023;30062021115112
66;1023;30062021115112
67;1023;30062021115112
68;1023;30062021115112
69;1023;30062021115112
70;1023;30062021115112
71;1023;30062021115112
72;1023;30062021115112
73;1023;30062021115112
74;1023;30062021115112
75;1014;30062021115112
76;999;30062021115112
77;976;30062021115112
78;946;30062021115112
79;918;30062021115112
80;879;30062021115112
81;853;30062021115112
82;829;30062021115112
83;807;30062021115112
84;785;30062021115112
85;769;30062021115112
86;760;30062021115112
87;745;30062021115112
88;734;30062021115112
89;716;30062021115112
90;709;30062021115112
91;691;30062021115112
92;663;30062021115112
93;642;30062021115112
94;620;30062021115112
95;598;30062021115112
96;581;30062021115112
97;557;30062021115112
98;544;30062021115112
99;529;30062021115112
100;507;30062021115112
101;500;30062021115112
102;487;30062021115112
103;469;30062021115112
104;456;30062021115112
105;441;30062021115112
106;434;30062021115112
107;417;30062021115112
108;407;30062021115112
109;402;30062021115112
110;382;30062021115112
111;372;30062021115112
112;364;30062021115112
113;353;30062021115112
114;345;30062021115112
115;342;30062021115112
116;334;30062021115112
117;332;30062021115112
118;318;30062021115112
119;310;30062021115112
120;304;30062021115112
121;298;30062021115112
122;294;30062021115112
123;291;30062021115112
124;282;30062021115112
125;275;30062021115112
126;266;30062021115112
127;262;30062021115112
128;255;30062021115112
129;248;30062021115112
130;244;30062021115112
131;240;30062021115112
132;231;30062021115112
133;234;30062021115112
134;222;30062021115112
135;220;30062021115112
136;217;30062021115112
137;211;30062021115112
138;207;30062021115112
139;206;30062021115112
140;201;30062021115112
141;200;30062021115112
142;193;30062021115112
143;191;30062021115112
144;189;30062021115112
145;185;30062021115112
146;187;30062021115112
147;184;30062021115112
148;179;30062021115112
149;177;30062021115112
150;174;30062021115112
151;174;30062021115112
152;172;30062021115112
153;168;30062021115112
154;168;30062021115112
155;167;30062021115112
156;164;30062021115112
157;165;30062021115112
158;162;30062021115112
159;160;30062021115112
160;160;30062021115112
161;158;30062021115112
162;156;30062021115112
163;157;30062021115112
164;155;30062021115112
165;155;30062021115112
166;152;30062021115112
167;153;30062021115112
168;152;30062021115112
169;148;30062021115112
170;150;30062021115112
171;148;30062021115112
172;146;30062021115112
173;149;30062021115112
174;146;30062021115112
175;145;30062021115112
176;146;30062021115112
177;143;30062021115112
178;146;30062021115112
179;144;30062021115112
180;143;30062021115112
181;144;30062021115112
182;143;30062021115112
183;140;30062021115112
184;141;30062021115112
185;139;30062021115112
186;143;30062021115112
187;140;30062021115112
188;138;30062021115112
189;140;30062021115112
190;139;30062021115112
191;140;30062021115112
192;142;30062021115112
193;137;30062021115112
194;140;30062021115112
195;138;30062021115112
196;137;30062021115112
197;138;30062021115112
198;138;30062021115112
199;136;30062021115112
200;0;30062021115112
0;0;30062021115113
1;153;30062021115113
2;188;30062021115113
3;188;30062021115113
4;191;30062021115113
5;195;30062021115113
6;198;30062021115113
7;203;30062021115113
8;211;30062021115113
9;214;30062021115113
10;226;30062021115113
11;234;30062021115113
12;246;30062021115113
13;265;30062021115113
14;285;30062021115113
15;323;30062021115113
16;382;30062021115113
17;496;30062021115113
18;718;30062021115113
19;1023;30062021115113
20;1023;30062021115113
21;1023;30062021115113
22;1023;30062021115113
23;1023;30062021115113
24;980;30062021115113
25;917;30062021115113
26;882;30062021115113
27;883;30062021115113
28;918;30062021115113
29;962;30062021115113
30;1004;30062021115113
31;1023;30062021115113
32;1023;30062021115113
33;1023;30062021115113
34;1023;30062021115113
35;1023;30062021115113
36;1023;30062021115113
37;1023;30062021115113
38;1023;30062021115113
39;1023;30062021115113
40;1023;30062021115113
41;1023;30062021115113
42;1023;30062021115113
43;1023;30062021115113
44;1012;30062021115113
45;988;30062021115113
46;967;30062021115113
47;955;30062021115113
48;950;30062021115113
49;949;30062021115113
50;945;30062021115113
51;953;30062021115113
52;952;30062021115113
53;974;30062021115113
54;991;30062021115113
55;1004;30062021115113
56;1015;30062021115113
57;1023;30062021115113
58;1023;30062021115113
59;1023;30062021115113
60;1023;30062021115113
61;1023;30062021115113
62;1023;30062021115113
63;1023;30062021115113
64;1023;30062021115113
65;1023;30062021115113
66;1023;30062021115113
67;1023;30062021115113
68;1023;30062021115113
69;1023;30062021115113
70;1023;30062021115113
71;1023;30062021115113
72;1023;30062021115113
73;1023;30062021115113
74;1023;30062021115113
75;1013;30062021115113
76;1004;30062021115113
77;979;30062021115113
78;951;30062021115113
79;921;30062021115113
80;885;30062021115113
81;846;30062021115113
82;831;30062021115113
83;807;30062021115113
84;788;30062021115113
85;771;30062021115113
86;763;30062021115113
87;750;30062021115113
88;741;30062021115113
89;723;30062021115113
90;707;30062021115113
91;692;30062021115113
92;664;30062021115113
93;642;30062021115113
94;620;30062021115113
95;599;30062021115113
96;586;30062021115113
97;558;30062021115113
98;540;30062021115113
99;527;30062021115113
100;511;30062021115113
101;504;30062021115113
102;487;30062021115113
103;471;30062021115113
104;454;30062021115113
105;445;30062021115113
106;434;30062021115113
107;422;30062021115113
108;411;30062021115113
109;401;30062021115113
110;383;30062021115113
111;375;30062021115113
112;366;30062021115113
113;356;30062021115113
114;347;30062021115113
115;343;30062021115113
116;333;30062021115113
117;332;30062021115113
118;319;30062021115113
119;317;30062021115113
120;306;30062021115113
121;298;30062021115113
122;295;30062021115113
123;290;30062021115113
124;284;30062021115113
125;275;30062021115113
126;266;30062021115113
127;262;30062021115113
128;258;30062021115113
129;249;30062021115113
130;247;30062021115113
131;241;30062021115113
132;234;30062021115113
133;232;30062021115113
134;224;30062021115113
135;220;30062021115113
136;217;30062021115113
137;211;30062021115113
138;211;30062021115113
139;205;30062021115113
140;201;30062021115113
141;199;30062021115113
142;195;30062021115113
143;191;30062021115113
144;190;30062021115113
145;186;30062021115113
146;187;30062021115113
147;184;30062021115113
148;178;30062021115113
149;177;30062021115113
150;175;30062021115113
151;174;30062021115113
152;171;30062021115113
153;168;30062021115113
154;169;30062021115113
155;168;30062021115113
156;165;30062021115113
157;164;30062021115113
158;162;30062021115113
159;160;30062021115113
160;161;30062021115113
161;158;30062021115113
162;157;30062021115113
163;155;30062021115113
164;155;30062021115113
165;157;30062021115113
166;153;30062021115113
167;153;30062021115113
168;152;30062021115113
169;148;30062021115113
170;152;30062021115113
171;148;30062021115113
172;147;30062021115113
173;149;30062021115113
174;146;30062021115113
175;145;30062021115113
176;145;30062021115113
177;144;30062021115113
178;147;30062021115113
179;143;30062021115113
180;143;30062021115113
181;144;30062021115113
182;145;30062021115113
183;141;30062021115113
184;142;30062021115113
185;138;30062021115113
186;143;30062021115113
187;140;30062021115113
188;138;30062021115113
189;139;30062021115113
190;138;30062021115113
191;140;30062021115113
192;142;30062021115113
193;138;30062021115113
194;139;30062021115113
195;139;30062021115113
196;137;30062021115113
197;139;30062021115113
198;137;30062021115113
199;137;30062021115113
200;0;30062021115113
0;0;30062021115114
1;152;30062021115114
2;189;30062021115114
3;188;30062021115114
4;191;30062021115114
5;196;30062021115114
6;197;30062021115114
7;204;30062021115114
8;209;30062021115114
9;211;30062021115114
10;226;30062021115114
11;232;30062021115114
12;242;30062021115114
13;267;30062021115114
14;284;30062021115114
15;325;30062021115114
16;385;30062021115114
17;495;30062021115114
18;719;30062021115114
19;1023;30062021115114
20;1023;30062021115114
21;1023;30062021115114
22;1023;30062021115114
23;1023;30062021115114
24;979;30062021115114
25;922;30062021115114
26;880;30062021115114
27;883;30062021115114
28;918;30062021115114
29;958;30062021115114
30;1002;30062021115114
31;1023;30062021115114
32;1023;30062021115114
33;1023;30062021115114
34;1023;30062021115114
35;1023;30062021115114
36;1023;30062021115114
37;1023;30062021115114
38;1023;30062021115114
39;1023;30062021115114
40;1023;30062021115114
41;1023;30062021115114
42;1023;30062021115114
43;1023;30062021115114
44;1015;30062021115114
45;986;30062021115114
46;964;30062021115114
47;954;30062021115114
48;952;30062021115114
49;950;30062021115114
50;941;30062021115114
51;959;30062021115114
52;958;30062021115114
53;972;30062021115114
54;989;30062021115114
55;997;30062021115114
56;1013;30062021115114
57;1023;30062021115114
58;1023;30062021115114
59;1023;30062021115114
60;1023;30062021115114
61;1023;30062021115114
62;1023;30062021115114
63;1023;30062021115114
64;1023;30062021115114
65;1023;30062021115114
66;1023;30062021115114
67;1023;30062021115114
68;1023;30062021115114
69;1023;30062021115114
70;1023;30062021115114
71;1023;30062021115114
72;1023;30062021115114
73;1023;30062021115114
74;1023;30062021115114
75;1015;30062021115114
76;999;30062021115114
77;979;30062021115114
78;947;30062021115114
79;921;30062021115114
80;885;30062021115114
81;855;30062021115114
82;833;30062021115114
83;807;30062021115114
84;789;30062021115114
85;773;30062021115114
86;763;30062021115114
87;750;30062021115114
88;741;30062021115114
89;720;30062021115114
90;707;30062021115114
91;686;30062021115114
92;663;30062021115114
93;648;30062021115114
94;625;30062021115114
95;599;30062021115114
96;580;30062021115114
97;561;30062021115114
98;544;30062021115114
99;530;30062021115114
100;514;30062021115114
101;509;30062021115114
102;486;30062021115114
103;466;30062021115114
104;457;30062021115114
105;444;30062021115114
106;437;30062021115114
107;421;30062021115114
108;408;30062021115114
109;396;30062021115114
110;385;30062021115114
111;373;30062021115114
112;368;30062021115114
113;356;30062021115114
114;347;30062021115114
115;342;30062021115114
116;336;30062021115114
117;332;30062021115114
118;321;30062021115114
119;317;30062021115114
120;305;30062021115114
121;298;30062021115114
122;293;30062021115114
123;290;30062021115114
124;280;30062021115114
125;275;30062021115114
126;266;30062021115114
127;261;30062021115114
128;259;30062021115114
129;250;30062021115114
130;245;30062021115114
131;238;30062021115114
132;232;30062021115114
133;235;30062021115114
134;224;30062021115114
135;222;30062021115114
136;217;30062021115114
137;213;30062021115114
138;209;30062021115114
139;205;30062021115114
140;200;30062021115114
141;201;30062021115114
142;195;30062021115114
143;188;30062021115114
144;191;30062021115114
145;186;30062021115114
146;185;30062021115114
147;183;30062021115114
148;179;30062021115114
149;180;30062021115114
150;176;30062021115114
151;176;30062021115114
152;171;30062021115114
153;170;30062021115114
154;170;30062021115114
155;167;30062021115114
156;164;30062021115114
157;163;30062021115114
158;162;30062021115114
159;160;30062021115114
160;160;30062021115114
161;158;30062021115114
162;158;30062021115114
163;157;30062021115114
164;155;30062021115114
165;155;30062021115114
166;151;30062021115114
167;152;30062021115114
168;153;30062021115114
169;147;30062021115114
170;150;30062021115114
171;148;30062021115114
172;147;30062021115114
173;149;30062021115114
174;146;30062021115114
175;145;30062021115114
176;144;30062021115114
177;144;30062021115114
178;146;30062021115114
179;144;30062021115114
180;142;30062021115114
181;144;30062021115114
182;143;30062021115114
183;141;30062021115114
184;143;30062021115114
185;139;30062021115114
186;143;30062021115114
187;141;30062021115114
188;139;30062021115114
189;140;30062021115114
190;138;30062021115114
191;139;30062021115114
192;142;30062021115114
193;137;30062021115114
194;140;30062021115114
195;138;30062021115114
196;137;30062021115114
197;139;30062021115114
198;138;30062021115114
199;136;30062021115114
200;0;30062021115114
0;0;30062021115115
1;153;30062021115115
2;189;30062021115115
3;188;30062021115115
4;192;30062021115115
5;194;30062021115115
6;198;30062021115115
7;205;30062021115115
8;211;30062021115115
9;213;30062021115115
10;225;30062021115115
11;233;30062021115115
12;246;30062021115115
13;263;30062021115115
14;285;30062021115115
15;321;30062021115115
16;384;30062021115115
17;493;30062021115115
18;717;30062021115115
19;1023;30062021115115
20;1023;30062021115115
21;1023;30062021115115
22;1023;30062021115115
23;1023;30062021115115
24;982;30062021115115
25;921;30062021115115
26;881;30062021115115
27;884;30062021115115
28;914;30062021115115
29;958;30062021115115
30;1003;30062021115115
31;1023;30062021115115
32;1023;30062021115115
33;1023;30062021115115
34;1023;30062021115115
35;1023;30062021115115
36;1023;30062021115115
37;1023;30062021115115
38;1023;30062021115115
39;1023;30062021115115
40;1023;30062021115115
41;1023;30062021115115
42;1023;30062021115115
43;1023;30062021115115
44;1014;30062021115115
45;982;30062021115115
46;970;30062021115115
47;952;30062021115115
48;947;30062021115115
49;947;30062021115115
50;942;30062021115115
51;953;30062021115115
52;959;30062021115115
53;971;30062021115115
54;987;30062021115115
55;999;30062021115115
56;1016;30062021115115
57;1023;30062021115115
58;1023;30062021115115
59;1023;30062021115115
60;1023;30062021115115
61;1023;30062021115115
62;1023;30062021115115
63;1023;30062021115115
64;1023;30062021115115
65;1023;30062021115115
66;1023;30062021115115
67;1023;30062021115115
68;1023;30062021115115
69;1023;30062021115115
70;1023;30062021115115
71;1023;30062021115115
72;1023;30062021115115
73;1023;30062021115115
74;1023;30062021115115
75;1015;30062021115115
76;1001;30062021115115
77;976;30062021115115
78;947;30062021115115
79;923;30062021115115
80;881;30062021115115
81;853;30062021115115
82;835;30062021115115
83;807;30062021115115
84;791;30062021115115
85;771;30062021115115
86;760;30062021115115
87;751;30062021115115
88;736;30062021115115
89;721;30062021115115
90;713;30062021115115
91;692;30062021115115
92;664;30062021115115
93;647;30062021115115
94;622;30062021115115
95;598;30062021115115
96;581;30062021115115
97;558;30062021115115
98;544;30062021115115
99;525;30062021115115
100;513;30062021115115
101;501;30062021115115
102;485;30062021115115
103;470;30062021115115
104;457;30062021115115
105;444;30062021115115
106;436;30062021115115
107;421;30062021115115
108;410;30062021115115
109;396;30062021115115
110;388;30062021115115
111;377;30062021115115
112;366;30062021115115
113;352;30062021115115
114;349;30062021115115
115;342;30062021115115
116;334;30062021115115
117;330;30062021115115
118;316;30062021115115
119;313;30062021115115
120;305;30062021115115
121;299;30062021115115
122;294;30062021115115
123;288;30062021115115
124;281;30062021115115
125;276;30062021115115
126;269;30062021115115
127;262;30062021115115
128;258;30062021115115
129;249;30062021115115
130;243;30062021115115
131;240;30062021115115
132;231;30062021115115
133;234;30062021115115
134;223;30062021115115
135;219;30062021115115
136;216;30062021115115
137;211;30062021115115
138;213;30062021115115
139;206;30062021115115
140;201;30062021115115
141;201;30062021115115
142;194;30062021115115
143;190;30062021115115
144;190;30062021115115
145;185;30062021115115
146;186;30062021115115
147;184;30062021115115
148;178;30062021115115
149;177;30062021115115
150;176;30062021115115
151;174;30062021115115
152;172;30062021115115
153;170;30062021115115
154;171;30062021115115
155;168;30062021115115
156;164;30062021115115
157;163;30062021115115
158;160;30062021115115
159;158;30062021115115
160;159;30062021115115
161;158;30062021115115
162;158;30062021115115
163;157;30062021115115
164;155;30062021115115
165;156;30062021115115
166;153;30062021115115
167;152;30062021115115
168;152;30062021115115
169;147;30062021115115
170;150;30062021115115
171;148;30062021115115
172;146;30062021115115
173;148;30062021115115
174;146;30062021115115
175;144;30062021115115
176;144;30062021115115
177;144;30062021115115
178;146;30062021115115
179;143;30062021115115
180;143;30062021115115
181;144;30062021115115
182;143;30062021115115
183;140;30062021115115
184;141;30062021115115
185;139;30062021115115
186;143;30062021115115
187;141;30062021115115
188;139;30062021115115
189;141;30062021115115
190;138;30062021115115
191;139;30062021115115
192;141;30062021115115
193;138;30062021115115
194;139;30062021115115
195;138;30062021115115
196;137;30062021115115
197;138;30062021115115
198;139;30062021115115
199;137;30062021115115
200;0;30062021115115
0;0;30062021115116
1;152;30062021115116
2;189;30062021115116
3;188;30062021115116
4;192;30062021115116
5;195;30062021115116
6;197;30062021115116
7;202;30062021115116
8;210;30062021115116
9;214;30062021115116
10;226;30062021115116
11;233;30062021115116
12;245;30062021115116
13;265;30062021115116
14;284;30062021115116
15;322;30062021115116
16;385;30062021115116
17;496;30062021115116
18;717;30062021115116
19;1023;30062021115116
20;1023;30062021115116
21;1023;30062021115116
22;1023;30062021115116
23;1023;30062021115116
24;982;30062021115116
25;917;30062021115116
26;880;30062021115116
27;881;30062021115116
28;915;30062021115116
29;958;30062021115116
30;1001;30062021115116
31;1023;30062021115116
32;1023;30062021115116
33;1023;30062021115116
34;1023;30062021115116
35;1023;30062021115116
36;1023;30062021115116
37;1023;30062021115116
38;1023;30062021115116
39;1023;30062021115116
40;1023;30062021115116
41;1023;30062021115116
42;1023;30062021115116
43;1023;30062021115116
44;1013;30062021115116
45;984;30062021115116
46;963;30062021115116
47;955;30062021115116
48;951;30062021115116
49;947;30062021115116
50;947;30062021115116
51;955;30062021115116
52;954;30062021115116
53;971;30062021115116
54;989;30062021115116
55;1003;30062021115116
56;1015;30062021115116
57;1023;30062021115116
58;1023;30062021115116
59;1023;30062021115116
60;1023;30062021115116
61;1023;30062021115116
62;1023;30062021115116
63;1023;30062021115116
64;1023;30062021115116
65;1023;30062021115116
66;1023;30062021115116
67;1023;30062021115116
68;1023;30062021115116
69;1023;30062021115116
70;1023;30062021115116
71;1023;30062021115116
72;1023;30062021115116
73;1023;30062021115116
74;1023;30062021115116
75;1016;30062021115116
76;999;30062021115116
77;977;30062021115116
78;950;30062021115116
79;920;30062021115116
80;885;30062021115116
81;852;30062021115116
82;830;30062021115116
83;807;30062021115116
84;791;30062021115116
85;768;30062021115116
86;759;30062021115116
87;751;30062021115116
88;745;30062021115116
89;726;30062021115116
90;715;30062021115116
91;685;30062021115116
92;668;30062021115116
93;647;30062021115116
94;623;30062021115116
95;596;30062021115116
96;582;30062021115116
97;558;30062021115116
98;540;30062021115116
99;529;30062021115116
100;513;30062021115116
101;501;30062021115116
102;486;30062021115116
103;470;30062021115116
104;457;30062021115116
105;443;30062021115116
106;433;30062021115116
107;419;30062021115116
108;411;30062021115116
109;400;30062021115116
110;387;30062021115116
111;375;30062021115116
112;369;30062021115116
113;355;30062021115116
114;347;30062021115116
115;346;30062021115116
116;335;30062021115116
117;331;30062021115116
118;319;30062021115116
119;315;30062021115116
120;305;30062021115116
121;299;30062021115116
122;294;30062021115116
123;290;30062021115116
124;282;30062021115116
125;276;30062021115116
126;267;30062021115116
127;260;30062021115116
128;259;30062021115116
129;250;30062021115116
130;245;30062021115116
131;239;30062021115116
132;231;30062021115116
133;234;30062021115116
134;225;30062021115116
135;219;30062021115116
136;218;30062021115116
137;211;30062021115116
138;209;30062021115116
139;205;30062021115116
140;202;30062021115116
141;202;30062021115116
142;195;30062021115116
143;192;30062021115116
144;191;30062021115116
145;185;30062021115116
146;186;30062021115116
147;183;30062021115116
148;181;30062021115116
149;178;30062021115116
150;175;30062021115116
151;175;30062021115116
152;170;30062021115116
153;170;30062021115116
154;171;30062021115116
155;167;30062021115116
156;166;30062021115116
157;164;30062021115116
158;162;30062021115116
159;159;30062021115116
160;159;30062021115116
161;157;30062021115116
162;157;30062021115116
163;157;30062021115116
164;155;30062021115116
165;155;30062021115116
166;152;30062021115116
167;153;30062021115116
168;153;30062021115116
169;148;30062021115116
170;150;30062021115116
171;147;30062021115116
172;147;30062021115116
173;147;30062021115116
174;145;30062021115116
175;142;30062021115116
176;146;30062021115116
177;143;30062021115116
178;144;30062021115116
179;143;30062021115116
180;143;30062021115116
181;143;30062021115116
182;142;30062021115116
183;141;30062021115116
184;142;30062021115116
185;138;30062021115116
186;142;30062021115116
187;140;30062021115116
188;139;30062021115116
189;140;30062021115116
190;138;30062021115116
191;139;30062021115116
192;143;30062021115116
193;139;30062021115116
194;139;30062021115116
195;139;30062021115116
196;137;30062021115116
197;138;30062021115116
198;138;30062021115116
199;136;30062021115116
200;0;30062021115116
0;0;30062021115117
1;152;30062021115117
2;188;30062021115117
3;188;30062021115117
4;192;30062021115117
5;195;30062021115117
6;198;30062021115117
7;202;30062021115117
8;212;30062021115117
9;214;30062021115117
10;224;30062021115117
11;233;30062021115117
12;244;30062021115117
13;264;30062021115117
14;286;30062021115117
15;324;30062021115117
16;385;30062021115117
17;491;30062021115117
18;716;30062021115117
19;1023;30062021115117
20;1023;30062021115117
21;1023;30062021115117
22;1023;30062021115117
23;1023;30062021115117
24;980;30062021115117
25;917;30062021115117
26;881;30062021115117
27;879;30062021115117
28;916;30062021115117
29;956;30062021115117
30;999;30062021115117
31;1023;30062021115117
32;1023;30062021115117
33;1023;30062021115117
34;1023;30062021115117
35;1023;30062021115117
36;1023;30062021115117
37;1023;30062021115117
38;1023;30062021115117
39;1023;30062021115117
40;1023;30062021115117
41;1023;30062021115117
42;1023;30062021115117
43;1023;30062021115117
44;1015;30062021115117
45;983;30062021115117
46;969;30062021115117
47;955;30062021115117
48;952;30062021115117
49;944;30062021115117
50;943;30062021115117
51;956;30062021115117
52;961;30062021115117
53;975;30062021115117
54;989;30062021115117
55;1002;30062021115117
56;1018;30062021115117
57;1023;30062021115117
58;1023;30062021115117
59;1023;30062021115117
60;1023;30062021115117
61;1023;30062021115117
62;1023;30062021115117
63;1023;30062021115117
64;1023;30062021115117
65;1023;30062021115117
66;1023;30062021115117
67;1023;30062021115117
68;1023;30062021115117
69;1023;30062021115117
70;1023;30062021115117
71;1023;30062021115117
72;1023;30062021115117
73;1023;30062021115117
74;1023;30062021115117
75;1014;30062021115117
76;999;30062021115117
77;980;30062021115117
78;948;30062021115117
79;920;30062021115117
80;885;30062021115117
81;852;30062021115117
82;836;30062021115117
83;805;30062021115117
84;788;30062021115117
85;767;30062021115117
86;765;30062021115117
87;751;30062021115117
88;742;30062021115117
89;725;30062021115117
90;710;30062021115117
91;688;30062021115117
92;661;30062021115117
93;643;30062021115117
94;624;30062021115117
95;599;30062021115117
96;583;30062021115117
97;562;30062021115117
98;541;30062021115117
99;529;30062021115117
100;513;30062021115117
101;500;30062021115117
102;487;30062021115117
103;470;30062021115117
104;457;30062021115117
105;447;30062021115117
106;438;30062021115117
107;422;30062021115117
108;411;30062021115117
109;396;30062021115117
110;391;30062021115117
111;374;30062021115117
112;366;30062021115117
113;355;30062021115117
114;352;30062021115117
115;346;30062021115117
116;335;30062021115117
117;330;30062021115117
118;319;30062021115117
119;317;30062021115117
120;305;30062021115117
121;297;30062021115117
122;295;30062021115117
123;290;30062021115117
124;283;30062021115117
125;275;30062021115117
126;266;30062021115117
127;261;30062021115117
128;259;30062021115117
129;251;30062021115117
130;245;30062021115117
131;240;30062021115117
132;233;30062021115117
133;234;30062021115117
134;224;30062021115117
135;220;30062021115117
136;219;30062021115117
137;212;30062021115117
138;210;30062021115117
139;205;30062021115117
140;201;30062021115117
141;199;30062021115117
142;195;30062021115117
143;190;30062021115117
144;191;30062021115117
145;186;30062021115117
146;186;30062021115117
147;184;30062021115117
148;178;30062021115117
149;178;30062021115117
150;176;30062021115117
151;174;30062021115117
152;172;30062021115117
153;168;30062021115117
154;170;30062021115117
155;167;30062021115117
156;165;30062021115117
157;163;30062021115117
158;161;30062021115117
159;159;30062021115117
160;159;30062021115117
161;156;30062021115117
162;158;30062021115117
163;157;30062021115117
164;156;30062021115117
165;155;30062021115117
166;152;30062021115117
167;152;30062021115117
168;153;30062021115117
169;148;30062021115117
170;151;30062021115117
171;148;30062021115117
172;146;30062021115117
173;150;30062021115117
174;145;30062021115117
175;143;30062021115117
176;145;30062021115117
177;143;30062021115117
178;146;30062021115117
179;144;30062021115117
180;143;30062021115117
181;144;30062021115117
182;144;30062021115117
183;139;30062021115117
184;143;30062021115117
185;139;30062021115117
186;142;30062021115117
187;140;30062021115117
188;138;30062021115117
189;139;30062021115117
190;138;30062021115117
191;140;30062021115117
192;142;30062021115117
193;139;30062021115117
194;140;30062021115117
195;138;30062021115117
196;137;30062021115117
197;138;30062021115117
198;138;30062021115117
199;137;30062021115117
200;0;30062021115117
