ind;val;datetime
0;0;29062021112500
1;137;29062021112500
2;125;29062021112500
3;121;29062021112500
4;122;29062021112500
5;121;29062021112500
6;121;29062021112500
7;124;29062021112500
8;124;29062021112500
9;120;29062021112500
10;123;29062021112500
11;122;29062021112500
12;120;29062021112500
13;122;29062021112500
14;122;29062021112500
15;123;29062021112500
16;122;29062021112500
17;119;29062021112500
18;122;29062021112500
19;122;29062021112500
20;121;29062021112500
21;121;29062021112500
22;118;29062021112500
23;121;29062021112500
24;124;29062021112500
25;121;29062021112500
26;122;29062021112500
27;120;29062021112500
28;122;29062021112500
29;125;29062021112500
30;121;29062021112500
31;119;29062021112500
32;123;29062021112500
33;120;29062021112500
34;124;29062021112500
35;121;29062021112500
36;120;29062021112500
37;124;29062021112500
38;119;29062021112500
39;123;29062021112500
40;122;29062021112500
41;118;29062021112500
42;121;29062021112500
43;119;29062021112500
44;122;29062021112500
45;127;29062021112500
46;123;29062021112500
47;121;29062021112500
48;120;29062021112500
49;119;29062021112500
50;122;29062021112500
51;121;29062021112500
52;120;29062021112500
53;120;29062021112500
54;119;29062021112500
55;119;29062021112500
56;119;29062021112500
57;120;29062021112500
58;122;29062021112500
59;122;29062021112500
60;122;29062021112500
61;123;29062021112500
62;122;29062021112500
63;121;29062021112500
64;125;29062021112500
65;118;29062021112500
66;123;29062021112500
67;121;29062021112500
68;120;29062021112500
69;123;29062021112500
70;121;29062021112500
71;119;29062021112500
72;121;29062021112500
73;119;29062021112500
74;121;29062021112500
75;122;29062021112500
76;120;29062021112500
77;121;29062021112500
78;120;29062021112500
79;124;29062021112500
80;123;29062021112500
81;119;29062021112500
82;122;29062021112500
83;120;29062021112500
84;121;29062021112500
85;120;29062021112500
86;122;29062021112500
87;124;29062021112500
88;121;29062021112500
89;117;29062021112500
90;122;29062021112500
91;119;29062021112500
92;119;29062021112500
93;124;29062021112500
94;121;29062021112500
95;119;29062021112500
96;122;29062021112500
97;120;29062021112500
98;120;29062021112500
99;121;29062021112500
100;117;29062021112500
101;125;29062021112500
102;122;29062021112500
103;119;29062021112500
104;120;29062021112500
105;118;29062021112500
106;120;29062021112500
107;119;29062021112500
108;121;29062021112500
109;121;29062021112500
110;117;29062021112500
111;118;29062021112500
112;121;29062021112500
113;118;29062021112500
114;119;29062021112500
115;121;29062021112500
116;120;29062021112500
117;122;29062021112500
118;119;29062021112500
119;121;29062021112500
120;119;29062021112500
121;119;29062021112500
122;119;29062021112500
123;119;29062021112500
124;122;29062021112500
125;121;29062021112500
126;119;29062021112500
127;122;29062021112500
128;124;29062021112500
129;121;29062021112500
130;121;29062021112500
131;120;29062021112500
132;119;29062021112500
133;127;29062021112500
134;119;29062021112500
135;120;29062021112500
136;121;29062021112500
137;119;29062021112500
138;124;29062021112500
139;120;29062021112500
140;120;29062021112500
141;123;29062021112500
142;122;29062021112500
143;119;29062021112500
144;123;29062021112500
145;120;29062021112500
146;122;29062021112500
147;123;29062021112500
148;119;29062021112500
149;122;29062021112500
150;122;29062021112500
151;123;29062021112500
152;121;29062021112500
153;120;29062021112500
154;122;29062021112500
155;125;29062021112500
156;121;29062021112500
157;121;29062021112500
158;120;29062021112500
159;120;29062021112500
160;120;29062021112500
161;120;29062021112500
162;123;29062021112500
163;122;29062021112500
164;122;29062021112500
165;123;29062021112500
166;120;29062021112500
167;123;29062021112500
168;124;29062021112500
169;118;29062021112500
170;123;29062021112500
171;121;29062021112500
172;119;29062021112500
173;125;29062021112500
174;120;29062021112500
175;120;29062021112500
176;123;29062021112500
177;119;29062021112500
178;124;29062021112500
179;122;29062021112500
180;121;29062021112500
181;121;29062021112500
182;124;29062021112500
183;120;29062021112500
184;122;29062021112500
185;119;29062021112500
186;124;29062021112500
187;122;29062021112500
188;121;29062021112500
189;123;29062021112500
190;120;29062021112500
191;123;29062021112500
192;124;29062021112500
193;121;29062021112500
194;124;29062021112500
195;122;29062021112500
196;122;29062021112500
197;120;29062021112500
198;122;29062021112500
199;120;29062021112500
200;0;29062021112500
0;0;29062021112501
1;136;29062021112501
2;123;29062021112501
3;120;29062021112501
4;122;29062021112501
5;122;29062021112501
6;120;29062021112501
7;124;29062021112501
8;123;29062021112501
9;119;29062021112501
10;123;29062021112501
11;121;29062021112501
12;120;29062021112501
13;123;29062021112501
14;121;29062021112501
15;122;29062021112501
16;121;29062021112501
17;120;29062021112501
18;122;29062021112501
19;122;29062021112501
20;121;29062021112501
21;119;29062021112501
22;118;29062021112501
23;121;29062021112501
24;123;29062021112501
25;120;29062021112501
26;121;29062021112501
27;119;29062021112501
28;120;29062021112501
29;124;29062021112501
30;122;29062021112501
31;119;29062021112501
32;121;29062021112501
33;118;29062021112501
34;122;29062021112501
35;121;29062021112501
36;120;29062021112501
37;123;29062021112501
38;118;29062021112501
39;121;29062021112501
40;121;29062021112501
41;117;29062021112501
42;121;29062021112501
43;120;29062021112501
44;122;29062021112501
45;127;29062021112501
46;123;29062021112501
47;120;29062021112501
48;120;29062021112501
49;119;29062021112501
50;122;29062021112501
51;120;29062021112501
52;119;29062021112501
53;121;29062021112501
54;118;29062021112501
55;118;29062021112501
56;120;29062021112501
57;118;29062021112501
58;120;29062021112501
59;121;29062021112501
60;121;29062021112501
61;122;29062021112501
62;122;29062021112501
63;120;29062021112501
64;125;29062021112501
65;118;29062021112501
66;120;29062021112501
67;119;29062021112501
68;119;29062021112501
69;121;29062021112501
70;121;29062021112501
71;119;29062021112501
72;121;29062021112501
73;119;29062021112501
74;121;29062021112501
75;121;29062021112501
76;120;29062021112501
77;121;29062021112501
78;121;29062021112501
79;125;29062021112501
80;122;29062021112501
81;118;29062021112501
82;121;29062021112501
83;119;29062021112501
84;119;29062021112501
85;121;29062021112501
86;122;29062021112501
87;123;29062021112501
88;120;29062021112501
89;116;29062021112501
90;122;29062021112501
91;119;29062021112501
92;118;29062021112501
93;124;29062021112501
94;120;29062021112501
95;119;29062021112501
96;121;29062021112501
97;119;29062021112501
98;118;29062021112501
99;120;29062021112501
100;117;29062021112501
101;124;29062021112501
102;122;29062021112501
103;119;29062021112501
104;120;29062021112501
105;118;29062021112501
106;120;29062021112501
107;119;29062021112501
108;120;29062021112501
109;120;29062021112501
110;118;29062021112501
111;117;29062021112501
112;119;29062021112501
113;118;29062021112501
114;119;29062021112501
115;120;29062021112501
116;119;29062021112501
117;122;29062021112501
118;118;29062021112501
119;121;29062021112501
120;119;29062021112501
121;117;29062021112501
122;120;29062021112501
123;119;29062021112501
124;120;29062021112501
125;120;29062021112501
126;117;29062021112501
127;121;29062021112501
128;123;29062021112501
129;119;29062021112501
130;120;29062021112501
131;120;29062021112501
132;118;29062021112501
133;126;29062021112501
134;118;29062021112501
135;120;29062021112501
136;121;29062021112501
137;118;29062021112501
138;123;29062021112501
139;120;29062021112501
140;121;29062021112501
141;123;29062021112501
142;120;29062021112501
143;118;29062021112501
144;122;29062021112501
145;120;29062021112501
146;121;29062021112501
147;124;29062021112501
148;119;29062021112501
149;121;29062021112501
150;122;29062021112501
151;122;29062021112501
152;120;29062021112501
153;119;29062021112501
154;122;29062021112501
155;123;29062021112501
156;120;29062021112501
157;120;29062021112501
158;119;29062021112501
159;119;29062021112501
160;120;29062021112501
161;121;29062021112501
162;121;29062021112501
163;122;29062021112501
164;121;29062021112501
165;122;29062021112501
166;120;29062021112501
167;122;29062021112501
168;124;29062021112501
169;117;29062021112501
170;121;29062021112501
171;120;29062021112501
172;119;29062021112501
173;123;29062021112501
174;119;29062021112501
175;119;29062021112501
176;122;29062021112501
177;119;29062021112501
178;124;29062021112501
179;122;29062021112501
180;120;29062021112501
181;121;29062021112501
182;123;29062021112501
183;119;29062021112501
184;121;29062021112501
185;119;29062021112501
186;122;29062021112501
187;120;29062021112501
188;120;29062021112501
189;123;29062021112501
190;119;29062021112501
191;122;29062021112501
192;124;29062021112501
193;120;29062021112501
194;125;29062021112501
195;121;29062021112501
196;120;29062021112501
197;121;29062021112501
198;122;29062021112501
199;121;29062021112501
200;0;29062021112501
0;0;29062021112501
1;137;29062021112501
2;123;29062021112501
3;120;29062021112501
4;121;29062021112501
5;121;29062021112501
6;121;29062021112501
7;124;29062021112501
8;124;29062021112501
9;119;29062021112501
10;123;29062021112501
11;122;29062021112501
12;119;29062021112501
13;122;29062021112501
14;121;29062021112501
15;122;29062021112501
16;122;29062021112501
17;119;29062021112501
18;123;29062021112501
19;122;29062021112501
20;121;29062021112501
21;119;29062021112501
22;117;29062021112501
23;121;29062021112501
24;123;29062021112501
25;120;29062021112501
26;122;29062021112501
27;119;29062021112501
28;120;29062021112501
29;124;29062021112501
30;122;29062021112501
31;119;29062021112501
32;122;29062021112501
33;118;29062021112501
34;122;29062021112501
35;121;29062021112501
36;120;29062021112501
37;123;29062021112501
38;118;29062021112501
39;121;29062021112501
40;120;29062021112501
41;117;29062021112501
42;120;29062021112501
43;120;29062021112501
44;122;29062021112501
45;127;29062021112501
46;122;29062021112501
47;121;29062021112501
48;120;29062021112501
49;118;29062021112501
50;121;29062021112501
51;121;29062021112501
52;120;29062021112501
53;120;29062021112501
54;117;29062021112501
55;119;29062021112501
56;120;29062021112501
57;118;29062021112501
58;121;29062021112501
59;120;29062021112501
60;122;29062021112501
61;122;29062021112501
62;123;29062021112501
63;121;29062021112501
64;125;29062021112501
65;118;29062021112501
66;121;29062021112501
67;120;29062021112501
68;119;29062021112501
69;122;29062021112501
70;120;29062021112501
71;119;29062021112501
72;122;29062021112501
73;118;29062021112501
74;120;29062021112501
75;120;29062021112501
76;120;29062021112501
77;121;29062021112501
78;120;29062021112501
79;124;29062021112501
80;122;29062021112501
81;118;29062021112501
82;122;29062021112501
83;120;29062021112501
84;119;29062021112501
85;120;29062021112501
86;121;29062021112501
87;123;29062021112501
88;120;29062021112501
89;117;29062021112501
90;122;29062021112501
91;119;29062021112501
92;118;29062021112501
93;123;29062021112501
94;121;29062021112501
95;118;29062021112501
96;121;29062021112501
97;119;29062021112501
98;119;29062021112501
99;119;29062021112501
100;117;29062021112501
101;124;29062021112501
102;122;29062021112501
103;119;29062021112501
104;122;29062021112501
105;119;29062021112501
106;121;29062021112501
107;119;29062021112501
108;119;29062021112501
109;121;29062021112501
110;118;29062021112501
111;117;29062021112501
112;119;29062021112501
113;117;29062021112501
114;119;29062021112501
115;121;29062021112501
116;119;29062021112501
117;121;29062021112501
118;118;29062021112501
119;121;29062021112501
120;120;29062021112501
121;117;29062021112501
122;120;29062021112501
123;119;29062021112501
124;121;29062021112501
125;120;29062021112501
126;119;29062021112501
127;121;29062021112501
128;123;29062021112501
129;121;29062021112501
130;121;29062021112501
131;120;29062021112501
132;118;29062021112501
133;126;29062021112501
134;119;29062021112501
135;120;29062021112501
136;121;29062021112501
137;118;29062021112501
138;122;29062021112501
139;119;29062021112501
140;120;29062021112501
141;122;29062021112501
142;121;29062021112501
143;118;29062021112501
144;122;29062021112501
145;119;29062021112501
146;122;29062021112501
147;123;29062021112501
148;119;29062021112501
149;121;29062021112501
150;122;29062021112501
151;122;29062021112501
152;121;29062021112501
153;120;29062021112501
154;121;29062021112501
155;122;29062021112501
156;121;29062021112501
157;120;29062021112501
158;120;29062021112501
159;119;29062021112501
160;119;29062021112501
161;120;29062021112501
162;122;29062021112501
163;123;29062021112501
164;122;29062021112501
165;122;29062021112501
166;119;29062021112501
167;122;29062021112501
168;124;29062021112501
169;117;29062021112501
170;121;29062021112501
171;120;29062021112501
172;120;29062021112501
173;122;29062021112501
174;119;29062021112501
175;120;29062021112501
176;122;29062021112501
177;119;29062021112501
178;124;29062021112501
179;121;29062021112501
180;121;29062021112501
181;121;29062021112501
182;123;29062021112501
183;120;29062021112501
184;121;29062021112501
185;118;29062021112501
186;123;29062021112501
187;121;29062021112501
188;121;29062021112501
189;122;29062021112501
190;119;29062021112501
191;122;29062021112501
192;124;29062021112501
193;120;29062021112501
194;124;29062021112501
195;121;29062021112501
196;121;29062021112501
197;120;29062021112501
198;121;29062021112501
199;120;29062021112501
200;0;29062021112501
0;0;29062021112502
1;137;29062021112502
2;124;29062021112502
3;119;29062021112502
4;121;29062021112502
5;121;29062021112502
6;120;29062021112502
7;123;29062021112502
8;124;29062021112502
9;119;29062021112502
10;123;29062021112502
11;121;29062021112502
12;120;29062021112502
13;122;29062021112502
14;120;29062021112502
15;123;29062021112502
16;120;29062021112502
17;118;29062021112502
18;121;29062021112502
19;122;29062021112502
20;121;29062021112502
21;120;29062021112502
22;116;29062021112502
23;120;29062021112502
24;124;29062021112502
25;120;29062021112502
26;122;29062021112502
27;119;29062021112502
28;119;29062021112502
29;124;29062021112502
30;122;29062021112502
31;119;29062021112502
32;122;29062021112502
33;119;29062021112502
34;122;29062021112502
35;120;29062021112502
36;119;29062021112502
37;123;29062021112502
38;117;29062021112502
39;121;29062021112502
40;120;29062021112502
41;118;29062021112502
42;120;29062021112502
43;120;29062021112502
44;121;29062021112502
45;127;29062021112502
46;122;29062021112502
47;120;29062021112502
48;119;29062021112502
49;118;29062021112502
50;121;29062021112502
51;120;29062021112502
52;119;29062021112502
53;120;29062021112502
54;118;29062021112502
55;118;29062021112502
56;119;29062021112502
57;119;29062021112502
58;121;29062021112502
59;120;29062021112502
60;121;29062021112502
61;122;29062021112502
62;121;29062021112502
63;121;29062021112502
64;124;29062021112502
65;119;29062021112502
66;121;29062021112502
67;119;29062021112502
68;119;29062021112502
69;122;29062021112502
70;121;29062021112502
71;119;29062021112502
72;119;29062021112502
73;118;29062021112502
74;121;29062021112502
75;121;29062021112502
76;120;29062021112502
77;120;29062021112502
78;120;29062021112502
79;123;29062021112502
80;122;29062021112502
81;118;29062021112502
82;121;29062021112502
83;120;29062021112502
84;119;29062021112502
85;121;29062021112502
86;121;29062021112502
87;122;29062021112502
88;120;29062021112502
89;116;29062021112502
90;121;29062021112502
91;119;29062021112502
92;119;29062021112502
93;124;29062021112502
94;120;29062021112502
95;119;29062021112502
96;120;29062021112502
97;119;29062021112502
98;118;29062021112502
99;119;29062021112502
100;117;29062021112502
101;124;29062021112502
102;123;29062021112502
103;118;29062021112502
104;119;29062021112502
105;117;29062021112502
106;121;29062021112502
107;119;29062021112502
108;120;29062021112502
109;121;29062021112502
110;116;29062021112502
111;118;29062021112502
112;120;29062021112502
113;118;29062021112502
114;118;29062021112502
115;120;29062021112502
116;118;29062021112502
117;122;29062021112502
118;118;29062021112502
119;121;29062021112502
120;119;29062021112502
121;118;29062021112502
122;120;29062021112502
123;118;29062021112502
124;120;29062021112502
125;119;29062021112502
126;118;29062021112502
127;120;29062021112502
128;123;29062021112502
129;120;29062021112502
130;121;29062021112502
131;120;29062021112502
132;118;29062021112502
133;126;29062021112502
134;119;29062021112502
135;119;29062021112502
136;121;29062021112502
137;118;29062021112502
138;123;29062021112502
139;120;29062021112502
140;120;29062021112502
141;122;29062021112502
142;120;29062021112502
143;119;29062021112502
144;123;29062021112502
145;119;29062021112502
146;121;29062021112502
147;122;29062021112502
148;119;29062021112502
149;122;29062021112502
150;122;29062021112502
151;122;29062021112502
152;120;29062021112502
153;120;29062021112502
154;122;29062021112502
155;124;29062021112502
156;120;29062021112502
157;119;29062021112502
158;119;29062021112502
159;119;29062021112502
160;121;29062021112502
161;119;29062021112502
162;121;29062021112502
163;121;29062021112502
164;121;29062021112502
165;122;29062021112502
166;120;29062021112502
167;121;29062021112502
168;123;29062021112502
169;118;29062021112502
170;122;29062021112502
171;120;29062021112502
172;119;29062021112502
173;123;29062021112502
174;120;29062021112502
175;119;29062021112502
176;122;29062021112502
177;119;29062021112502
178;123;29062021112502
179;121;29062021112502
180;120;29062021112502
181;122;29062021112502
182;124;29062021112502
183;120;29062021112502
184;121;29062021112502
185;118;29062021112502
186;122;29062021112502
187;120;29062021112502
188;120;29062021112502
189;122;29062021112502
190;120;29062021112502
191;123;29062021112502
192;124;29062021112502
193;120;29062021112502
194;124;29062021112502
195;121;29062021112502
196;120;29062021112502
197;121;29062021112502
198;122;29062021112502
199;119;29062021112502
200;0;29062021112502
0;0;29062021112503
1;137;29062021112503
2;124;29062021112503
3;120;29062021112503
4;121;29062021112503
5;120;29062021112503
6;120;29062021112503
7;122;29062021112503
8;123;29062021112503
9;119;29062021112503
10;122;29062021112503
11;122;29062021112503
12;119;29062021112503
13;123;29062021112503
14;120;29062021112503
15;122;29062021112503
16;121;29062021112503
17;118;29062021112503
18;122;29062021112503
19;122;29062021112503
20;120;29062021112503
21;119;29062021112503
22;118;29062021112503
23;120;29062021112503
24;123;29062021112503
25;120;29062021112503
26;121;29062021112503
27;118;29062021112503
28;120;29062021112503
29;124;29062021112503
30;122;29062021112503
31;119;29062021112503
32;121;29062021112503
33;118;29062021112503
34;121;29062021112503
35;120;29062021112503
36;120;29062021112503
37;123;29062021112503
38;118;29062021112503
39;121;29062021112503
40;120;29062021112503
41;117;29062021112503
42;121;29062021112503
43;121;29062021112503
44;121;29062021112503
45;127;29062021112503
46;121;29062021112503
47;120;29062021112503
48;120;29062021112503
49;118;29062021112503
50;122;29062021112503
51;119;29062021112503
52;120;29062021112503
53;120;29062021112503
54;118;29062021112503
55;118;29062021112503
56;120;29062021112503
57;118;29062021112503
58;121;29062021112503
59;120;29062021112503
60;120;29062021112503
61;121;29062021112503
62;121;29062021112503
63;121;29062021112503
64;124;29062021112503
65;118;29062021112503
66;120;29062021112503
67;119;29062021112503
68;119;29062021112503
69;122;29062021112503
70;120;29062021112503
71;119;29062021112503
72;120;29062021112503
73;118;29062021112503
74;120;29062021112503
75;121;29062021112503
76;120;29062021112503
77;121;29062021112503
78;120;29062021112503
79;123;29062021112503
80;122;29062021112503
81;118;29062021112503
82;121;29062021112503
83;120;29062021112503
84;119;29062021112503
85;120;29062021112503
86;122;29062021112503
87;122;29062021112503
88;120;29062021112503
89;117;29062021112503
90;123;29062021112503
91;120;29062021112503
92;118;29062021112503
93;122;29062021112503
94;121;29062021112503
95;119;29062021112503
96;121;29062021112503
97;120;29062021112503
98;119;29062021112503
99;120;29062021112503
100;117;29062021112503
101;123;29062021112503
102;122;29062021112503
103;119;29062021112503
104;121;29062021112503
105;119;29062021112503
106;120;29062021112503
107;118;29062021112503
108;120;29062021112503
109;121;29062021112503
110;117;29062021112503
111;118;29062021112503
112;120;29062021112503
113;117;29062021112503
114;118;29062021112503
115;120;29062021112503
116;118;29062021112503
117;122;29062021112503
118;118;29062021112503
119;122;29062021112503
120;120;29062021112503
121;117;29062021112503
122;119;29062021112503
123;118;29062021112503
124;120;29062021112503
125;120;29062021112503
126;118;29062021112503
127;120;29062021112503
128;123;29062021112503
129;120;29062021112503
130;118;29062021112503
131;119;29062021112503
132;118;29062021112503
133;127;29062021112503
134;119;29062021112503
135;120;29062021112503
136;121;29062021112503
137;119;29062021112503
138;123;29062021112503
139;119;29062021112503
140;119;29062021112503
141;122;29062021112503
142;121;29062021112503
143;119;29062021112503
144;121;29062021112503
145;119;29062021112503
146;122;29062021112503
147;123;29062021112503
148;119;29062021112503
149;121;29062021112503
150;122;29062021112503
151;122;29062021112503
152;120;29062021112503
153;119;29062021112503
154;122;29062021112503
155;122;29062021112503
156;121;29062021112503
157;121;29062021112503
158;120;29062021112503
159;119;29062021112503
160;120;29062021112503
161;119;29062021112503
162;120;29062021112503
163;120;29062021112503
164;121;29062021112503
165;123;29062021112503
166;120;29062021112503
167;122;29062021112503
168;123;29062021112503
169;118;29062021112503
170;122;29062021112503
171;120;29062021112503
172;120;29062021112503
173;123;29062021112503
174;121;29062021112503
175;120;29062021112503
176;120;29062021112503
177;120;29062021112503
178;124;29062021112503
179;122;29062021112503
180;119;29062021112503
181;121;29062021112503
182;123;29062021112503
183;119;29062021112503
184;120;29062021112503
185;118;29062021112503
186;122;29062021112503
187;121;29062021112503
188;120;29062021112503
189;122;29062021112503
190;119;29062021112503
191;121;29062021112503
192;124;29062021112503
193;119;29062021112503
194;124;29062021112503
195;121;29062021112503
196;119;29062021112503
197;121;29062021112503
198;121;29062021112503
199;120;29062021112503
200;0;29062021112503
0;0;29062021112503
1;137;29062021112503
2;123;29062021112503
3;120;29062021112503
4;121;29062021112503
5;121;29062021112503
6;121;29062021112503
7;123;29062021112503
8;123;29062021112503
9;118;29062021112503
10;123;29062021112503
11;122;29062021112503
12;119;29062021112503
13;123;29062021112503
14;120;29062021112503
15;122;29062021112503
16;121;29062021112503
17;119;29062021112503
18;122;29062021112503
19;121;29062021112503
20;120;29062021112503
21;119;29062021112503
22;118;29062021112503
23;120;29062021112503
24;124;29062021112503
25;119;29062021112503
26;121;29062021112503
27;119;29062021112503
28;120;29062021112503
29;124;29062021112503
30;121;29062021112503
31;119;29062021112503
32;121;29062021112503
33;119;29062021112503
34;122;29062021112503
35;121;29062021112503
36;120;29062021112503
37;124;29062021112503
38;119;29062021112503
39;122;29062021112503
40;120;29062021112503
41;118;29062021112503
42;120;29062021112503
43;120;29062021112503
44;121;29062021112503
45;127;29062021112503
46;122;29062021112503
47;120;29062021112503
48;119;29062021112503
49;119;29062021112503
50;122;29062021112503
51;120;29062021112503
52;118;29062021112503
53;121;29062021112503
54;118;29062021112503
55;119;29062021112503
56;119;29062021112503
57;119;29062021112503
58;122;29062021112503
59;121;29062021112503
60;121;29062021112503
61;122;29062021112503
62;122;29062021112503
63;121;29062021112503
64;125;29062021112503
65;118;29062021112503
66;120;29062021112503
67;120;29062021112503
68;120;29062021112503
69;121;29062021112503
70;121;29062021112503
71;119;29062021112503
72;120;29062021112503
73;119;29062021112503
74;120;29062021112503
75;120;29062021112503
76;120;29062021112503
77;120;29062021112503
78;120;29062021112503
79;124;29062021112503
80;122;29062021112503
81;117;29062021112503
82;122;29062021112503
83;120;29062021112503
84;119;29062021112503
85;120;29062021112503
86;122;29062021112503
87;122;29062021112503
88;120;29062021112503
89;116;29062021112503
90;122;29062021112503
91;119;29062021112503
92;118;29062021112503
93;124;29062021112503
94;120;29062021112503
95;119;29062021112503
96;120;29062021112503
97;119;29062021112503
98;119;29062021112503
99;120;29062021112503
100;117;29062021112503
101;123;29062021112503
102;122;29062021112503
103;119;29062021112503
104;120;29062021112503
105;118;29062021112503
106;120;29062021112503
107;118;29062021112503
108;120;29062021112503
109;120;29062021112503
110;117;29062021112503
111;118;29062021112503
112;120;29062021112503
113;118;29062021112503
114;118;29062021112503
115;119;29062021112503
116;118;29062021112503
117;121;29062021112503
118;119;29062021112503
119;121;29062021112503
120;119;29062021112503
121;118;29062021112503
122;120;29062021112503
123;119;29062021112503
124;120;29062021112503
125;120;29062021112503
126;117;29062021112503
127;120;29062021112503
128;124;29062021112503
129;121;29062021112503
130;120;29062021112503
131;119;29062021112503
132;118;29062021112503
133;126;29062021112503
134;119;29062021112503
135;120;29062021112503
136;121;29062021112503
137;119;29062021112503
138;123;29062021112503
139;119;29062021112503
140;120;29062021112503
141;122;29062021112503
142;120;29062021112503
143;119;29062021112503
144;122;29062021112503
145;119;29062021112503
146;121;29062021112503
147;122;29062021112503
148;119;29062021112503
149;121;29062021112503
150;122;29062021112503
151;122;29062021112503
152;121;29062021112503
153;119;29062021112503
154;122;29062021112503
155;122;29062021112503
156;121;29062021112503
157;120;29062021112503
158;119;29062021112503
159;119;29062021112503
160;120;29062021112503
161;119;29062021112503
162;121;29062021112503
163;122;29062021112503
164;122;29062021112503
165;124;29062021112503
166;119;29062021112503
167;122;29062021112503
168;122;29062021112503
169;117;29062021112503
170;123;29062021112503
171;120;29062021112503
172;119;29062021112503
173;124;29062021112503
174;120;29062021112503
175;119;29062021112503
176;122;29062021112503
177;119;29062021112503
178;123;29062021112503
179;121;29062021112503
180;120;29062021112503
181;122;29062021112503
182;122;29062021112503
183;119;29062021112503
184;121;29062021112503
185;117;29062021112503
186;123;29062021112503
187;121;29062021112503
188;120;29062021112503
189;123;29062021112503
190;120;29062021112503
191;122;29062021112503
192;124;29062021112503
193;119;29062021112503
194;123;29062021112503
195;121;29062021112503
196;121;29062021112503
197;120;29062021112503
198;122;29062021112503
199;119;29062021112503
200;0;29062021112503
0;0;29062021112504
1;137;29062021112504
2;123;29062021112504
3;119;29062021112504
4;121;29062021112504
5;121;29062021112504
6;121;29062021112504
7;123;29062021112504
8;123;29062021112504
9;118;29062021112504
10;124;29062021112504
11;122;29062021112504
12;121;29062021112504
13;123;29062021112504
14;120;29062021112504
15;122;29062021112504
16;121;29062021112504
17;118;29062021112504
18;123;29062021112504
19;122;29062021112504
20;120;29062021112504
21;119;29062021112504
22;118;29062021112504
23;120;29062021112504
24;123;29062021112504
25;120;29062021112504
26;122;29062021112504
27;119;29062021112504
28;120;29062021112504
29;123;29062021112504
30;122;29062021112504
31;120;29062021112504
32;121;29062021112504
33;118;29062021112504
34;122;29062021112504
35;122;29062021112504
36;120;29062021112504
37;124;29062021112504
38;118;29062021112504
39;121;29062021112504
40;120;29062021112504
41;119;29062021112504
42;121;29062021112504
43;120;29062021112504
44;121;29062021112504
45;126;29062021112504
46;121;29062021112504
47;120;29062021112504
48;119;29062021112504
49;119;29062021112504
50;121;29062021112504
51;119;29062021112504
52;119;29062021112504
53;120;29062021112504
54;118;29062021112504
55;118;29062021112504
56;120;29062021112504
57;118;29062021112504
58;120;29062021112504
59;120;29062021112504
60;119;29062021112504
61;122;29062021112504
62;121;29062021112504
63;121;29062021112504
64;125;29062021112504
65;117;29062021112504
66;121;29062021112504
67;119;29062021112504
68;120;29062021112504
69;121;29062021112504
70;121;29062021112504
71;119;29062021112504
72;120;29062021112504
73;118;29062021112504
74;121;29062021112504
75;121;29062021112504
76;119;29062021112504
77;121;29062021112504
78;120;29062021112504
79;125;29062021112504
80;122;29062021112504
81;118;29062021112504
82;121;29062021112504
83;120;29062021112504
84;118;29062021112504
85;120;29062021112504
86;122;29062021112504
87;123;29062021112504
88;121;29062021112504
89;117;29062021112504
90;122;29062021112504
91;118;29062021112504
92;118;29062021112504
93;123;29062021112504
94;122;29062021112504
95;119;29062021112504
96;120;29062021112504
97;119;29062021112504
98;118;29062021112504
99;119;29062021112504
100;117;29062021112504
101;124;29062021112504
102;122;29062021112504
103;119;29062021112504
104;120;29062021112504
105;118;29062021112504
106;120;29062021112504
107;119;29062021112504
108;120;29062021112504
109;121;29062021112504
110;118;29062021112504
111;118;29062021112504
112;120;29062021112504
113;118;29062021112504
114;119;29062021112504
115;120;29062021112504
116;119;29062021112504
117;121;29062021112504
118;118;29062021112504
119;122;29062021112504
120;119;29062021112504
121;117;29062021112504
122;120;29062021112504
123;119;29062021112504
124;121;29062021112504
125;120;29062021112504
126;118;29062021112504
127;120;29062021112504
128;123;29062021112504
129;119;29062021112504
130;120;29062021112504
131;121;29062021112504
132;118;29062021112504
133;126;29062021112504
134;119;29062021112504
135;120;29062021112504
136;121;29062021112504
137;118;29062021112504
138;123;29062021112504
139;120;29062021112504
140;120;29062021112504
141;122;29062021112504
142;122;29062021112504
143;118;29062021112504
144;122;29062021112504
145;120;29062021112504
146;122;29062021112504
147;123;29062021112504
148;119;29062021112504
149;122;29062021112504
150;122;29062021112504
151;122;29062021112504
152;120;29062021112504
153;119;29062021112504
154;121;29062021112504
155;123;29062021112504
156;121;29062021112504
157;120;29062021112504
158;119;29062021112504
159;118;29062021112504
160;120;29062021112504
161;119;29062021112504
162;121;29062021112504
163;122;29062021112504
164;121;29062021112504
165;122;29062021112504
166;119;29062021112504
167;122;29062021112504
168;124;29062021112504
169;118;29062021112504
170;122;29062021112504
171;120;29062021112504
172;120;29062021112504
173;123;29062021112504
174;119;29062021112504
175;119;29062021112504
176;121;29062021112504
177;120;29062021112504
178;124;29062021112504
179;121;29062021112504
180;119;29062021112504
181;121;29062021112504
182;123;29062021112504
183;119;29062021112504
184;122;29062021112504
185;117;29062021112504
186;122;29062021112504
187;121;29062021112504
188;120;29062021112504
189;122;29062021112504
190;119;29062021112504
191;122;29062021112504
192;124;29062021112504
193;120;29062021112504
194;123;29062021112504
195;122;29062021112504
196;120;29062021112504
197;120;29062021112504
198;122;29062021112504
199;120;29062021112504
200;0;29062021112504
0;0;29062021112505
1;137;29062021112505
2;123;29062021112505
3;119;29062021112505
4;121;29062021112505
5;121;29062021112505
6;120;29062021112505
7;123;29062021112505
8;124;29062021112505
9;119;29062021112505
10;123;29062021112505
11;121;29062021112505
12;120;29062021112505
13;122;29062021112505
14;120;29062021112505
15;123;29062021112505
16;121;29062021112505
17;118;29062021112505
18;121;29062021112505
19;122;29062021112505
20;121;29062021112505
21;119;29062021112505
22;117;29062021112505
23;121;29062021112505
24;122;29062021112505
25;120;29062021112505
26;122;29062021112505
27;119;29062021112505
28;120;29062021112505
29;124;29062021112505
30;120;29062021112505
31;118;29062021112505
32;122;29062021112505
33;120;29062021112505
34;122;29062021112505
35;120;29062021112505
36;118;29062021112505
37;123;29062021112505
38;118;29062021112505
39;121;29062021112505
40;119;29062021112505
41;118;29062021112505
42;121;29062021112505
43;120;29062021112505
44;121;29062021112505
45;126;29062021112505
46;122;29062021112505
47;120;29062021112505
48;120;29062021112505
49;117;29062021112505
50;121;29062021112505
51;120;29062021112505
52;119;29062021112505
53;120;29062021112505
54;117;29062021112505
55;117;29062021112505
56;119;29062021112505
57;118;29062021112505
58;122;29062021112505
59;121;29062021112505
60;121;29062021112505
61;123;29062021112505
62;121;29062021112505
63;120;29062021112505
64;125;29062021112505
65;118;29062021112505
66;120;29062021112505
67;118;29062021112505
68;119;29062021112505
69;121;29062021112505
70;121;29062021112505
71;117;29062021112505
72;121;29062021112505
73;119;29062021112505
74;120;29062021112505
75;120;29062021112505
76;120;29062021112505
77;120;29062021112505
78;121;29062021112505
79;124;29062021112505
80;122;29062021112505
81;118;29062021112505
82;121;29062021112505
83;119;29062021112505
84;119;29062021112505
85;121;29062021112505
86;121;29062021112505
87;123;29062021112505
88;120;29062021112505
89;117;29062021112505
90;123;29062021112505
91;119;29062021112505
92;119;29062021112505
93;123;29062021112505
94;120;29062021112505
95;118;29062021112505
96;120;29062021112505
97;119;29062021112505
98;118;29062021112505
99;121;29062021112505
100;117;29062021112505
101;124;29062021112505
102;122;29062021112505
103;119;29062021112505
104;121;29062021112505
105;118;29062021112505
106;121;29062021112505
107;119;29062021112505
108;120;29062021112505
109;121;29062021112505
110;116;29062021112505
111;117;29062021112505
112;120;29062021112505
113;117;29062021112505
114;118;29062021112505
115;120;29062021112505
116;119;29062021112505
117;122;29062021112505
118;118;29062021112505
119;121;29062021112505
120;119;29062021112505
121;117;29062021112505
122;119;29062021112505
123;118;29062021112505
124;120;29062021112505
125;120;29062021112505
126;117;29062021112505
127;121;29062021112505
128;123;29062021112505
129;120;29062021112505
130;120;29062021112505
131;120;29062021112505
132;118;29062021112505
133;126;29062021112505
134;118;29062021112505
135;120;29062021112505
136;120;29062021112505
137;118;29062021112505
138;122;29062021112505
139;119;29062021112505
140;119;29062021112505
141;122;29062021112505
142;120;29062021112505
143;117;29062021112505
144;121;29062021112505
145;119;29062021112505
146;121;29062021112505
147;123;29062021112505
148;121;29062021112505
149;121;29062021112505
150;122;29062021112505
151;122;29062021112505
152;120;29062021112505
153;119;29062021112505
154;121;29062021112505
155;123;29062021112505
156;120;29062021112505
157;119;29062021112505
158;119;29062021112505
159;119;29062021112505
160;120;29062021112505
161;120;29062021112505
162;121;29062021112505
163;121;29062021112505
164;122;29062021112505
165;123;29062021112505
166;119;29062021112505
167;121;29062021112505
168;124;29062021112505
169;117;29062021112505
170;122;29062021112505
171;120;29062021112505
172;120;29062021112505
173;123;29062021112505
174;119;29062021112505
175;120;29062021112505
176;122;29062021112505
177;119;29062021112505
178;124;29062021112505
179;120;29062021112505
180;119;29062021112505
181;121;29062021112505
182;123;29062021112505
183;120;29062021112505
184;121;29062021112505
185;117;29062021112505
186;122;29062021112505
187;120;29062021112505
188;121;29062021112505
189;121;29062021112505
190;120;29062021112505
191;122;29062021112505
192;124;29062021112505
193;119;29062021112505
194;123;29062021112505
195;120;29062021112505
196;120;29062021112505
197;121;29062021112505
198;122;29062021112505
199;119;29062021112505
200;0;29062021112505
0;0;29062021112505
1;138;29062021112505
2;124;29062021112505
3;120;29062021112505
4;122;29062021112505
5;122;29062021112505
6;120;29062021112505
7;124;29062021112505
8;124;29062021112505
9;120;29062021112505
10;123;29062021112505
11;123;29062021112505
12;120;29062021112505
13;124;29062021112505
14;122;29062021112505
15;123;29062021112505
16;122;29062021112505
17;120;29062021112505
18;122;29062021112505
19;123;29062021112505
20;121;29062021112505
21;120;29062021112505
22;119;29062021112505
23;121;29062021112505
24;124;29062021112505
25;121;29062021112505
26;123;29062021112505
27;121;29062021112505
28;120;29062021112505
29;125;29062021112505
30;122;29062021112505
31;119;29062021112505
32;123;29062021112505
33;119;29062021112505
34;122;29062021112505
35;121;29062021112505
36;120;29062021112505
37;124;29062021112505
38;120;29062021112505
39;122;29062021112505
40;122;29062021112505
41;118;29062021112505
42;121;29062021112505
43;121;29062021112505
44;121;29062021112505
45;128;29062021112505
46;123;29062021112505
47;121;29062021112505
48;120;29062021112505
49;119;29062021112505
50;120;29062021112505
51;121;29062021112505
52;120;29062021112505
53;122;29062021112505
54;119;29062021112505
55;119;29062021112505
56;120;29062021112505
57;119;29062021112505
58;120;29062021112505
59;121;29062021112505
60;122;29062021112505
61;122;29062021112505
62;121;29062021112505
63;122;29062021112505
64;125;29062021112505
65;118;29062021112505
66;121;29062021112505
67;120;29062021112505
68;120;29062021112505
69;122;29062021112505
70;121;29062021112505
71;119;29062021112505
72;122;29062021112505
73;119;29062021112505
74;122;29062021112505
75;121;29062021112505
76;120;29062021112505
77;121;29062021112505
78;121;29062021112505
79;125;29062021112505
80;122;29062021112505
81;118;29062021112505
82;122;29062021112505
83;121;29062021112505
84;121;29062021112505
85;122;29062021112505
86;123;29062021112505
87;123;29062021112505
88;121;29062021112505
89;117;29062021112505
90;124;29062021112505
91;119;29062021112505
92;120;29062021112505
93;123;29062021112505
94;122;29062021112505
95;121;29062021112505
96;122;29062021112505
97;121;29062021112505
98;119;29062021112505
99;121;29062021112505
100;119;29062021112505
101;124;29062021112505
102;123;29062021112505
103;120;29062021112505
104;121;29062021112505
105;119;29062021112505
106;121;29062021112505
107;120;29062021112505
108;121;29062021112505
109;121;29062021112505
110;118;29062021112505
111;118;29062021112505
112;120;29062021112505
113;118;29062021112505
114;118;29062021112505
115;121;29062021112505
116;121;29062021112505
117;123;29062021112505
118;119;29062021112505
119;122;29062021112505
120;119;29062021112505
121;119;29062021112505
122;121;29062021112505
123;120;29062021112505
124;121;29062021112505
125;121;29062021112505
126;118;29062021112505
127;122;29062021112505
128;125;29062021112505
129;120;29062021112505
130;120;29062021112505
131;121;29062021112505
132;118;29062021112505
133;127;29062021112505
134;120;29062021112505
135;120;29062021112505
136;122;29062021112505
137;120;29062021112505
138;123;29062021112505
139;121;29062021112505
140;120;29062021112505
141;123;29062021112505
142;120;29062021112505
143;119;29062021112505
144;122;29062021112505
145;120;29062021112505
146;122;29062021112505
147;125;29062021112505
148;121;29062021112505
149;122;29062021112505
150;123;29062021112505
151;123;29062021112505
152;120;29062021112505
153;120;29062021112505
154;122;29062021112505
155;123;29062021112505
156;120;29062021112505
157;121;29062021112505
158;120;29062021112505
159;120;29062021112505
160;121;29062021112505
161;120;29062021112505
162;121;29062021112505
163;123;29062021112505
164;122;29062021112505
165;124;29062021112505
166;120;29062021112505
167;122;29062021112505
168;124;29062021112505
169;119;29062021112505
170;122;29062021112505
171;121;29062021112505
172;119;29062021112505
173;124;29062021112505
174;120;29062021112505
175;121;29062021112505
176;123;29062021112505
177;119;29062021112505
178;124;29062021112505
179;122;29062021112505
180;121;29062021112505
181;121;29062021112505
182;124;29062021112505
183;121;29062021112505
184;121;29062021112505
185;119;29062021112505
186;124;29062021112505
187;121;29062021112505
188;121;29062021112505
189;123;29062021112505
190;120;29062021112505
191;123;29062021112505
192;125;29062021112505
193;121;29062021112505
194;124;29062021112505
195;122;29062021112505
196;121;29062021112505
197;122;29062021112505
198;123;29062021112505
199;119;29062021112505
200;0;29062021112505
0;0;29062021112506
1;137;29062021112506
2;123;29062021112506
3;120;29062021112506
4;122;29062021112506
5;122;29062021112506
6;120;29062021112506
7;122;29062021112506
8;123;29062021112506
9;118;29062021112506
10;123;29062021112506
11;121;29062021112506
12;119;29062021112506
13;123;29062021112506
14;121;29062021112506
15;121;29062021112506
16;121;29062021112506
17;119;29062021112506
18;122;29062021112506
19;121;29062021112506
20;120;29062021112506
21;119;29062021112506
22;118;29062021112506
23;120;29062021112506
24;122;29062021112506
25;119;29062021112506
26;121;29062021112506
27;119;29062021112506
28;120;29062021112506
29;124;29062021112506
30;121;29062021112506
31;119;29062021112506
32;122;29062021112506
33;119;29062021112506
34;122;29062021112506
35;120;29062021112506
36;120;29062021112506
37;122;29062021112506
38;118;29062021112506
39;121;29062021112506
40;120;29062021112506
41;117;29062021112506
42;121;29062021112506
43;120;29062021112506
44;121;29062021112506
45;127;29062021112506
46;122;29062021112506
47;121;29062021112506
48;119;29062021112506
49;118;29062021112506
50;120;29062021112506
51;120;29062021112506
52;119;29062021112506
53;120;29062021112506
54;118;29062021112506
55;118;29062021112506
56;119;29062021112506
57;118;29062021112506
58;121;29062021112506
59;121;29062021112506
60;121;29062021112506
61;122;29062021112506
62;121;29062021112506
63;120;29062021112506
64;124;29062021112506
65;118;29062021112506
66;121;29062021112506
67;119;29062021112506
68;119;29062021112506
69;121;29062021112506
70;121;29062021112506
71;119;29062021112506
72;120;29062021112506
73;118;29062021112506
74;121;29062021112506
75;120;29062021112506
76;119;29062021112506
77;120;29062021112506
78;120;29062021112506
79;125;29062021112506
80;121;29062021112506
81;117;29062021112506
82;122;29062021112506
83;119;29062021112506
84;118;29062021112506
85;121;29062021112506
86;121;29062021112506
87;122;29062021112506
88;121;29062021112506
89;117;29062021112506
90;122;29062021112506
91;118;29062021112506
92;118;29062021112506
93;122;29062021112506
94;121;29062021112506
95;118;29062021112506
96;121;29062021112506
97;119;29062021112506
98;119;29062021112506
99;119;29062021112506
100;117;29062021112506
101;124;29062021112506
102;122;29062021112506
103;119;29062021112506
104;120;29062021112506
105;117;29062021112506
106;120;29062021112506
107;118;29062021112506
108;120;29062021112506
109;121;29062021112506
110;118;29062021112506
111;118;29062021112506
112;119;29062021112506
113;117;29062021112506
114;118;29062021112506
115;120;29062021112506
116;119;29062021112506
117;121;29062021112506
118;119;29062021112506
119;121;29062021112506
120;119;29062021112506
121;119;29062021112506
122;119;29062021112506
123;119;29062021112506
124;120;29062021112506
125;120;29062021112506
126;118;29062021112506
127;120;29062021112506
128;123;29062021112506
129;120;29062021112506
130;120;29062021112506
131;120;29062021112506
132;117;29062021112506
133;126;29062021112506
134;118;29062021112506
135;119;29062021112506
136;121;29062021112506
137;119;29062021112506
138;122;29062021112506
139;120;29062021112506
140;119;29062021112506
141;122;29062021112506
142;121;29062021112506
143;118;29062021112506
144;121;29062021112506
145;119;29062021112506
146;121;29062021112506
147;122;29062021112506
148;119;29062021112506
149;121;29062021112506
150;122;29062021112506
151;122;29062021112506
152;121;29062021112506
153;119;29062021112506
154;121;29062021112506
155;124;29062021112506
156;121;29062021112506
157;120;29062021112506
158;119;29062021112506
159;119;29062021112506
160;120;29062021112506
161;119;29062021112506
162;122;29062021112506
163;122;29062021112506
164;121;29062021112506
165;122;29062021112506
166;120;29062021112506
167;121;29062021112506
168;124;29062021112506
169;119;29062021112506
170;122;29062021112506
171;120;29062021112506
172;120;29062021112506
173;123;29062021112506
174;120;29062021112506
175;121;29062021112506
176;122;29062021112506
177;120;29062021112506
178;124;29062021112506
179;121;29062021112506
180;119;29062021112506
181;120;29062021112506
182;123;29062021112506
183;120;29062021112506
184;121;29062021112506
185;119;29062021112506
186;123;29062021112506
187;121;29062021112506
188;120;29062021112506
189;122;29062021112506
190;120;29062021112506
191;123;29062021112506
192;124;29062021112506
193;120;29062021112506
194;124;29062021112506
195;120;29062021112506
196;120;29062021112506
197;121;29062021112506
198;121;29062021112506
199;120;29062021112506
200;0;29062021112506
