ind;val;datetime
0;0;30062021115603
1;145;30062021115603
2;156;30062021115603
3;155;30062021115603
4;156;30062021115603
5;160;30062021115603
6;159;30062021115603
7;164;30062021115603
8;167;30062021115603
9;170;30062021115603
10;176;30062021115603
11;182;30062021115603
12;184;30062021115603
13;198;30062021115603
14;210;30062021115603
15;231;30062021115603
16;263;30062021115603
17;328;30062021115603
18;455;30062021115603
19;718;30062021115603
20;1023;30062021115603
21;1023;30062021115603
22;1023;30062021115603
23;1023;30062021115603
24;1023;30062021115603
25;912;30062021115603
26;852;30062021115603
27;857;30062021115603
28;913;30062021115603
29;1023;30062021115603
30;1023;30062021115603
31;1023;30062021115603
32;1023;30062021115603
33;1023;30062021115603
34;1023;30062021115603
35;1023;30062021115603
36;1023;30062021115603
37;1023;30062021115603
38;1023;30062021115603
39;1023;30062021115603
40;1016;30062021115603
41;903;30062021115603
42;823;30062021115603
43;754;30062021115603
44;720;30062021115603
45;689;30062021115603
46;676;30062021115603
47;667;30062021115603
48;661;30062021115603
49;662;30062021115603
50;661;30062021115603
51;669;30062021115603
52;676;30062021115603
53;687;30062021115603
54;699;30062021115603
55;714;30062021115603
56;731;30062021115603
57;746;30062021115603
58;774;30062021115603
59;785;30062021115603
60;812;30062021115603
61;827;30062021115603
62;834;30062021115603
63;859;30062021115603
64;870;30062021115603
65;873;30062021115603
66;878;30062021115603
67;875;30062021115603
68;870;30062021115603
69;859;30062021115603
70;841;30062021115603
71;832;30062021115603
72;813;30062021115603
73;790;30062021115603
74;777;30062021115603
75;746;30062021115603
76;727;30062021115603
77;703;30062021115603
78;677;30062021115603
79;656;30062021115603
80;631;30062021115603
81;604;30062021115603
82;586;30062021115603
83;571;30062021115603
84;557;30062021115603
85;547;30062021115603
86;539;30062021115603
87;531;30062021115603
88;528;30062021115603
89;515;30062021115603
90;503;30062021115603
91;494;30062021115603
92;476;30062021115603
93;464;30062021115603
94;445;30062021115603
95;431;30062021115603
96;419;30062021115603
97;405;30062021115603
98;394;30062021115603
99;381;30062021115603
100;368;30062021115603
101;365;30062021115603
102;355;30062021115603
103;344;30062021115603
104;337;30062021115603
105;327;30062021115603
106;323;30062021115603
107;312;30062021115603
108;304;30062021115603
109;297;30062021115603
110;288;30062021115603
111;283;30062021115603
112;276;30062021115603
113;267;30062021115603
114;266;30062021115603
115;263;30062021115603
116;256;30062021115603
117;253;30062021115603
118;244;30062021115603
119;243;30062021115603
120;234;30062021115603
121;230;30062021115603
122;229;30062021115603
123;225;30062021115603
124;221;30062021115603
125;219;30062021115603
126;209;30062021115603
127;207;30062021115603
128;205;30062021115603
129;202;30062021115603
130;199;30062021115603
131;194;30062021115603
132;189;30062021115603
133;192;30062021115603
134;184;30062021115603
135;181;30062021115603
136;180;30062021115603
137;175;30062021115603
138;175;30062021115603
139;172;30062021115603
140;167;30062021115603
141;167;30062021115603
142;163;30062021115603
143;162;30062021115603
144;162;30062021115603
145;156;30062021115603
146;157;30062021115603
147;157;30062021115603
148;154;30062021115603
149;155;30062021115603
150;151;30062021115603
151;152;30062021115603
152;151;30062021115603
153;146;30062021115603
154;149;30062021115603
155;146;30062021115603
156;144;30062021115603
157;144;30062021115603
158;142;30062021115603
159;141;30062021115603
160;142;30062021115603
161;139;30062021115603
162;141;30062021115603
163;139;30062021115603
164;139;30062021115603
165;139;30062021115603
166;137;30062021115603
167;137;30062021115603
168;137;30062021115603
169;132;30062021115603
170;136;30062021115603
171;134;30062021115603
172;133;30062021115603
173;133;30062021115603
174;133;30062021115603
175;131;30062021115603
176;132;30062021115603
177;130;30062021115603
178;133;30062021115603
179;131;30062021115603
180;129;30062021115603
181;131;30062021115603
182;130;30062021115603
183;129;30062021115603
184;130;30062021115603
185;127;30062021115603
186;131;30062021115603
187;129;30062021115603
188;126;30062021115603
189;129;30062021115603
190;127;30062021115603
191;127;30062021115603
192;130;30062021115603
193;127;30062021115603
194;128;30062021115603
195;127;30062021115603
196;126;30062021115603
197;127;30062021115603
198;127;30062021115603
199;125;30062021115603
200;0;30062021115603
0;0;30062021115604
1;144;30062021115604
2;156;30062021115604
3;156;30062021115604
4;157;30062021115604
5;161;30062021115604
6;160;30062021115604
7;164;30062021115604
8;167;30062021115604
9;167;30062021115604
10;177;30062021115604
11;181;30062021115604
12;186;30062021115604
13;197;30062021115604
14;210;30062021115604
15;234;30062021115604
16;266;30062021115604
17;325;30062021115604
18;461;30062021115604
19;725;30062021115604
20;1023;30062021115604
21;1023;30062021115604
22;1023;30062021115604
23;1023;30062021115604
24;1023;30062021115604
25;908;30062021115604
26;846;30062021115604
27;851;30062021115604
28;903;30062021115604
29;1023;30062021115604
30;1023;30062021115604
31;1023;30062021115604
32;1023;30062021115604
33;1023;30062021115604
34;1023;30062021115604
35;1023;30062021115604
36;1023;30062021115604
37;1023;30062021115604
38;1023;30062021115604
39;1023;30062021115604
40;1023;30062021115604
41;912;30062021115604
42;833;30062021115604
43;755;30062021115604
44;721;30062021115604
45;694;30062021115604
46;680;30062021115604
47;666;30062021115604
48;666;30062021115604
49;662;30062021115604
50;663;30062021115604
51;671;30062021115604
52;674;30062021115604
53;690;30062021115604
54;706;30062021115604
55;721;30062021115604
56;734;30062021115604
57;758;30062021115604
58;778;30062021115604
59;792;30062021115604
60;814;30062021115604
61;829;30062021115604
62;848;30062021115604
63;867;30062021115604
64;872;30062021115604
65;876;30062021115604
66;882;30062021115604
67;881;30062021115604
68;871;30062021115604
69;869;30062021115604
70;853;30062021115604
71;834;30062021115604
72;819;30062021115604
73;799;30062021115604
74;780;30062021115604
75;747;30062021115604
76;731;30062021115604
77;709;30062021115604
78;680;30062021115604
79;658;30062021115604
80;636;30062021115604
81;607;30062021115604
82;600;30062021115604
83;574;30062021115604
84;566;30062021115604
85;549;30062021115604
86;544;30062021115604
87;541;30062021115604
88;532;30062021115604
89;516;30062021115604
90;504;30062021115604
91;496;30062021115604
92;476;30062021115604
93;467;30062021115604
94;448;30062021115604
95;432;30062021115604
96;422;30062021115604
97;409;30062021115604
98;399;30062021115604
99;385;30062021115604
100;374;30062021115604
101;368;30062021115604
102;355;30062021115604
103;344;30062021115604
104;340;30062021115604
105;328;30062021115604
106;324;30062021115604
107;310;30062021115604
108;306;30062021115604
109;298;30062021115604
110;289;30062021115604
111;282;30062021115604
112;279;30062021115604
113;269;30062021115604
114;265;30062021115604
115;263;30062021115604
116;257;30062021115604
117;256;30062021115604
118;249;30062021115604
119;244;30062021115604
120;239;30062021115604
121;233;30062021115604
122;233;30062021115604
123;226;30062021115604
124;223;30062021115604
125;220;30062021115604
126;211;30062021115604
127;208;30062021115604
128;206;30062021115604
129;199;30062021115604
130;199;30062021115604
131;194;30062021115604
132;189;30062021115604
133;190;30062021115604
134;184;30062021115604
135;182;30062021115604
136;181;30062021115604
137;174;30062021115604
138;174;30062021115604
139;171;30062021115604
140;168;30062021115604
141;167;30062021115604
142;164;30062021115604
143;161;30062021115604
144;162;30062021115604
145;157;30062021115604
146;159;30062021115604
147;157;30062021115604
148;154;30062021115604
149;154;30062021115604
150;149;30062021115604
151;150;30062021115604
152;150;30062021115604
153;147;30062021115604
154;148;30062021115604
155;146;30062021115604
156;144;30062021115604
157;144;30062021115604
158;141;30062021115604
159;141;30062021115604
160;142;30062021115604
161;139;30062021115604
162;140;30062021115604
163;138;30062021115604
164;137;30062021115604
165;139;30062021115604
166;135;30062021115604
167;137;30062021115604
168;138;30062021115604
169;133;30062021115604
170;135;30062021115604
171;134;30062021115604
172;131;30062021115604
173;133;30062021115604
174;131;30062021115604
175;130;30062021115604
176;131;30062021115604
177;128;30062021115604
178;132;30062021115604
179;130;30062021115604
180;129;30062021115604
181;131;30062021115604
182;131;30062021115604
183;128;30062021115604
184;128;30062021115604
185;126;30062021115604
186;130;30062021115604
187;128;30062021115604
188;126;30062021115604
189;127;30062021115604
190;125;30062021115604
191;127;30062021115604
192;129;30062021115604
193;126;30062021115604
194;127;30062021115604
195;127;30062021115604
196;126;30062021115604
197;126;30062021115604
198;126;30062021115604
199;124;30062021115604
200;0;30062021115604
0;0;30062021115605
1;144;30062021115605
2;156;30062021115605
3;155;30062021115605
4;158;30062021115605
5;160;30062021115605
6;160;30062021115605
7;164;30062021115605
8;168;30062021115605
9;169;30062021115605
10;175;30062021115605
11;177;30062021115605
12;187;30062021115605
13;198;30062021115605
14;210;30062021115605
15;231;30062021115605
16;267;30062021115605
17;328;30062021115605
18;456;30062021115605
19;728;30062021115605
20;1023;30062021115605
21;1023;30062021115605
22;1023;30062021115605
23;1023;30062021115605
24;1023;30062021115605
25;906;30062021115605
26;846;30062021115605
27;847;30062021115605
28;904;30062021115605
29;1023;30062021115605
30;1023;30062021115605
31;1023;30062021115605
32;1023;30062021115605
33;1023;30062021115605
34;1023;30062021115605
35;1023;30062021115605
36;1023;30062021115605
37;1023;30062021115605
38;1023;30062021115605
39;1023;30062021115605
40;1020;30062021115605
41;916;30062021115605
42;828;30062021115605
43;760;30062021115605
44;726;30062021115605
45;693;30062021115605
46;677;30062021115605
47;664;30062021115605
48;667;30062021115605
49;664;30062021115605
50;665;30062021115605
51;675;30062021115605
52;676;30062021115605
53;691;30062021115605
54;708;30062021115605
55;715;30062021115605
56;737;30062021115605
57;753;30062021115605
58;780;30062021115605
59;794;30062021115605
60;818;30062021115605
61;835;30062021115605
62;845;30062021115605
63;867;30062021115605
64;874;30062021115605
65;880;30062021115605
66;884;30062021115605
67;883;30062021115605
68;873;30062021115605
69;867;30062021115605
70;849;30062021115605
71;837;30062021115605
72;828;30062021115605
73;792;30062021115605
74;777;30062021115605
75;748;30062021115605
76;728;30062021115605
77;708;30062021115605
78;684;30062021115605
79;660;30062021115605
80;632;30062021115605
81;609;30062021115605
82;591;30062021115605
83;573;30062021115605
84;565;30062021115605
85;553;30062021115605
86;548;30062021115605
87;544;30062021115605
88;528;30062021115605
89;517;30062021115605
90;507;30062021115605
91;497;30062021115605
92;476;30062021115605
93;466;30062021115605
94;448;30062021115605
95;430;30062021115605
96;420;30062021115605
97;406;30062021115605
98;396;30062021115605
99;386;30062021115605
100;375;30062021115605
101;369;30062021115605
102;355;30062021115605
103;347;30062021115605
104;338;30062021115605
105;329;30062021115605
106;325;30062021115605
107;316;30062021115605
108;307;30062021115605
109;299;30062021115605
110;290;30062021115605
111;283;30062021115605
112;277;30062021115605
113;269;30062021115605
114;266;30062021115605
115;265;30062021115605
116;258;30062021115605
117;256;30062021115605
118;247;30062021115605
119;243;30062021115605
120;238;30062021115605
121;233;30062021115605
122;229;30062021115605
123;227;30062021115605
124;221;30062021115605
125;218;30062021115605
126;212;30062021115605
127;209;30062021115605
128;205;30062021115605
129;200;30062021115605
130;198;30062021115605
131;195;30062021115605
132;188;30062021115605
133;189;30062021115605
134;183;30062021115605
135;181;30062021115605
136;181;30062021115605
137;174;30062021115605
138;176;30062021115605
139;171;30062021115605
140;168;30062021115605
141;169;30062021115605
142;165;30062021115605
143;162;30062021115605
144;164;30062021115605
145;158;30062021115605
146;159;30062021115605
147;157;30062021115605
148;154;30062021115605
149;153;30062021115605
150;151;30062021115605
151;150;30062021115605
152;149;30062021115605
153;147;30062021115605
154;148;30062021115605
155;146;30062021115605
156;143;30062021115605
157;144;30062021115605
158;142;30062021115605
159;140;30062021115605
160;141;30062021115605
161;140;30062021115605
162;140;30062021115605
163;139;30062021115605
164;137;30062021115605
165;137;30062021115605
166;136;30062021115605
167;136;30062021115605
168;136;30062021115605
169;133;30062021115605
170;135;30062021115605
171;134;30062021115605
172;132;30062021115605
173;133;30062021115605
174;131;30062021115605
175;130;30062021115605
176;131;30062021115605
177;130;30062021115605
178;132;30062021115605
179;130;30062021115605
180;128;30062021115605
181;131;30062021115605
182;130;30062021115605
183;129;30062021115605
184;129;30062021115605
185;126;30062021115605
186;129;30062021115605
187;128;30062021115605
188;126;30062021115605
189;128;30062021115605
190;126;30062021115605
191;127;30062021115605
192;130;30062021115605
193;126;30062021115605
194;127;30062021115605
195;127;30062021115605
196;125;30062021115605
197;127;30062021115605
198;127;30062021115605
199;125;30062021115605
200;0;30062021115605
0;0;30062021115606
1;145;30062021115606
2;157;30062021115606
3;153;30062021115606
4;157;30062021115606
5;159;30062021115606
6;158;30062021115606
7;161;30062021115606
8;167;30062021115606
9;169;30062021115606
10;176;30062021115606
11;180;30062021115606
12;186;30062021115606
13;199;30062021115606
14;209;30062021115606
15;231;30062021115606
16;264;30062021115606
17;325;30062021115606
18;463;30062021115606
19;727;30062021115606
20;1023;30062021115606
21;1023;30062021115606
22;1023;30062021115606
23;1023;30062021115606
24;1023;30062021115606
25;904;30062021115606
26;842;30062021115606
27;843;30062021115606
28;901;30062021115606
29;1023;30062021115606
30;1023;30062021115606
31;1023;30062021115606
32;1023;30062021115606
33;1023;30062021115606
34;1023;30062021115606
35;1023;30062021115606
36;1023;30062021115606
37;1023;30062021115606
38;1023;30062021115606
39;1023;30062021115606
40;1023;30062021115606
41;916;30062021115606
42;834;30062021115606
43;766;30062021115606
44;725;30062021115606
45;693;30062021115606
46;680;30062021115606
47;665;30062021115606
48;660;30062021115606
49;665;30062021115606
50;665;30062021115606
51;673;30062021115606
52;671;30062021115606
53;695;30062021115606
54;702;30062021115606
55;715;30062021115606
56;739;30062021115606
57;753;30062021115606
58;774;30062021115606
59;796;30062021115606
60;814;30062021115606
61;835;30062021115606
62;848;30062021115606
63;866;30062021115606
64;871;30062021115606
65;877;30062021115606
66;878;30062021115606
67;881;30062021115606
68;872;30062021115606
69;863;30062021115606
70;846;30062021115606
71;838;30062021115606
72;823;30062021115606
73;796;30062021115606
74;778;30062021115606
75;748;30062021115606
76;723;30062021115606
77;710;30062021115606
78;681;30062021115606
79;662;30062021115606
80;634;30062021115606
81;605;30062021115606
82;595;30062021115606
83;575;30062021115606
84;565;30062021115606
85;549;30062021115606
86;545;30062021115606
87;539;30062021115606
88;529;30062021115606
89;514;30062021115606
90;507;30062021115606
91;496;30062021115606
92;479;30062021115606
93;465;30062021115606
94;451;30062021115606
95;430;30062021115606
96;422;30062021115606
97;406;30062021115606
98;399;30062021115606
99;388;30062021115606
100;374;30062021115606
101;368;30062021115606
102;357;30062021115606
103;345;30062021115606
104;339;30062021115606
105;332;30062021115606
106;325;30062021115606
107;314;30062021115606
108;308;30062021115606
109;300;30062021115606
110;291;30062021115606
111;285;30062021115606
112;280;30062021115606
113;268;30062021115606
114;267;30062021115606
115;262;30062021115606
116;257;30062021115606
117;255;30062021115606
118;249;30062021115606
119;247;30062021115606
120;238;30062021115606
121;233;30062021115606
122;232;30062021115606
123;227;30062021115606
124;221;30062021115606
125;218;30062021115606
126;212;30062021115606
127;208;30062021115606
128;207;30062021115606
129;200;30062021115606
130;198;30062021115606
131;196;30062021115606
132;190;30062021115606
133;191;30062021115606
134;184;30062021115606
135;181;30062021115606
136;179;30062021115606
137;174;30062021115606
138;175;30062021115606
139;171;30062021115606
140;169;30062021115606
141;169;30062021115606
142;166;30062021115606
143;162;30062021115606
144;161;30062021115606
145;158;30062021115606
146;158;30062021115606
147;156;30062021115606
148;154;30062021115606
149;153;30062021115606
150;150;30062021115606
151;150;30062021115606
152;148;30062021115606
153;147;30062021115606
154;148;30062021115606
155;147;30062021115606
156;144;30062021115606
157;143;30062021115606
158;141;30062021115606
159;141;30062021115606
160;141;30062021115606
161;139;30062021115606
162;139;30062021115606
163;138;30062021115606
164;137;30062021115606
165;138;30062021115606
166;137;30062021115606
167;136;30062021115606
168;136;30062021115606
169;132;30062021115606
170;136;30062021115606
171;134;30062021115606
172;132;30062021115606
173;132;30062021115606
174;131;30062021115606
175;129;30062021115606
176;133;30062021115606
177;130;30062021115606
178;131;30062021115606
179;130;30062021115606
180;129;30062021115606
181;131;30062021115606
182;130;30062021115606
183;128;30062021115606
184;129;30062021115606
185;126;30062021115606
186;130;30062021115606
187;128;30062021115606
188;127;30062021115606
189;128;30062021115606
190;127;30062021115606
191;126;30062021115606
192;130;30062021115606
193;126;30062021115606
194;126;30062021115606
195;127;30062021115606
196;126;30062021115606
197;128;30062021115606
198;126;30062021115606
199;125;30062021115606
200;0;30062021115606
0;0;30062021115607
1;145;30062021115607
2;155;30062021115607
3;154;30062021115607
4;158;30062021115607
5;158;30062021115607
6;160;30062021115607
7;163;30062021115607
8;166;30062021115607
9;170;30062021115607
10;177;30062021115607
11;179;30062021115607
12;184;30062021115607
13;198;30062021115607
14;209;30062021115607
15;231;30062021115607
16;266;30062021115607
17;324;30062021115607
18;455;30062021115607
19;721;30062021115607
20;1023;30062021115607
21;1023;30062021115607
22;1023;30062021115607
23;1023;30062021115607
24;1023;30062021115607
25;912;30062021115607
26;849;30062021115607
27;857;30062021115607
28;906;30062021115607
29;1023;30062021115607
30;1023;30062021115607
31;1023;30062021115607
32;1023;30062021115607
33;1023;30062021115607
34;1023;30062021115607
35;1023;30062021115607
36;1023;30062021115607
37;1023;30062021115607
38;1023;30062021115607
39;1023;30062021115607
40;1022;30062021115607
41;909;30062021115607
42;827;30062021115607
43;755;30062021115607
44;717;30062021115607
45;693;30062021115607
46;668;30062021115607
47;660;30062021115607
48;656;30062021115607
49;656;30062021115607
50;661;30062021115607
51;671;30062021115607
52;667;30062021115607
53;688;30062021115607
54;699;30062021115607
55;712;30062021115607
56;730;30062021115607
57;744;30062021115607
58;768;30062021115607
59;785;30062021115607
60;814;30062021115607
61;830;30062021115607
62;833;30062021115607
63;855;30062021115607
64;865;30062021115607
65;875;30062021115607
66;877;30062021115607
67;870;30062021115607
68;866;30062021115607
69;858;30062021115607
70;843;30062021115607
71;833;30062021115607
72;821;30062021115607
73;786;30062021115607
74;776;30062021115607
75;740;30062021115607
76;722;30062021115607
77;702;30062021115607
78;677;30062021115607
79;654;30062021115607
80;631;30062021115607
81;604;30062021115607
82;590;30062021115607
83;571;30062021115607
84;557;30062021115607
85;547;30062021115607
86;540;30062021115607
87;531;30062021115607
88;525;30062021115607
89;511;30062021115607
90;508;30062021115607
91;495;30062021115607
92;472;30062021115607
93;462;30062021115607
94;446;30062021115607
95;425;30062021115607
96;422;30062021115607
97;407;30062021115607
98;393;30062021115607
99;381;30062021115607
100;372;30062021115607
101;368;30062021115607
102;356;30062021115607
103;345;30062021115607
104;339;30062021115607
105;329;30062021115607
106;323;30062021115607
107;312;30062021115607
108;305;30062021115607
109;299;30062021115607
110;288;30062021115607
111;285;30062021115607
112;276;30062021115607
113;267;30062021115607
114;268;30062021115607
115;264;30062021115607
116;255;30062021115607
117;254;30062021115607
118;245;30062021115607
119;242;30062021115607
120;237;30062021115607
121;232;30062021115607
122;229;30062021115607
123;224;30062021115607
124;223;30062021115607
125;217;30062021115607
126;210;30062021115607
127;208;30062021115607
128;205;30062021115607
129;198;30062021115607
130;197;30062021115607
131;193;30062021115607
132;191;30062021115607
133;191;30062021115607
134;184;30062021115607
135;180;30062021115607
136;180;30062021115607
137;175;30062021115607
138;175;30062021115607
139;171;30062021115607
140;168;30062021115607
141;169;30062021115607
142;164;30062021115607
143;161;30062021115607
144;161;30062021115607
145;155;30062021115607
146;159;30062021115607
147;156;30062021115607
148;153;30062021115607
149;153;30062021115607
150;151;30062021115607
151;150;30062021115607
152;149;30062021115607
153;145;30062021115607
154;148;30062021115607
155;144;30062021115607
156;143;30062021115607
157;143;30062021115607
158;142;30062021115607
159;140;30062021115607
160;142;30062021115607
161;140;30062021115607
162;139;30062021115607
163;139;30062021115607
164;138;30062021115607
165;138;30062021115607
166;136;30062021115607
167;135;30062021115607
168;136;30062021115607
169;133;30062021115607
170;133;30062021115607
171;134;30062021115607
172;132;30062021115607
173;134;30062021115607
174;132;30062021115607
175;131;30062021115607
176;132;30062021115607
177;129;30062021115607
178;132;30062021115607
179;131;30062021115607
180;130;30062021115607
181;130;30062021115607
182;130;30062021115607
183;128;30062021115607
184;129;30062021115607
185;126;30062021115607
186;130;30062021115607
187;128;30062021115607
188;127;30062021115607
189;128;30062021115607
190;126;30062021115607
191;127;30062021115607
192;129;30062021115607
193;126;30062021115607
194;128;30062021115607
195;127;30062021115607
196;125;30062021115607
197;126;30062021115607
198;126;30062021115607
199;126;30062021115607
200;0;30062021115607
0;0;30062021115608
1;144;30062021115608
2;156;30062021115608
3;155;30062021115608
4;158;30062021115608
5;160;30062021115608
6;160;30062021115608
7;163;30062021115608
8;168;30062021115608
9;169;30062021115608
10;176;30062021115608
11;180;30062021115608
12;187;30062021115608
13;198;30062021115608
14;209;30062021115608
15;231;30062021115608
16;263;30062021115608
17;327;30062021115608
18;460;30062021115608
19;723;30062021115608
20;1023;30062021115608
21;1023;30062021115608
22;1023;30062021115608
23;1023;30062021115608
24;1023;30062021115608
25;903;30062021115608
26;842;30062021115608
27;844;30062021115608
28;898;30062021115608
29;1020;30062021115608
30;1023;30062021115608
31;1023;30062021115608
32;1023;30062021115608
33;1023;30062021115608
34;1023;30062021115608
35;1023;30062021115608
36;1023;30062021115608
37;1023;30062021115608
38;1023;30062021115608
39;1023;30062021115608
40;1023;30062021115608
41;916;30062021115608
42;833;30062021115608
43;761;30062021115608
44;724;30062021115608
45;698;30062021115608
46;677;30062021115608
47;668;30062021115608
48;662;30062021115608
49;660;30062021115608
50;668;30062021115608
51;670;30062021115608
52;670;30062021115608
53;689;30062021115608
54;703;30062021115608
55;716;30062021115608
56;731;30062021115608
57;753;30062021115608
58;776;30062021115608
59;791;30062021115608
60;816;30062021115608
61;835;30062021115608
62;842;30062021115608
63;860;30062021115608
64;869;30062021115608
65;876;30062021115608
66;880;30062021115608
67;880;30062021115608
68;870;30062021115608
69;862;30062021115608
70;847;30062021115608
71;834;30062021115608
72;822;30062021115608
73;793;30062021115608
74;779;30062021115608
75;749;30062021115608
76;726;30062021115608
77;708;30062021115608
78;686;30062021115608
79;658;30062021115608
80;630;30062021115608
81;609;30062021115608
82;594;30062021115608
83;576;30062021115608
84;566;30062021115608
85;551;30062021115608
86;547;30062021115608
87;538;30062021115608
88;529;30062021115608
89;519;30062021115608
90;505;30062021115608
91;493;30062021115608
92;476;30062021115608
93;464;30062021115608
94;448;30062021115608
95;432;30062021115608
96;422;30062021115608
97;404;30062021115608
98;395;30062021115608
99;386;30062021115608
100;373;30062021115608
101;370;30062021115608
102;354;30062021115608
103;347;30062021115608
104;339;30062021115608
105;328;30062021115608
106;325;30062021115608
107;314;30062021115608
108;306;30062021115608
109;300;30062021115608
110;291;30062021115608
111;284;30062021115608
112;280;30062021115608
113;271;30062021115608
114;265;30062021115608
115;263;30062021115608
116;256;30062021115608
117;255;30062021115608
118;249;30062021115608
119;244;30062021115608
120;238;30062021115608
121;232;30062021115608
122;231;30062021115608
123;227;30062021115608
124;221;30062021115608
125;219;30062021115608
126;212;30062021115608
127;208;30062021115608
128;206;30062021115608
129;200;30062021115608
130;196;30062021115608
131;197;30062021115608
132;190;30062021115608
133;190;30062021115608
134;183;30062021115608
135;180;30062021115608
136;179;30062021115608
137;175;30062021115608
138;176;30062021115608
139;172;30062021115608
140;167;30062021115608
141;169;30062021115608
142;164;30062021115608
143;162;30062021115608
144;161;30062021115608
145;157;30062021115608
146;159;30062021115608
147;156;30062021115608
148;153;30062021115608
149;153;30062021115608
150;151;30062021115608
151;149;30062021115608
152;149;30062021115608
153;147;30062021115608
154;149;30062021115608
155;146;30062021115608
156;144;30062021115608
157;144;30062021115608
158;142;30062021115608
159;140;30062021115608
160;142;30062021115608
161;139;30062021115608
162;140;30062021115608
163;139;30062021115608
164;138;30062021115608
165;139;30062021115608
166;135;30062021115608
167;135;30062021115608
168;135;30062021115608
169;132;30062021115608
170;135;30062021115608
171;134;30062021115608
172;132;30062021115608
173;132;30062021115608
174;131;30062021115608
175;130;30062021115608
176;132;30062021115608
177;129;30062021115608
178;132;30062021115608
179;130;30062021115608
180;129;30062021115608
181;129;30062021115608
182;130;30062021115608
183;128;30062021115608
184;128;30062021115608
185;126;30062021115608
186;129;30062021115608
187;128;30062021115608
188;126;30062021115608
189;128;30062021115608
190;126;30062021115608
191;126;30062021115608
192;129;30062021115608
193;127;30062021115608
194;127;30062021115608
195;126;30062021115608
196;125;30062021115608
197;127;30062021115608
198;126;30062021115608
199;125;30062021115608
200;0;30062021115608
0;0;30062021115608
1;144;30062021115608
2;155;30062021115608
3;155;30062021115608
4;157;30062021115608
5;159;30062021115608
6;159;30062021115608
7;164;30062021115608
8;168;30062021115608
9;170;30062021115608
10;178;30062021115608
11;181;30062021115608
12;186;30062021115608
13;199;30062021115608
14;211;30062021115608
15;232;30062021115608
16;265;30062021115608
17;328;30062021115608
18;463;30062021115608
19;724;30062021115608
20;1023;30062021115608
21;1023;30062021115608
22;1023;30062021115608
23;1023;30062021115608
24;1023;30062021115608
25;908;30062021115608
26;845;30062021115608
27;845;30062021115608
28;900;30062021115608
29;1017;30062021115608
30;1023;30062021115608
31;1023;30062021115608
32;1023;30062021115608
33;1023;30062021115608
34;1023;30062021115608
35;1023;30062021115608
36;1023;30062021115608
37;1023;30062021115608
38;1023;30062021115608
39;1023;30062021115608
40;1023;30062021115608
41;918;30062021115608
42;838;30062021115608
43;767;30062021115608
44;722;30062021115608
45;697;30062021115608
46;677;30062021115608
47;664;30062021115608
48;670;30062021115608
49;662;30062021115608
50;664;30062021115608
51;678;30062021115608
52;679;30062021115608
53;689;30062021115608
54;707;30062021115608
55;718;30062021115608
56;736;30062021115608
57;757;30062021115608
58;779;30062021115608
59;795;30062021115608
60;820;30062021115608
61;833;30062021115608
62;845;30062021115608
63;863;30062021115608
64;871;30062021115608
65;878;30062021115608
66;882;30062021115608
67;881;30062021115608
68;875;30062021115608
69;864;30062021115608
70;850;30062021115608
71;834;30062021115608
72;822;30062021115608
73;795;30062021115608
74;783;30062021115608
75;746;30062021115608
76;732;30062021115608
77;708;30062021115608
78;682;30062021115608
79;657;30062021115608
80;632;30062021115608
81;610;30062021115608
82;601;30062021115608
83;577;30062021115608
84;565;30062021115608
85;549;30062021115608
86;545;30062021115608
87;536;30062021115608
88;533;30062021115608
89;517;30062021115608
90;510;30062021115608
91;497;30062021115608
92;477;30062021115608
93;464;30062021115608
94;450;30062021115608
95;432;30062021115608
96;423;30062021115608
97;410;30062021115608
98;399;30062021115608
99;384;30062021115608
100;372;30062021115608
101;370;30062021115608
102;357;30062021115608
103;350;30062021115608
104;340;30062021115608
105;329;30062021115608
106;324;30062021115608
107;317;30062021115608
108;307;30062021115608
109;299;30062021115608
110;291;30062021115608
111;285;30062021115608
112;282;30062021115608
113;271;30062021115608
114;267;30062021115608
115;260;30062021115608
116;260;30062021115608
117;258;30062021115608
118;249;30062021115608
119;245;30062021115608
120;238;30062021115608
121;234;30062021115608
122;230;30062021115608
123;227;30062021115608
124;221;30062021115608
125;217;30062021115608
126;213;30062021115608
127;209;30062021115608
128;208;30062021115608
129;200;30062021115608
130;195;30062021115608
131;195;30062021115608
132;190;30062021115608
133;190;30062021115608
134;183;30062021115608
135;181;30062021115608
136;182;30062021115608
137;176;30062021115608
138;175;30062021115608
139;171;30062021115608
140;169;30062021115608
141;170;30062021115608
142;164;30062021115608
143;161;30062021115608
144;163;30062021115608
145;158;30062021115608
146;159;30062021115608
147;158;30062021115608
148;153;30062021115608
149;151;30062021115608
150;150;30062021115608
151;152;30062021115608
152;150;30062021115608
153;145;30062021115608
154;148;30062021115608
155;144;30062021115608
156;143;30062021115608
157;142;30062021115608
158;142;30062021115608
159;141;30062021115608
160;142;30062021115608
161;139;30062021115608
162;139;30062021115608
163;139;30062021115608
164;138;30062021115608
165;139;30062021115608
166;136;30062021115608
167;136;30062021115608
168;136;30062021115608
169;133;30062021115608
170;134;30062021115608
171;134;30062021115608
172;131;30062021115608
173;133;30062021115608
174;132;30062021115608
175;131;30062021115608
176;131;30062021115608
177;129;30062021115608
178;132;30062021115608
179;130;30062021115608
180;129;30062021115608
181;130;30062021115608
182;129;30062021115608
183;128;30062021115608
184;128;30062021115608
185;126;30062021115608
186;131;30062021115608
187;128;30062021115608
188;126;30062021115608
189;128;30062021115608
190;126;30062021115608
191;127;30062021115608
192;129;30062021115608
193;126;30062021115608
194;126;30062021115608
195;127;30062021115608
196;125;30062021115608
197;126;30062021115608
198;126;30062021115608
199;125;30062021115608
200;0;30062021115608
0;0;30062021115609
1;144;30062021115609
2;156;30062021115609
3;154;30062021115609
4;157;30062021115609
5;159;30062021115609
6;159;30062021115609
7;164;30062021115609
8;167;30062021115609
9;168;30062021115609
10;176;30062021115609
11;179;30062021115609
12;186;30062021115609
13;198;30062021115609
14;210;30062021115609
15;232;30062021115609
16;266;30062021115609
17;326;30062021115609
18;457;30062021115609
19;724;30062021115609
20;1023;30062021115609
21;1023;30062021115609
22;1023;30062021115609
23;1023;30062021115609
24;1023;30062021115609
25;901;30062021115609
26;839;30062021115609
27;840;30062021115609
28;895;30062021115609
29;1013;30062021115609
30;1023;30062021115609
31;1023;30062021115609
32;1023;30062021115609
33;1023;30062021115609
34;1023;30062021115609
35;1023;30062021115609
36;1023;30062021115609
37;1023;30062021115609
38;1023;30062021115609
39;1023;30062021115609
40;1023;30062021115609
41;919;30062021115609
42;836;30062021115609
43;767;30062021115609
44;725;30062021115609
45;696;30062021115609
46;680;30062021115609
47;671;30062021115609
48;663;30062021115609
49;664;30062021115609
50;666;30062021115609
51;673;30062021115609
52;678;30062021115609
53;694;30062021115609
54;705;30062021115609
55;720;30062021115609
56;735;30062021115609
57;756;30062021115609
58;778;30062021115609
59;793;30062021115609
60;812;30062021115609
61;829;30062021115609
62;847;30062021115609
63;864;30062021115609
64;872;30062021115609
65;875;30062021115609
66;880;30062021115609
67;886;30062021115609
68;873;30062021115609
69;863;30062021115609
70;849;30062021115609
71;837;30062021115609
72;827;30062021115609
73;794;30062021115609
74;778;30062021115609
75;748;30062021115609
76;731;30062021115609
77;709;30062021115609
78;689;30062021115609
79;656;30062021115609
80;635;30062021115609
81;610;30062021115609
82;599;30062021115609
83;573;30062021115609
84;565;30062021115609
85;554;30062021115609
86;545;30062021115609
87;535;30062021115609
88;532;30062021115609
89;520;30062021115609
90;510;30062021115609
91;492;30062021115609
92;478;30062021115609
93;468;30062021115609
94;446;30062021115609
95;434;30062021115609
96;422;30062021115609
97;409;30062021115609
98;397;30062021115609
99;388;30062021115609
100;377;30062021115609
101;371;30062021115609
102;355;30062021115609
103;349;30062021115609
104;340;30062021115609
105;329;30062021115609
106;323;30062021115609
107;315;30062021115609
108;306;30062021115609
109;300;30062021115609
110;290;30062021115609
111;286;30062021115609
112;278;30062021115609
113;268;30062021115609
114;266;30062021115609
115;263;30062021115609
116;261;30062021115609
117;256;30062021115609
118;246;30062021115609
119;244;30062021115609
120;237;30062021115609
121;233;30062021115609
122;230;30062021115609
123;227;30062021115609
124;221;30062021115609
125;216;30062021115609
126;210;30062021115609
127;206;30062021115609
128;205;30062021115609
129;200;30062021115609
130;199;30062021115609
131;195;30062021115609
132;190;30062021115609
133;190;30062021115609
134;185;30062021115609
135;181;30062021115609
136;180;30062021115609
137;175;30062021115609
138;174;30062021115609
139;171;30062021115609
140;168;30062021115609
141;168;30062021115609
142;163;30062021115609
143;162;30062021115609
144;162;30062021115609
145;157;30062021115609
146;159;30062021115609
147;156;30062021115609
148;154;30062021115609
149;153;30062021115609
150;151;30062021115609
151;150;30062021115609
152;150;30062021115609
153;146;30062021115609
154;147;30062021115609
155;145;30062021115609
156;144;30062021115609
157;144;30062021115609
158;141;30062021115609
159;141;30062021115609
160;141;30062021115609
161;138;30062021115609
162;140;30062021115609
163;139;30062021115609
164;138;30062021115609
165;139;30062021115609
166;135;30062021115609
167;135;30062021115609
168;136;30062021115609
169;133;30062021115609
170;136;30062021115609
171;133;30062021115609
172;132;30062021115609
173;134;30062021115609
174;131;30062021115609
175;130;30062021115609
176;131;30062021115609
177;129;30062021115609
178;132;30062021115609
179;131;30062021115609
180;129;30062021115609
181;130;30062021115609
182;130;30062021115609
183;128;30062021115609
184;129;30062021115609
185;125;30062021115609
186;130;30062021115609
187;128;30062021115609
188;126;30062021115609
189;128;30062021115609
190;126;30062021115609
191;127;30062021115609
192;130;30062021115609
193;127;30062021115609
194;127;30062021115609
195;126;30062021115609
196;124;30062021115609
197;127;30062021115609
198;126;30062021115609
199;125;30062021115609
200;0;30062021115609
0;0;30062021115610
1;144;30062021115610
2;155;30062021115610
3;156;30062021115610
4;156;30062021115610
5;159;30062021115610
6;159;30062021115610
7;164;30062021115610
8;168;30062021115610
9;170;30062021115610
10;177;30062021115610
11;178;30062021115610
12;185;30062021115610
13;200;30062021115610
14;209;30062021115610
15;230;30062021115610
16;265;30062021115610
17;327;30062021115610
18;456;30062021115610
19;723;30062021115610
20;1023;30062021115610
21;1023;30062021115610
22;1023;30062021115610
23;1023;30062021115610
24;1023;30062021115610
25;906;30062021115610
26;846;30062021115610
27;844;30062021115610
28;899;30062021115610
29;1014;30062021115610
30;1023;30062021115610
31;1023;30062021115610
32;1023;30062021115610
33;1023;30062021115610
34;1023;30062021115610
35;1023;30062021115610
36;1023;30062021115610
37;1023;30062021115610
38;1023;30062021115610
39;1023;30062021115610
40;1023;30062021115610
41;922;30062021115610
42;838;30062021115610
43;771;30062021115610
44;731;30062021115610
45;698;30062021115610
46;679;30062021115610
47;665;30062021115610
48;667;30062021115610
49;660;30062021115610
50;666;30062021115610
51;677;30062021115610
52;678;30062021115610
53;689;30062021115610
54;705;30062021115610
55;720;30062021115610
56;739;30062021115610
57;759;30062021115610
58;778;30062021115610
59;794;30062021115610
60;812;30062021115610
61;836;30062021115610
62;846;30062021115610
63;867;30062021115610
64;874;30062021115610
65;879;30062021115610
66;880;30062021115610
67;878;30062021115610
68;876;30062021115610
69;863;30062021115610
70;849;30062021115610
71;840;30062021115610
72;824;30062021115610
73;795;30062021115610
74;779;30062021115610
75;744;30062021115610
76;728;30062021115610
77;713;30062021115610
78;685;30062021115610
79;658;30062021115610
80;632;30062021115610
81;609;30062021115610
82;600;30062021115610
83;573;30062021115610
84;565;30062021115610
85;550;30062021115610
86;545;30062021115610
87;541;30062021115610
88;526;30062021115610
89;517;30062021115610
90;511;30062021115610
91;494;30062021115610
92;478;30062021115610
93;468;30062021115610
94;447;30062021115610
95;434;30062021115610
96;424;30062021115610
97;407;30062021115610
98;396;30062021115610
99;385;30062021115610
100;376;30062021115610
101;367;30062021115610
102;356;30062021115610
103;347;30062021115610
104;339;30062021115610
105;328;30062021115610
106;324;30062021115610
107;313;30062021115610
108;309;30062021115610
109;299;30062021115610
110;291;30062021115610
111;284;30062021115610
112;280;30062021115610
113;269;30062021115610
114;267;30062021115610
115;264;30062021115610
116;257;30062021115610
117;256;30062021115610
118;248;30062021115610
119;242;30062021115610
120;238;30062021115610
121;235;30062021115610
122;230;30062021115610
123;227;30062021115610
124;221;30062021115610
125;217;30062021115610
126;214;30062021115610
127;208;30062021115610
128;206;30062021115610
129;200;30062021115610
130;196;30062021115610
131;196;30062021115610
132;190;30062021115610
133;192;30062021115610
134;184;30062021115610
135;182;30062021115610
136;179;30062021115610
137;175;30062021115610
138;174;30062021115610
139;171;30062021115610
140;168;30062021115610
141;167;30062021115610
142;164;30062021115610
143;161;30062021115610
144;161;30062021115610
145;156;30062021115610
146;158;30062021115610
147;156;30062021115610
148;152;30062021115610
149;153;30062021115610
150;151;30062021115610
151;151;30062021115610
152;149;30062021115610
153;145;30062021115610
154;147;30062021115610
155;146;30062021115610
156;144;30062021115610
157;143;30062021115610
158;142;30062021115610
159;140;30062021115610
160;141;30062021115610
161;139;30062021115610
162;140;30062021115610
163;138;30062021115610
164;136;30062021115610
165;137;30062021115610
166;135;30062021115610
167;137;30062021115610
168;137;30062021115610
169;132;30062021115610
170;135;30062021115610
171;132;30062021115610
172;131;30062021115610
173;133;30062021115610
174;131;30062021115610
175;130;30062021115610
176;131;30062021115610
177;130;30062021115610
178;131;30062021115610
179;129;30062021115610
180;129;30062021115610
181;130;30062021115610
182;129;30062021115610
183;128;30062021115610
184;128;30062021115610
185;126;30062021115610
186;130;30062021115610
187;128;30062021115610
188;125;30062021115610
189;128;30062021115610
190;126;30062021115610
191;126;30062021115610
192;129;30062021115610
193;126;30062021115610
194;127;30062021115610
195;127;30062021115610
196;125;30062021115610
197;127;30062021115610
198;126;30062021115610
199;124;30062021115610
200;0;30062021115610
0;0;30062021115611
1;144;30062021115611
2;156;30062021115611
3;156;30062021115611
4;157;30062021115611
5;159;30062021115611
6;160;30062021115611
7;163;30062021115611
8;169;30062021115611
9;167;30062021115611
10;176;30062021115611
11;179;30062021115611
12;187;30062021115611
13;199;30062021115611
14;208;30062021115611
15;233;30062021115611
16;265;30062021115611
17;327;30062021115611
18;458;30062021115611
19;723;30062021115611
20;1023;30062021115611
21;1023;30062021115611
22;1023;30062021115611
23;1023;30062021115611
24;1023;30062021115611
25;904;30062021115611
26;840;30062021115611
27;849;30062021115611
28;898;30062021115611
29;1012;30062021115611
30;1023;30062021115611
31;1023;30062021115611
32;1023;30062021115611
33;1023;30062021115611
34;1023;30062021115611
35;1023;30062021115611
36;1023;30062021115611
37;1023;30062021115611
38;1023;30062021115611
39;1023;30062021115611
40;1023;30062021115611
41;921;30062021115611
42;838;30062021115611
43;767;30062021115611
44;724;30062021115611
45;696;30062021115611
46;675;30062021115611
47;672;30062021115611
48;667;30062021115611
49;660;30062021115611
50;667;30062021115611
51;676;30062021115611
52;677;30062021115611
53;692;30062021115611
54;703;30062021115611
55;718;30062021115611
56;731;30062021115611
57;756;30062021115611
58;770;30062021115611
59;795;30062021115611
60;813;30062021115611
61;833;30062021115611
62;845;30062021115611
63;867;30062021115611
64;874;30062021115611
65;874;30062021115611
66;881;30062021115611
67;882;30062021115611
68;880;30062021115611
69;865;30062021115611
70;850;30062021115611
71;839;30062021115611
72;827;30062021115611
73;798;30062021115611
74;779;30062021115611
75;750;30062021115611
76;726;30062021115611
77;711;30062021115611
78;683;30062021115611
79;661;30062021115611
80;634;30062021115611
81;610;30062021115611
82;597;30062021115611
83;578;30062021115611
84;561;30062021115611
85;551;30062021115611
86;544;30062021115611
87;538;30062021115611
88;527;30062021115611
89;516;30062021115611
90;511;30062021115611
91;495;30062021115611
92;478;30062021115611
93;464;30062021115611
94;454;30062021115611
95;433;30062021115611
96;426;30062021115611
97;406;30062021115611
98;397;30062021115611
99;388;30062021115611
100;374;30062021115611
101;370;30062021115611
102;359;30062021115611
103;348;30062021115611
104;342;30062021115611
105;333;30062021115611
106;327;30062021115611
107;314;30062021115611
108;308;30062021115611
109;298;30062021115611
110;292;30062021115611
111;284;30062021115611
112;279;30062021115611
113;271;30062021115611
114;267;30062021115611
115;262;30062021115611
116;256;30062021115611
117;254;30062021115611
118;247;30062021115611
119;245;30062021115611
120;239;30062021115611
121;232;30062021115611
122;231;30062021115611
123;227;30062021115611
124;221;30062021115611
125;218;30062021115611
126;210;30062021115611
127;207;30062021115611
128;207;30062021115611
129;201;30062021115611
130;197;30062021115611
131;195;30062021115611
132;191;30062021115611
133;191;30062021115611
134;183;30062021115611
135;180;30062021115611
136;180;30062021115611
137;175;30062021115611
138;175;30062021115611
139;171;30062021115611
140;168;30062021115611
141;168;30062021115611
142;164;30062021115611
143;162;30062021115611
144;163;30062021115611
145;157;30062021115611
146;158;30062021115611
147;156;30062021115611
148;154;30062021115611
149;151;30062021115611
150;152;30062021115611
151;150;30062021115611
152;149;30062021115611
153;145;30062021115611
154;148;30062021115611
155;146;30062021115611
156;144;30062021115611
157;144;30062021115611
158;142;30062021115611
159;141;30062021115611
160;141;30062021115611
161;138;30062021115611
162;140;30062021115611
163;138;30062021115611
164;138;30062021115611
165;139;30062021115611
166;135;30062021115611
167;135;30062021115611
168;136;30062021115611
169;132;30062021115611
170;134;30062021115611
171;133;30062021115611
172;131;30062021115611
173;134;30062021115611
174;131;30062021115611
175;130;30062021115611
176;132;30062021115611
177;130;30062021115611
178;131;30062021115611
179;130;30062021115611
180;128;30062021115611
181;129;30062021115611
182;128;30062021115611
183;128;30062021115611
184;129;30062021115611
185;125;30062021115611
186;129;30062021115611
187;128;30062021115611
188;125;30062021115611
189;128;30062021115611
190;125;30062021115611
191;128;30062021115611
192;129;30062021115611
193;126;30062021115611
194;126;30062021115611
195;126;30062021115611
196;125;30062021115611
197;125;30062021115611
198;128;30062021115611
199;125;30062021115611
200;0;30062021115611
