ind;val;datetime
0;0;29062021163337
1;143;29062021163337
2;148;29062021163337
3;147;29062021163337
4;147;29062021163337
5;150;29062021163337
6;150;29062021163337
7;153;29062021163337
8;157;29062021163337
9;154;29062021163337
10;162;29062021163337
11;163;29062021163337
12;167;29062021163337
13;177;29062021163337
14;185;29062021163337
15;202;29062021163337
16;226;29062021163337
17;273;29062021163337
18;365;29062021163337
19;568;29062021163337
20;944;29062021163337
21;1023;29062021163337
22;1023;29062021163337
23;1023;29062021163337
24;1023;29062021163337
25;1023;29062021163337
26;999;29062021163337
27;1008;29062021163337
28;1023;29062021163337
29;1023;29062021163337
30;1023;29062021163337
31;1023;29062021163337
32;1023;29062021163337
33;1023;29062021163337
34;1023;29062021163337
35;1023;29062021163337
36;1023;29062021163337
37;1023;29062021163337
38;978;29062021163337
39;832;29062021163337
40;709;29062021163337
41;625;29062021163337
42;585;29062021163337
43;549;29062021163337
44;531;29062021163337
45;518;29062021163337
46;517;29062021163337
47;513;29062021163337
48;513;29062021163337
49;504;29062021163337
50;505;29062021163337
51;510;29062021163337
52;506;29062021163337
53;517;29062021163337
54;526;29062021163337
55;535;29062021163337
56;540;29062021163337
57;555;29062021163337
58;570;29062021163337
59;579;29062021163337
60;594;29062021163337
61;612;29062021163337
62;615;29062021163337
63;628;29062021163337
64;633;29062021163337
65;630;29062021163337
66;630;29062021163337
67;625;29062021163337
68;618;29062021163337
69;606;29062021163337
70;593;29062021163337
71;581;29062021163337
72;562;29062021163337
73;547;29062021163337
74;532;29062021163337
75;510;29062021163337
76;494;29062021163337
77;482;29062021163337
78;464;29062021163337
79;447;29062021163337
80;429;29062021163337
81;411;29062021163337
82;404;29062021163337
83;385;29062021163337
84;380;29062021163337
85;373;29062021163337
86;366;29062021163337
87;362;29062021163337
88;354;29062021163337
89;345;29062021163337
90;340;29062021163337
91;330;29062021163337
92;322;29062021163337
93;314;29062021163337
94;306;29062021163337
95;292;29062021163337
96;286;29062021163337
97;279;29062021163337
98;273;29062021163337
99;265;29062021163337
100;256;29062021163337
101;255;29062021163337
102;248;29062021163337
103;242;29062021163337
104;236;29062021163337
105;233;29062021163337
106;229;29062021163337
107;224;29062021163337
108;220;29062021163337
109;216;29062021163337
110;211;29062021163337
111;207;29062021163337
112;205;29062021163337
113;198;29062021163337
114;197;29062021163337
115;194;29062021163337
116;193;29062021163337
117;191;29062021163337
118;186;29062021163337
119;185;29062021163337
120;182;29062021163337
121;177;29062021163337
122;177;29062021163337
123;175;29062021163337
124;173;29062021163337
125;170;29062021163337
126;166;29062021163337
127;168;29062021163337
128;165;29062021163337
129;163;29062021163337
130;162;29062021163337
131;159;29062021163337
132;156;29062021163337
133;160;29062021163337
134;153;29062021163337
135;152;29062021163337
136;153;29062021163337
137;148;29062021163337
138;151;29062021163337
139;147;29062021163337
140;145;29062021163337
141;147;29062021163337
142;145;29062021163337
143;142;29062021163337
144;143;29062021163337
145;139;29062021163337
146;142;29062021163337
147;141;29062021163337
148;138;29062021163337
149;139;29062021163337
150;139;29062021163337
151;139;29062021163337
152;137;29062021163337
153;134;29062021163337
154;137;29062021163337
155;135;29062021163337
156;134;29062021163337
157;133;29062021163337
158;131;29062021163337
159;131;29062021163337
160;133;29062021163337
161;132;29062021163337
162;132;29062021163337
163;132;29062021163337
164;131;29062021163337
165;132;29062021163337
166;129;29062021163337
167;131;29062021163337
168;133;29062021163337
169;127;29062021163337
170;130;29062021163337
171;129;29062021163337
172;128;29062021163337
173;131;29062021163337
174;128;29062021163337
175;126;29062021163337
176;128;29062021163337
177;125;29062021163337
178;130;29062021163337
179;129;29062021163337
180;126;29062021163337
181;128;29062021163337
182;128;29062021163337
183;127;29062021163337
184;126;29062021163337
185;124;29062021163337
186;128;29062021163337
187;126;29062021163337
188;125;29062021163337
189;127;29062021163337
190;126;29062021163337
191;127;29062021163337
192;130;29062021163337
193;126;29062021163337
194;129;29062021163337
195;127;29062021163337
196;125;29062021163337
197;126;29062021163337
198;126;29062021163337
199;125;29062021163337
200;0;29062021163337
0;0;29062021163338
1;143;29062021163338
2;146;29062021163338
3;147;29062021163338
4;149;29062021163338
5;150;29062021163338
6;149;29062021163338
7;153;29062021163338
8;156;29062021163338
9;154;29062021163338
10;161;29062021163338
11;164;29062021163338
12;168;29062021163338
13;177;29062021163338
14;184;29062021163338
15;202;29062021163338
16;224;29062021163338
17;269;29062021163338
18;367;29062021163338
19;564;29062021163338
20;942;29062021163338
21;1023;29062021163338
22;1023;29062021163338
23;1023;29062021163338
24;1023;29062021163338
25;1023;29062021163338
26;1003;29062021163338
27;1011;29062021163338
28;1023;29062021163338
29;1023;29062021163338
30;1023;29062021163338
31;1023;29062021163338
32;1023;29062021163338
33;1023;29062021163338
34;1023;29062021163338
35;1023;29062021163338
36;1023;29062021163338
37;1023;29062021163338
38;984;29062021163338
39;837;29062021163338
40;713;29062021163338
41;632;29062021163338
42;586;29062021163338
43;545;29062021163338
44;529;29062021163338
45;523;29062021163338
46;517;29062021163338
47;512;29062021163338
48;511;29062021163338
49;504;29062021163338
50;507;29062021163338
51;508;29062021163338
52;510;29062021163338
53;517;29062021163338
54;523;29062021163338
55;533;29062021163338
56;544;29062021163338
57;555;29062021163338
58;567;29062021163338
59;585;29062021163338
60;595;29062021163338
61;609;29062021163338
62;615;29062021163338
63;622;29062021163338
64;628;29062021163338
65;624;29062021163338
66;628;29062021163338
67;627;29062021163338
68;618;29062021163338
69;604;29062021163338
70;590;29062021163338
71;577;29062021163338
72;566;29062021163338
73;542;29062021163338
74;532;29062021163338
75;509;29062021163338
76;497;29062021163338
77;479;29062021163338
78;464;29062021163338
79;444;29062021163338
80;428;29062021163338
81;410;29062021163338
82;398;29062021163338
83;389;29062021163338
84;380;29062021163338
85;370;29062021163338
86;367;29062021163338
87;363;29062021163338
88;358;29062021163338
89;344;29062021163338
90;340;29062021163338
91;329;29062021163338
92;321;29062021163338
93;313;29062021163338
94;303;29062021163338
95;293;29062021163338
96;286;29062021163338
97;278;29062021163338
98;270;29062021163338
99;265;29062021163338
100;256;29062021163338
101;257;29062021163338
102;250;29062021163338
103;243;29062021163338
104;238;29062021163338
105;231;29062021163338
106;229;29062021163338
107;222;29062021163338
108;218;29062021163338
109;216;29062021163338
110;210;29062021163338
111;206;29062021163338
112;203;29062021163338
113;197;29062021163338
114;195;29062021163338
115;195;29062021163338
116;193;29062021163338
117;191;29062021163338
118;187;29062021163338
119;185;29062021163338
120;181;29062021163338
121;177;29062021163338
122;178;29062021163338
123;174;29062021163338
124;173;29062021163338
125;171;29062021163338
126;168;29062021163338
127;168;29062021163338
128;168;29062021163338
129;162;29062021163338
130;160;29062021163338
131;159;29062021163338
132;155;29062021163338
133;162;29062021163338
134;153;29062021163338
135;152;29062021163338
136;153;29062021163338
137;150;29062021163338
138;151;29062021163338
139;147;29062021163338
140;144;29062021163338
141;146;29062021163338
142;143;29062021163338
143;141;29062021163338
144;143;29062021163338
145;139;29062021163338
146;142;29062021163338
147;140;29062021163338
148;138;29062021163338
149;138;29062021163338
150;137;29062021163338
151;138;29062021163338
152;136;29062021163338
153;134;29062021163338
154;136;29062021163338
155;136;29062021163338
156;134;29062021163338
157;133;29062021163338
158;132;29062021163338
159;131;29062021163338
160;132;29062021163338
161;131;29062021163338
162;131;29062021163338
163;132;29062021163338
164;131;29062021163338
165;132;29062021163338
166;130;29062021163338
167;131;29062021163338
168;132;29062021163338
169;127;29062021163338
170;129;29062021163338
171;129;29062021163338
172;128;29062021163338
173;131;29062021163338
174;127;29062021163338
175;128;29062021163338
176;130;29062021163338
177;127;29062021163338
178;129;29062021163338
179;128;29062021163338
180;127;29062021163338
181;128;29062021163338
182;128;29062021163338
183;126;29062021163338
184;127;29062021163338
185;124;29062021163338
186;128;29062021163338
187;127;29062021163338
188;125;29062021163338
189;127;29062021163338
190;125;29062021163338
191;126;29062021163338
192;130;29062021163338
193;125;29062021163338
194;127;29062021163338
195;126;29062021163338
196;125;29062021163338
197;125;29062021163338
198;126;29062021163338
199;125;29062021163338
200;0;29062021163338
0;0;29062021163339
1;143;29062021163339
2;147;29062021163339
3;145;29062021163339
4;147;29062021163339
5;149;29062021163339
6;147;29062021163339
7;153;29062021163339
8;155;29062021163339
9;155;29062021163339
10;162;29062021163339
11;163;29062021163339
12;168;29062021163339
13;177;29062021163339
14;184;29062021163339
15;201;29062021163339
16;226;29062021163339
17;270;29062021163339
18;366;29062021163339
19;558;29062021163339
20;938;29062021163339
21;1023;29062021163339
22;1023;29062021163339
23;1023;29062021163339
24;1023;29062021163339
25;1023;29062021163339
26;1005;29062021163339
27;1010;29062021163339
28;1023;29062021163339
29;1023;29062021163339
30;1023;29062021163339
31;1023;29062021163339
32;1023;29062021163339
33;1023;29062021163339
34;1023;29062021163339
35;1023;29062021163339
36;1023;29062021163339
37;1023;29062021163339
38;984;29062021163339
39;836;29062021163339
40;712;29062021163339
41;633;29062021163339
42;584;29062021163339
43;548;29062021163339
44;528;29062021163339
45;523;29062021163339
46;509;29062021163339
47;510;29062021163339
48;510;29062021163339
49;507;29062021163339
50;500;29062021163339
51;507;29062021163339
52;503;29062021163339
53;513;29062021163339
54;523;29062021163339
55;532;29062021163339
56;543;29062021163339
57;552;29062021163339
58;566;29062021163339
59;582;29062021163339
60;591;29062021163339
61;603;29062021163339
62;607;29062021163339
63;624;29062021163339
64;630;29062021163339
65;622;29062021163339
66;630;29062021163339
67;619;29062021163339
68;614;29062021163339
69;605;29062021163339
70;590;29062021163339
71;577;29062021163339
72;564;29062021163339
73;545;29062021163339
74;529;29062021163339
75;508;29062021163339
76;494;29062021163339
77;477;29062021163339
78;462;29062021163339
79;446;29062021163339
80;429;29062021163339
81;405;29062021163339
82;400;29062021163339
83;387;29062021163339
84;379;29062021163339
85;372;29062021163339
86;367;29062021163339
87;359;29062021163339
88;354;29062021163339
89;342;29062021163339
90;342;29062021163339
91;326;29062021163339
92;316;29062021163339
93;310;29062021163339
94;301;29062021163339
95;291;29062021163339
96;285;29062021163339
97;277;29062021163339
98;269;29062021163339
99;264;29062021163339
100;256;29062021163339
101;255;29062021163339
102;250;29062021163339
103;241;29062021163339
104;238;29062021163339
105;230;29062021163339
106;228;29062021163339
107;223;29062021163339
108;218;29062021163339
109;216;29062021163339
110;209;29062021163339
111;205;29062021163339
112;204;29062021163339
113;196;29062021163339
114;196;29062021163339
115;196;29062021163339
116;191;29062021163339
117;191;29062021163339
118;185;29062021163339
119;185;29062021163339
120;181;29062021163339
121;178;29062021163339
122;177;29062021163339
123;175;29062021163339
124;173;29062021163339
125;172;29062021163339
126;167;29062021163339
127;167;29062021163339
128;167;29062021163339
129;160;29062021163339
130;160;29062021163339
131;159;29062021163339
132;155;29062021163339
133;159;29062021163339
134;152;29062021163339
135;151;29062021163339
136;153;29062021163339
137;148;29062021163339
138;150;29062021163339
139;147;29062021163339
140;145;29062021163339
141;146;29062021163339
142;143;29062021163339
143;142;29062021163339
144;144;29062021163339
145;140;29062021163339
146;140;29062021163339
147;140;29062021163339
148;138;29062021163339
149;138;29062021163339
150;138;29062021163339
151;136;29062021163339
152;135;29062021163339
153;134;29062021163339
154;136;29062021163339
155;135;29062021163339
156;132;29062021163339
157;133;29062021163339
158;133;29062021163339
159;132;29062021163339
160;133;29062021163339
161;130;29062021163339
162;132;29062021163339
163;131;29062021163339
164;130;29062021163339
165;132;29062021163339
166;128;29062021163339
167;131;29062021163339
168;131;29062021163339
169;127;29062021163339
170;130;29062021163339
171;129;29062021163339
172;128;29062021163339
173;129;29062021163339
174;127;29062021163339
175;126;29062021163339
176;129;29062021163339
177;127;29062021163339
178;130;29062021163339
179;128;29062021163339
180;126;29062021163339
181;128;29062021163339
182;129;29062021163339
183;126;29062021163339
184;127;29062021163339
185;123;29062021163339
186;129;29062021163339
187;126;29062021163339
188;125;29062021163339
189;128;29062021163339
190;125;29062021163339
191;127;29062021163339
192;129;29062021163339
193;125;29062021163339
194;127;29062021163339
195;127;29062021163339
196;125;29062021163339
197;126;29062021163339
198;126;29062021163339
199;124;29062021163339
200;0;29062021163339
0;0;29062021163340
1;144;29062021163340
2;147;29062021163340
3;146;29062021163340
4;149;29062021163340
5;148;29062021163340
6;148;29062021163340
7;153;29062021163340
8;157;29062021163340
9;156;29062021163340
10;164;29062021163340
11;164;29062021163340
12;166;29062021163340
13;177;29062021163340
14;183;29062021163340
15;201;29062021163340
16;226;29062021163340
17;268;29062021163340
18;368;29062021163340
19;557;29062021163340
20;934;29062021163340
21;1023;29062021163340
22;1023;29062021163340
23;1023;29062021163340
24;1023;29062021163340
25;1023;29062021163340
26;1007;29062021163340
27;1014;29062021163340
28;1023;29062021163340
29;1023;29062021163340
30;1023;29062021163340
31;1023;29062021163340
32;1023;29062021163340
33;1023;29062021163340
34;1023;29062021163340
35;1023;29062021163340
36;1023;29062021163340
37;1023;29062021163340
38;985;29062021163340
39;832;29062021163340
40;708;29062021163340
41;627;29062021163340
42;584;29062021163340
43;543;29062021163340
44;530;29062021163340
45;518;29062021163340
46;513;29062021163340
47;505;29062021163340
48;503;29062021163340
49;500;29062021163340
50;500;29062021163340
51;501;29062021163340
52;503;29062021163340
53;510;29062021163340
54;516;29062021163340
55;528;29062021163340
56;539;29062021163340
57;552;29062021163340
58;567;29062021163340
59;576;29062021163340
60;595;29062021163340
61;610;29062021163340
62;605;29062021163340
63;621;29062021163340
64;626;29062021163340
65;623;29062021163340
66;627;29062021163340
67;618;29062021163340
68;614;29062021163340
69;601;29062021163340
70;591;29062021163340
71;573;29062021163340
72;559;29062021163340
73;543;29062021163340
74;529;29062021163340
75;506;29062021163340
76;489;29062021163340
77;479;29062021163340
78;459;29062021163340
79;445;29062021163340
80;424;29062021163340
81;411;29062021163340
82;399;29062021163340
83;385;29062021163340
84;378;29062021163340
85;370;29062021163340
86;367;29062021163340
87;361;29062021163340
88;354;29062021163340
89;343;29062021163340
90;338;29062021163340
91;328;29062021163340
92;319;29062021163340
93;313;29062021163340
94;300;29062021163340
95;292;29062021163340
96;283;29062021163340
97;277;29062021163340
98;271;29062021163340
99;267;29062021163340
100;257;29062021163340
101;254;29062021163340
102;246;29062021163340
103;240;29062021163340
104;237;29062021163340
105;230;29062021163340
106;228;29062021163340
107;219;29062021163340
108;219;29062021163340
109;216;29062021163340
110;210;29062021163340
111;204;29062021163340
112;203;29062021163340
113;198;29062021163340
114;196;29062021163340
115;194;29062021163340
116;191;29062021163340
117;193;29062021163340
118;186;29062021163340
119;185;29062021163340
120;181;29062021163340
121;177;29062021163340
122;177;29062021163340
123;174;29062021163340
124;173;29062021163340
125;171;29062021163340
126;167;29062021163340
127;168;29062021163340
128;167;29062021163340
129;162;29062021163340
130;160;29062021163340
131;158;29062021163340
132;154;29062021163340
133;161;29062021163340
134;153;29062021163340
135;153;29062021163340
136;153;29062021163340
137;148;29062021163340
138;151;29062021163340
139;147;29062021163340
140;145;29062021163340
141;146;29062021163340
142;144;29062021163340
143;142;29062021163340
144;142;29062021163340
145;140;29062021163340
146;141;29062021163340
147;142;29062021163340
148;138;29062021163340
149;139;29062021163340
150;137;29062021163340
151;138;29062021163340
152;136;29062021163340
153;135;29062021163340
154;137;29062021163340
155;135;29062021163340
156;134;29062021163340
157;134;29062021163340
158;132;29062021163340
159;131;29062021163340
160;132;29062021163340
161;131;29062021163340
162;132;29062021163340
163;132;29062021163340
164;131;29062021163340
165;133;29062021163340
166;130;29062021163340
167;131;29062021163340
168;133;29062021163340
169;128;29062021163340
170;129;29062021163340
171;129;29062021163340
172;127;29062021163340
173;130;29062021163340
174;128;29062021163340
175;127;29062021163340
176;129;29062021163340
177;126;29062021163340
178;130;29062021163340
179;128;29062021163340
180;126;29062021163340
181;128;29062021163340
182;129;29062021163340
183;126;29062021163340
184;127;29062021163340
185;124;29062021163340
186;129;29062021163340
187;127;29062021163340
188;126;29062021163340
189;128;29062021163340
190;125;29062021163340
191;127;29062021163340
192;128;29062021163340
193;124;29062021163340
194;128;29062021163340
195;127;29062021163340
196;126;29062021163340
197;126;29062021163340
198;127;29062021163340
199;126;29062021163340
200;0;29062021163340
0;0;29062021163341
1;143;29062021163341
2;147;29062021163341
3;146;29062021163341
4;148;29062021163341
5;149;29062021163341
6;148;29062021163341
7;153;29062021163341
8;157;29062021163341
9;156;29062021163341
10;162;29062021163341
11;163;29062021163341
12;168;29062021163341
13;176;29062021163341
14;184;29062021163341
15;200;29062021163341
16;223;29062021163341
17;269;29062021163341
18;366;29062021163341
19;560;29062021163341
20;934;29062021163341
21;1023;29062021163341
22;1023;29062021163341
23;1023;29062021163341
24;1023;29062021163341
25;1023;29062021163341
26;1006;29062021163341
27;1012;29062021163341
28;1023;29062021163341
29;1023;29062021163341
30;1023;29062021163341
31;1023;29062021163341
32;1023;29062021163341
33;1023;29062021163341
34;1023;29062021163341
35;1023;29062021163341
36;1023;29062021163341
37;1023;29062021163341
38;987;29062021163341
39;836;29062021163341
40;715;29062021163341
41;634;29062021163341
42;582;29062021163341
43;542;29062021163341
44;531;29062021163341
45;522;29062021163341
46;509;29062021163341
47;508;29062021163341
48;502;29062021163341
49;504;29062021163341
50;502;29062021163341
51;502;29062021163341
52;504;29062021163341
53;514;29062021163341
54;521;29062021163341
55;533;29062021163341
56;541;29062021163341
57;554;29062021163341
58;571;29062021163341
59;582;29062021163341
60;591;29062021163341
61;607;29062021163341
62;607;29062021163341
63;623;29062021163341
64;623;29062021163341
65;623;29062021163341
66;627;29062021163341
67;620;29062021163341
68;609;29062021163341
69;602;29062021163341
70;588;29062021163341
71;581;29062021163341
72;560;29062021163341
73;542;29062021163341
74;532;29062021163341
75;506;29062021163341
76;494;29062021163341
77;481;29062021163341
78;457;29062021163341
79;446;29062021163341
80;429;29062021163341
81;410;29062021163341
82;404;29062021163341
83;387;29062021163341
84;382;29062021163341
85;373;29062021163341
86;365;29062021163341
87;361;29062021163341
88;357;29062021163341
89;343;29062021163341
90;340;29062021163341
91;330;29062021163341
92;318;29062021163341
93;310;29062021163341
94;303;29062021163341
95;291;29062021163341
96;285;29062021163341
97;277;29062021163341
98;269;29062021163341
99;264;29062021163341
100;257;29062021163341
101;257;29062021163341
102;249;29062021163341
103;242;29062021163341
104;238;29062021163341
105;230;29062021163341
106;229;29062021163341
107;222;29062021163341
108;220;29062021163341
109;215;29062021163341
110;210;29062021163341
111;208;29062021163341
112;202;29062021163341
113;198;29062021163341
114;196;29062021163341
115;196;29062021163341
116;193;29062021163341
117;190;29062021163341
118;186;29062021163341
119;186;29062021163341
120;181;29062021163341
121;178;29062021163341
122;179;29062021163341
123;174;29062021163341
124;172;29062021163341
125;171;29062021163341
126;165;29062021163341
127;168;29062021163341
128;168;29062021163341
129;161;29062021163341
130;162;29062021163341
131;159;29062021163341
132;156;29062021163341
133;160;29062021163341
134;153;29062021163341
135;152;29062021163341
136;153;29062021163341
137;149;29062021163341
138;150;29062021163341
139;147;29062021163341
140;145;29062021163341
141;147;29062021163341
142;143;29062021163341
143;141;29062021163341
144;142;29062021163341
145;140;29062021163341
146;142;29062021163341
147;141;29062021163341
148;139;29062021163341
149;139;29062021163341
150;139;29062021163341
151;137;29062021163341
152;136;29062021163341
153;134;29062021163341
154;136;29062021163341
155;136;29062021163341
156;134;29062021163341
157;133;29062021163341
158;133;29062021163341
159;131;29062021163341
160;132;29062021163341
161;131;29062021163341
162;133;29062021163341
163;132;29062021163341
164;130;29062021163341
165;132;29062021163341
166;130;29062021163341
167;131;29062021163341
168;132;29062021163341
169;127;29062021163341
170;130;29062021163341
171;128;29062021163341
172;128;29062021163341
173;131;29062021163341
174;127;29062021163341
175;127;29062021163341
176;129;29062021163341
177;126;29062021163341
178;130;29062021163341
179;128;29062021163341
180;127;29062021163341
181;128;29062021163341
182;128;29062021163341
183;126;29062021163341
184;127;29062021163341
185;123;29062021163341
186;129;29062021163341
187;127;29062021163341
188;127;29062021163341
189;128;29062021163341
190;125;29062021163341
191;126;29062021163341
192;128;29062021163341
193;125;29062021163341
194;127;29062021163341
195;126;29062021163341
196;125;29062021163341
197;126;29062021163341
198;126;29062021163341
199;124;29062021163341
200;0;29062021163341
0;0;29062021163341
1;143;29062021163341
2;147;29062021163341
3;145;29062021163341
4;147;29062021163341
5;148;29062021163341
6;149;29062021163341
7;152;29062021163341
8;155;29062021163341
9;155;29062021163341
10;162;29062021163341
11;162;29062021163341
12;167;29062021163341
13;178;29062021163341
14;182;29062021163341
15;201;29062021163341
16;224;29062021163341
17;268;29062021163341
18;365;29062021163341
19;559;29062021163341
20;927;29062021163341
21;1023;29062021163341
22;1023;29062021163341
23;1023;29062021163341
24;1023;29062021163341
25;1023;29062021163341
26;1004;29062021163341
27;1010;29062021163341
28;1023;29062021163341
29;1023;29062021163341
30;1023;29062021163341
31;1023;29062021163341
32;1023;29062021163341
33;1023;29062021163341
34;1023;29062021163341
35;1023;29062021163341
36;1023;29062021163341
37;1023;29062021163341
38;985;29062021163341
39;837;29062021163341
40;711;29062021163341
41;629;29062021163341
42;581;29062021163341
43;544;29062021163341
44;528;29062021163341
45;518;29062021163341
46;511;29062021163341
47;504;29062021163341
48;505;29062021163341
49;502;29062021163341
50;502;29062021163341
51;503;29062021163341
52;502;29062021163341
53;513;29062021163341
54;518;29062021163341
55;526;29062021163341
56;540;29062021163341
57;547;29062021163341
58;567;29062021163341
59;574;29062021163341
60;591;29062021163341
61;606;29062021163341
62;604;29062021163341
63;619;29062021163341
64;620;29062021163341
65;621;29062021163341
66;622;29062021163341
67;619;29062021163341
68;609;29062021163341
69;600;29062021163341
70;590;29062021163341
71;576;29062021163341
72;563;29062021163341
73;541;29062021163341
74;527;29062021163341
75;507;29062021163341
76;488;29062021163341
77;476;29062021163341
78;458;29062021163341
79;444;29062021163341
80;426;29062021163341
81;407;29062021163341
82;400;29062021163341
83;384;29062021163341
84;379;29062021163341
85;368;29062021163341
86;365;29062021163341
87;358;29062021163341
88;351;29062021163341
89;345;29062021163341
90;338;29062021163341
91;330;29062021163341
92;316;29062021163341
93;312;29062021163341
94;303;29062021163341
95;293;29062021163341
96;286;29062021163341
97;275;29062021163341
98;270;29062021163341
99;263;29062021163341
100;254;29062021163341
101;255;29062021163341
102;249;29062021163341
103;239;29062021163341
104;237;29062021163341
105;229;29062021163341
106;229;29062021163341
107;222;29062021163341
108;218;29062021163341
109;215;29062021163341
110;210;29062021163341
111;206;29062021163341
112;204;29062021163341
113;196;29062021163341
114;196;29062021163341
115;195;29062021163341
116;192;29062021163341
117;191;29062021163341
118;186;29062021163341
119;185;29062021163341
120;180;29062021163341
121;177;29062021163341
122;178;29062021163341
123;174;29062021163341
124;172;29062021163341
125;171;29062021163341
126;165;29062021163341
127;166;29062021163341
128;165;29062021163341
129;162;29062021163341
130;158;29062021163341
131;159;29062021163341
132;155;29062021163341
133;159;29062021163341
134;152;29062021163341
135;152;29062021163341
136;153;29062021163341
137;148;29062021163341
138;149;29062021163341
139;147;29062021163341
140;144;29062021163341
141;145;29062021163341
142;145;29062021163341
143;142;29062021163341
144;144;29062021163341
145;140;29062021163341
146;141;29062021163341
147;142;29062021163341
148;137;29062021163341
149;138;29062021163341
150;138;29062021163341
151;138;29062021163341
152;136;29062021163341
153;135;29062021163341
154;135;29062021163341
155;136;29062021163341
156;134;29062021163341
157;133;29062021163341
158;132;29062021163341
159;132;29062021163341
160;132;29062021163341
161;130;29062021163341
162;132;29062021163341
163;132;29062021163341
164;131;29062021163341
165;133;29062021163341
166;130;29062021163341
167;131;29062021163341
168;131;29062021163341
169;127;29062021163341
170;130;29062021163341
171;129;29062021163341
172;127;29062021163341
173;129;29062021163341
174;128;29062021163341
175;127;29062021163341
176;129;29062021163341
177;127;29062021163341
178;130;29062021163341
179;127;29062021163341
180;126;29062021163341
181;127;29062021163341
182;127;29062021163341
183;126;29062021163341
184;127;29062021163341
185;124;29062021163341
186;128;29062021163341
187;127;29062021163341
188;126;29062021163341
189;127;29062021163341
190;125;29062021163341
191;126;29062021163341
192;129;29062021163341
193;125;29062021163341
194;128;29062021163341
195;126;29062021163341
196;125;29062021163341
197;126;29062021163341
198;126;29062021163341
199;125;29062021163341
200;0;29062021163341
0;0;29062021163342
1;143;29062021163342
2;146;29062021163342
3;146;29062021163342
4;147;29062021163342
5;148;29062021163342
6;149;29062021163342
7;152;29062021163342
8;157;29062021163342
9;155;29062021163342
10;160;29062021163342
11;163;29062021163342
12;169;29062021163342
13;177;29062021163342
14;184;29062021163342
15;200;29062021163342
16;224;29062021163342
17;270;29062021163342
18;367;29062021163342
19;562;29062021163342
20;930;29062021163342
21;1023;29062021163342
22;1023;29062021163342
23;1023;29062021163342
24;1023;29062021163342
25;1023;29062021163342
26;1005;29062021163342
27;1010;29062021163342
28;1023;29062021163342
29;1023;29062021163342
30;1023;29062021163342
31;1023;29062021163342
32;1023;29062021163342
33;1023;29062021163342
34;1023;29062021163342
35;1023;29062021163342
36;1023;29062021163342
37;1023;29062021163342
38;990;29062021163342
39;841;29062021163342
40;717;29062021163342
41;634;29062021163342
42;584;29062021163342
43;543;29062021163342
44;531;29062021163342
45;520;29062021163342
46;507;29062021163342
47;510;29062021163342
48;506;29062021163342
49;501;29062021163342
50;499;29062021163342
51;503;29062021163342
52;502;29062021163342
53;512;29062021163342
54;518;29062021163342
55;528;29062021163342
56;540;29062021163342
57;550;29062021163342
58;564;29062021163342
59;575;29062021163342
60;587;29062021163342
61;602;29062021163342
62;609;29062021163342
63;621;29062021163342
64;625;29062021163342
65;622;29062021163342
66;620;29062021163342
67;617;29062021163342
68;611;29062021163342
69;601;29062021163342
70;584;29062021163342
71;576;29062021163342
72;562;29062021163342
73;540;29062021163342
74;528;29062021163342
75;509;29062021163342
76;495;29062021163342
77;478;29062021163342
78;460;29062021163342
79;441;29062021163342
80;426;29062021163342
81;407;29062021163342
82;398;29062021163342
83;387;29062021163342
84;380;29062021163342
85;373;29062021163342
86;366;29062021163342
87;360;29062021163342
88;357;29062021163342
89;342;29062021163342
90;341;29062021163342
91;329;29062021163342
92;317;29062021163342
93;310;29062021163342
94;304;29062021163342
95;290;29062021163342
96;284;29062021163342
97;276;29062021163342
98;269;29062021163342
99;263;29062021163342
100;253;29062021163342
101;255;29062021163342
102;248;29062021163342
103;240;29062021163342
104;237;29062021163342
105;231;29062021163342
106;228;29062021163342
107;223;29062021163342
108;220;29062021163342
109;216;29062021163342
110;208;29062021163342
111;205;29062021163342
112;203;29062021163342
113;197;29062021163342
114;195;29062021163342
115;195;29062021163342
116;193;29062021163342
117;191;29062021163342
118;187;29062021163342
119;184;29062021163342
120;180;29062021163342
121;177;29062021163342
122;176;29062021163342
123;175;29062021163342
124;174;29062021163342
125;171;29062021163342
126;167;29062021163342
127;167;29062021163342
128;166;29062021163342
129;161;29062021163342
130;160;29062021163342
131;157;29062021163342
132;156;29062021163342
133;159;29062021163342
134;151;29062021163342
135;152;29062021163342
136;153;29062021163342
137;147;29062021163342
138;150;29062021163342
139;148;29062021163342
140;146;29062021163342
141;146;29062021163342
142;144;29062021163342
143;141;29062021163342
144;143;29062021163342
145;140;29062021163342
146;141;29062021163342
147;140;29062021163342
148;139;29062021163342
149;139;29062021163342
150;138;29062021163342
151;136;29062021163342
152;135;29062021163342
153;133;29062021163342
154;137;29062021163342
155;136;29062021163342
156;134;29062021163342
157;134;29062021163342
158;133;29062021163342
159;132;29062021163342
160;132;29062021163342
161;130;29062021163342
162;132;29062021163342
163;132;29062021163342
164;132;29062021163342
165;133;29062021163342
166;129;29062021163342
167;132;29062021163342
168;132;29062021163342
169;128;29062021163342
170;130;29062021163342
171;129;29062021163342
172;127;29062021163342
173;129;29062021163342
174;127;29062021163342
175;126;29062021163342
176;128;29062021163342
177;126;29062021163342
178;130;29062021163342
179;128;29062021163342
180;126;29062021163342
181;129;29062021163342
182;128;29062021163342
183;126;29062021163342
184;128;29062021163342
185;125;29062021163342
186;128;29062021163342
187;127;29062021163342
188;126;29062021163342
189;127;29062021163342
190;126;29062021163342
191;127;29062021163342
192;130;29062021163342
193;124;29062021163342
194;127;29062021163342
195;126;29062021163342
196;124;29062021163342
197;126;29062021163342
198;126;29062021163342
199;125;29062021163342
200;0;29062021163342
0;0;29062021163343
1;143;29062021163343
2;147;29062021163343
3;145;29062021163343
4;147;29062021163343
5;149;29062021163343
6;148;29062021163343
7;152;29062021163343
8;155;29062021163343
9;153;29062021163343
10;161;29062021163343
11;163;29062021163343
12;166;29062021163343
13;176;29062021163343
14;184;29062021163343
15;199;29062021163343
16;223;29062021163343
17;268;29062021163343
18;362;29062021163343
19;558;29062021163343
20;929;29062021163343
21;1023;29062021163343
22;1023;29062021163343
23;1023;29062021163343
24;1023;29062021163343
25;1023;29062021163343
26;1003;29062021163343
27;1008;29062021163343
28;1023;29062021163343
29;1023;29062021163343
30;1023;29062021163343
31;1023;29062021163343
32;1023;29062021163343
33;1023;29062021163343
34;1023;29062021163343
35;1023;29062021163343
36;1023;29062021163343
37;1023;29062021163343
38;993;29062021163343
39;842;29062021163343
40;716;29062021163343
41;628;29062021163343
42;586;29062021163343
43;543;29062021163343
44;533;29062021163343
45;514;29062021163343
46;512;29062021163343
47;503;29062021163343
48;504;29062021163343
49;504;29062021163343
50;502;29062021163343
51;501;29062021163343
52;500;29062021163343
53;514;29062021163343
54;517;29062021163343
55;526;29062021163343
56;539;29062021163343
57;546;29062021163343
58;564;29062021163343
59;577;29062021163343
60;590;29062021163343
61;601;29062021163343
62;611;29062021163343
63;616;29062021163343
64;622;29062021163343
65;621;29062021163343
66;621;29062021163343
67;617;29062021163343
68;609;29062021163343
69;599;29062021163343
70;584;29062021163343
71;571;29062021163343
72;561;29062021163343
73;542;29062021163343
74;530;29062021163343
75;506;29062021163343
76;492;29062021163343
77;481;29062021163343
78;460;29062021163343
79;445;29062021163343
80;424;29062021163343
81;410;29062021163343
82;397;29062021163343
83;388;29062021163343
84;377;29062021163343
85;368;29062021163343
86;364;29062021163343
87;359;29062021163343
88;352;29062021163343
89;340;29062021163343
90;337;29062021163343
91;329;29062021163343
92;316;29062021163343
93;311;29062021163343
94;303;29062021163343
95;292;29062021163343
96;286;29062021163343
97;276;29062021163343
98;268;29062021163343
99;265;29062021163343
100;256;29062021163343
101;258;29062021163343
102;246;29062021163343
103;238;29062021163343
104;236;29062021163343
105;230;29062021163343
106;229;29062021163343
107;220;29062021163343
108;220;29062021163343
109;214;29062021163343
110;207;29062021163343
111;206;29062021163343
112;205;29062021163343
113;196;29062021163343
114;196;29062021163343
115;194;29062021163343
116;192;29062021163343
117;192;29062021163343
118;186;29062021163343
119;185;29062021163343
120;181;29062021163343
121;177;29062021163343
122;177;29062021163343
123;175;29062021163343
124;173;29062021163343
125;171;29062021163343
126;166;29062021163343
127;166;29062021163343
128;166;29062021163343
129;160;29062021163343
130;161;29062021163343
131;160;29062021163343
132;154;29062021163343
133;159;29062021163343
134;153;29062021163343
135;151;29062021163343
136;153;29062021163343
137;148;29062021163343
138;150;29062021163343
139;149;29062021163343
140;145;29062021163343
141;147;29062021163343
142;143;29062021163343
143;141;29062021163343
144;142;29062021163343
145;139;29062021163343
146;141;29062021163343
147;141;29062021163343
148;138;29062021163343
149;139;29062021163343
150;138;29062021163343
151;138;29062021163343
152;137;29062021163343
153;134;29062021163343
154;136;29062021163343
155;135;29062021163343
156;134;29062021163343
157;133;29062021163343
158;133;29062021163343
159;131;29062021163343
160;133;29062021163343
161;131;29062021163343
162;132;29062021163343
163;131;29062021163343
164;131;29062021163343
165;133;29062021163343
166;130;29062021163343
167;129;29062021163343
168;131;29062021163343
169;126;29062021163343
170;131;29062021163343
171;128;29062021163343
172;128;29062021163343
173;130;29062021163343
174;126;29062021163343
175;126;29062021163343
176;129;29062021163343
177;125;29062021163343
178;130;29062021163343
179;128;29062021163343
180;127;29062021163343
181;129;29062021163343
182;128;29062021163343
183;126;29062021163343
184;127;29062021163343
185;124;29062021163343
186;129;29062021163343
187;126;29062021163343
188;125;29062021163343
189;127;29062021163343
190;125;29062021163343
191;127;29062021163343
192;129;29062021163343
193;125;29062021163343
194;127;29062021163343
195;127;29062021163343
196;125;29062021163343
197;125;29062021163343
198;125;29062021163343
199;124;29062021163343
200;0;29062021163343
0;0;29062021163344
1;143;29062021163344
2;148;29062021163344
3;145;29062021163344
4;148;29062021163344
5;150;29062021163344
6;150;29062021163344
7;154;29062021163344
8;157;29062021163344
9;154;29062021163344
10;159;29062021163344
11;163;29062021163344
12;166;29062021163344
13;177;29062021163344
14;182;29062021163344
15;201;29062021163344
16;224;29062021163344
17;267;29062021163344
18;363;29062021163344
19;557;29062021163344
20;927;29062021163344
21;1023;29062021163344
22;1023;29062021163344
23;1023;29062021163344
24;1023;29062021163344
25;1023;29062021163344
26;1004;29062021163344
27;1008;29062021163344
28;1023;29062021163344
29;1023;29062021163344
30;1023;29062021163344
31;1023;29062021163344
32;1023;29062021163344
33;1023;29062021163344
34;1023;29062021163344
35;1023;29062021163344
36;1023;29062021163344
37;1023;29062021163344
38;992;29062021163344
39;842;29062021163344
40;718;29062021163344
41;633;29062021163344
42;581;29062021163344
43;544;29062021163344
44;527;29062021163344
45;517;29062021163344
46;511;29062021163344
47;505;29062021163344
48;507;29062021163344
49;506;29062021163344
50;498;29062021163344
51;510;29062021163344
52;501;29062021163344
53;511;29062021163344
54;517;29062021163344
55;525;29062021163344
56;538;29062021163344
57;549;29062021163344
58;569;29062021163344
59;575;29062021163344
60;588;29062021163344
61;602;29062021163344
62;609;29062021163344
63;617;29062021163344
64;621;29062021163344
65;621;29062021163344
66;624;29062021163344
67;621;29062021163344
68;612;29062021163344
69;603;29062021163344
70;584;29062021163344
71;572;29062021163344
72;563;29062021163344
73;542;29062021163344
74;526;29062021163344
75;505;29062021163344
76;493;29062021163344
77;473;29062021163344
78;462;29062021163344
79;445;29062021163344
80;426;29062021163344
81;409;29062021163344
82;403;29062021163344
83;385;29062021163344
84;378;29062021163344
85;372;29062021163344
86;363;29062021163344
87;361;29062021163344
88;355;29062021163344
89;344;29062021163344
90;340;29062021163344
91;328;29062021163344
92;317;29062021163344
93;312;29062021163344
94;303;29062021163344
95;293;29062021163344
96;284;29062021163344
97;275;29062021163344
98;268;29062021163344
99;264;29062021163344
100;257;29062021163344
101;257;29062021163344
102;248;29062021163344
103;242;29062021163344
104;237;29062021163344
105;229;29062021163344
106;229;29062021163344
107;221;29062021163344
108;215;29062021163344
109;213;29062021163344
110;210;29062021163344
111;207;29062021163344
112;204;29062021163344
113;196;29062021163344
114;195;29062021163344
115;195;29062021163344
116;191;29062021163344
117;192;29062021163344
118;186;29062021163344
119;184;29062021163344
120;181;29062021163344
121;178;29062021163344
122;177;29062021163344
123;175;29062021163344
124;172;29062021163344
125;171;29062021163344
126;166;29062021163344
127;167;29062021163344
128;164;29062021163344
129;160;29062021163344
130;159;29062021163344
131;159;29062021163344
132;156;29062021163344
133;161;29062021163344
134;152;29062021163344
135;153;29062021163344
136;153;29062021163344
137;147;29062021163344
138;151;29062021163344
139;146;29062021163344
140;145;29062021163344
141;146;29062021163344
142;144;29062021163344
143;141;29062021163344
144;143;29062021163344
145;139;29062021163344
146;142;29062021163344
147;141;29062021163344
148;138;29062021163344
149;138;29062021163344
150;138;29062021163344
151;137;29062021163344
152;136;29062021163344
153;134;29062021163344
154;136;29062021163344
155;136;29062021163344
156;133;29062021163344
157;133;29062021163344
158;132;29062021163344
159;130;29062021163344
160;132;29062021163344
161;132;29062021163344
162;133;29062021163344
163;132;29062021163344
164;131;29062021163344
165;132;29062021163344
166;129;29062021163344
167;131;29062021163344
168;131;29062021163344
169;126;29062021163344
170;130;29062021163344
171;128;29062021163344
172;128;29062021163344
173;131;29062021163344
174;128;29062021163344
175;127;29062021163344
176;128;29062021163344
177;127;29062021163344
178;129;29062021163344
179;127;29062021163344
180;127;29062021163344
181;128;29062021163344
182;129;29062021163344
183;125;29062021163344
184;127;29062021163344
185;124;29062021163344
186;128;29062021163344
187;126;29062021163344
188;125;29062021163344
189;127;29062021163344
190;124;29062021163344
191;126;29062021163344
192;129;29062021163344
193;125;29062021163344
194;127;29062021163344
195;127;29062021163344
196;125;29062021163344
197;126;29062021163344
198;126;29062021163344
199;124;29062021163344
200;0;29062021163344
0;0;29062021163344
1;143;29062021163344
2;147;29062021163344
3;146;29062021163344
4;147;29062021163344
5;148;29062021163344
6;149;29062021163344
7;153;29062021163344
8;157;29062021163344
9;157;29062021163344
10;161;29062021163344
11;162;29062021163344
12;167;29062021163344
13;177;29062021163344
14;184;29062021163344
15;199;29062021163344
16;223;29062021163344
17;270;29062021163344
18;364;29062021163344
19;560;29062021163344
20;931;29062021163344
21;1023;29062021163344
22;1023;29062021163344
23;1023;29062021163344
24;1023;29062021163344
25;1023;29062021163344
26;1004;29062021163344
27;1011;29062021163344
28;1023;29062021163344
29;1023;29062021163344
30;1023;29062021163344
31;1023;29062021163344
32;1023;29062021163344
33;1023;29062021163344
34;1023;29062021163344
35;1023;29062021163344
36;1023;29062021163344
37;1023;29062021163344
38;991;29062021163344
39;843;29062021163344
40;719;29062021163344
41;632;29062021163344
42;584;29062021163344
43;545;29062021163344
44;525;29062021163344
45;516;29062021163344
46;510;29062021163344
47;507;29062021163344
48;504;29062021163344
49;500;29062021163344
50;502;29062021163344
51;502;29062021163344
52;499;29062021163344
53;512;29062021163344
54;517;29062021163344
55;527;29062021163344
56;535;29062021163344
57;548;29062021163344
58;565;29062021163344
59;577;29062021163344
60;587;29062021163344
61;603;29062021163344
62;610;29062021163344
63;617;29062021163344
64;622;29062021163344
65;619;29062021163344
66;622;29062021163344
67;617;29062021163344
68;605;29062021163344
69;597;29062021163344
70;586;29062021163344
71;577;29062021163344
72;565;29062021163344
73;540;29062021163344
74;526;29062021163344
75;506;29062021163344
76;489;29062021163344
77;476;29062021163344
78;457;29062021163344
79;447;29062021163344
80;425;29062021163344
81;407;29062021163344
82;400;29062021163344
83;386;29062021163344
84;380;29062021163344
85;372;29062021163344
86;365;29062021163344
87;361;29062021163344
88;354;29062021163344
89;344;29062021163344
90;340;29062021163344
91;331;29062021163344
92;314;29062021163344
93;310;29062021163344
94;299;29062021163344
95;291;29062021163344
96;284;29062021163344
97;277;29062021163344
98;271;29062021163344
99;265;29062021163344
100;256;29062021163344
101;256;29062021163344
102;246;29062021163344
103;241;29062021163344
104;237;29062021163344
105;230;29062021163344
106;229;29062021163344
107;222;29062021163344
108;217;29062021163344
109;216;29062021163344
110;209;29062021163344
111;206;29062021163344
112;202;29062021163344
113;197;29062021163344
114;195;29062021163344
115;194;29062021163344
116;192;29062021163344
117;189;29062021163344
118;185;29062021163344
119;185;29062021163344
120;182;29062021163344
121;176;29062021163344
122;177;29062021163344
123;173;29062021163344
124;172;29062021163344
125;170;29062021163344
126;167;29062021163344
127;168;29062021163344
128;167;29062021163344
129;160;29062021163344
130;160;29062021163344
131;158;29062021163344
132;156;29062021163344
133;159;29062021163344
134;152;29062021163344
135;151;29062021163344
136;152;29062021163344
137;148;29062021163344
138;149;29062021163344
139;147;29062021163344
140;145;29062021163344
141;147;29062021163344
142;143;29062021163344
143;141;29062021163344
144;144;29062021163344
145;140;29062021163344
146;142;29062021163344
147;142;29062021163344
148;137;29062021163344
149;138;29062021163344
150;139;29062021163344
151;139;29062021163344
152;135;29062021163344
153;134;29062021163344
154;136;29062021163344
155;136;29062021163344
156;133;29062021163344
157;133;29062021163344
158;132;29062021163344
159;132;29062021163344
160;133;29062021163344
161;130;29062021163344
162;132;29062021163344
163;132;29062021163344
164;131;29062021163344
165;132;29062021163344
166;129;29062021163344
167;129;29062021163344
168;131;29062021163344
169;126;29062021163344
170;130;29062021163344
171;129;29062021163344
172;128;29062021163344
173;130;29062021163344
174;126;29062021163344
175;126;29062021163344
176;129;29062021163344
177;126;29062021163344
178;130;29062021163344
179;128;29062021163344
180;126;29062021163344
181;128;29062021163344
182;129;29062021163344
183;126;29062021163344
184;127;29062021163344
185;124;29062021163344
186;128;29062021163344
187;127;29062021163344
188;125;29062021163344
189;127;29062021163344
190;124;29062021163344
191;127;29062021163344
192;128;29062021163344
193;125;29062021163344
194;128;29062021163344
195;125;29062021163344
196;124;29062021163344
197;126;29062021163344
198;126;29062021163344
199;125;29062021163344
200;0;29062021163344
