ind;val;datetime
0;0;18062021131215
1;161;18062021131215
2;150;18062021131215
3;146;18062021131215
4;148;18062021131215
5;148;18062021131215
6;147;18062021131215
7;150;18062021131215
8;151;18062021131215
9;146;18062021131215
10;150;18062021131215
11;149;18062021131215
12;147;18062021131215
13;151;18062021131215
14;149;18062021131215
15;153;18062021131215
16;153;18062021131215
17;153;18062021131215
18;165;18062021131215
19;180;18062021131215
20;209;18062021131215
21;285;18062021131215
22;493;18062021131215
23;952;18062021131215
24;1023;18062021131215
25;1023;18062021131215
26;1023;18062021131215
27;1023;18062021131215
28;1023;18062021131215
29;1023;18062021131215
30;1023;18062021131215
31;825;18062021131215
32;628;18062021131215
33;514;18062021131215
34;455;18062021131215
35;420;18062021131215
36;407;18062021131215
37;408;18062021131215
38;416;18062021131215
39;432;18062021131215
40;447;18062021131215
41;465;18062021131215
42;484;18062021131215
43;495;18062021131215
44;514;18062021131215
45;527;18062021131215
46;529;18062021131215
47;540;18062021131215
48;541;18062021131215
49;549;18062021131215
50;556;18062021131215
51;566;18062021131215
52;569;18062021131215
53;583;18062021131215
54;587;18062021131215
55;599;18062021131215
56;614;18062021131215
57;626;18062021131215
58;643;18062021131215
59;659;18062021131215
60;669;18062021131215
61;686;18062021131215
62;689;18062021131215
63;701;18062021131215
64;704;18062021131215
65;695;18062021131215
66;700;18062021131215
67;692;18062021131215
68;681;18062021131215
69;663;18062021131215
70;649;18062021131215
71;638;18062021131215
72;614;18062021131215
73;591;18062021131215
74;568;18062021131215
75;545;18062021131215
76;530;18062021131215
77;510;18062021131215
78;494;18062021131215
79;476;18062021131215
80;459;18062021131215
81;435;18062021131215
82;426;18062021131215
83;415;18062021131215
84;405;18062021131215
85;395;18062021131215
86;393;18062021131215
87;390;18062021131215
88;382;18062021131215
89;366;18062021131215
90;367;18062021131215
91;359;18062021131215
92;345;18062021131215
93;342;18062021131215
94;329;18062021131215
95;316;18062021131215
96;311;18062021131215
97;300;18062021131215
98;293;18062021131215
99;289;18062021131215
100;277;18062021131215
101;281;18062021131215
102;273;18062021131215
103;266;18062021131215
104;261;18062021131215
105;252;18062021131215
106;252;18062021131215
107;244;18062021131215
108;241;18062021131215
109;238;18062021131215
110;230;18062021131215
111;228;18062021131215
112;223;18062021131215
113;218;18062021131215
114;217;18062021131215
115;215;18062021131215
116;211;18062021131215
117;211;18062021131215
118;206;18062021131215
119;207;18062021131215
120;200;18062021131215
121;197;18062021131215
122;196;18062021131215
123;194;18062021131215
124;193;18062021131215
125;190;18062021131215
126;188;18062021131215
127;187;18062021131215
128;188;18062021131215
129;182;18062021131215
130;180;18062021131215
131;180;18062021131215
132;173;18062021131215
133;182;18062021131215
134;171;18062021131215
135;174;18062021131215
136;173;18062021131215
137;169;18062021131215
138;172;18062021131215
139;167;18062021131215
140;166;18062021131215
141;168;18062021131215
142;163;18062021131215
143;161;18062021131215
144;165;18062021131215
145;160;18062021131215
146;161;18062021131215
147;162;18062021131215
148;156;18062021131215
149;158;18062021131215
150;160;18062021131215
151;159;18062021131215
152;156;18062021131215
153;154;18062021131215
154;157;18062021131215
155;157;18062021131215
156;153;18062021131215
157;154;18062021131215
158;152;18062021131215
159;151;18062021131215
160;151;18062021131215
161;151;18062021131215
162;152;18062021131215
163;151;18062021131215
164;151;18062021131215
165;152;18062021131215
166;149;18062021131215
167;151;18062021131215
168;153;18062021131215
169;146;18062021131215
170;151;18062021131215
171;148;18062021131215
172;148;18062021131215
173;153;18062021131215
174;147;18062021131215
175;147;18062021131215
176;149;18062021131215
177;147;18062021131215
178;151;18062021131215
179;148;18062021131215
180;147;18062021131215
181;147;18062021131215
182;150;18062021131215
183;147;18062021131215
184;148;18062021131215
185;143;18062021131215
186;149;18062021131215
187;147;18062021131215
188;146;18062021131215
189;148;18062021131215
190;144;18062021131215
191;146;18062021131215
192;151;18062021131215
193;145;18062021131215
194;149;18062021131215
195;148;18062021131215
196;145;18062021131215
197;145;18062021131215
198;146;18062021131215
199;145;18062021131215
200;0;18062021131215
0;0;18062021131216
1;161;18062021131216
2;150;18062021131216
3;145;18062021131216
4;147;18062021131216
5;146;18062021131216
6;148;18062021131216
7;149;18062021131216
8;150;18062021131216
9;145;18062021131216
10;150;18062021131216
11;147;18062021131216
12;145;18062021131216
13;151;18062021131216
14;148;18062021131216
15;153;18062021131216
16;153;18062021131216
17;153;18062021131216
18;163;18062021131216
19;179;18062021131216
20;206;18062021131216
21;282;18062021131216
22;490;18062021131216
23;946;18062021131216
24;1023;18062021131216
25;1023;18062021131216
26;1023;18062021131216
27;1023;18062021131216
28;1023;18062021131216
29;1023;18062021131216
30;1023;18062021131216
31;825;18062021131216
32;633;18062021131216
33;518;18062021131216
34;457;18062021131216
35;419;18062021131216
36;405;18062021131216
37;411;18062021131216
38;415;18062021131216
39;437;18062021131216
40;447;18062021131216
41;462;18062021131216
42;484;18062021131216
43;496;18062021131216
44;511;18062021131216
45;529;18062021131216
46;529;18062021131216
47;542;18062021131216
48;546;18062021131216
49;549;18062021131216
50;558;18062021131216
51;567;18062021131216
52;566;18062021131216
53;578;18062021131216
54;591;18062021131216
55;602;18062021131216
56;613;18062021131216
57;627;18062021131216
58;642;18062021131216
59;662;18062021131216
60;679;18062021131216
61;686;18062021131216
62;690;18062021131216
63;704;18062021131216
64;711;18062021131216
65;700;18062021131216
66;699;18062021131216
67;695;18062021131216
68;679;18062021131216
69;669;18062021131216
70;651;18062021131216
71;635;18062021131216
72;619;18062021131216
73;595;18062021131216
74;572;18062021131216
75;549;18062021131216
76;532;18062021131216
77;510;18062021131216
78;491;18062021131216
79;477;18062021131216
80;461;18062021131216
81;435;18062021131216
82;431;18062021131216
83;412;18062021131216
84;408;18062021131216
85;397;18062021131216
86;394;18062021131216
87;389;18062021131216
88;384;18062021131216
89;371;18062021131216
90;368;18062021131216
91;358;18062021131216
92;348;18062021131216
93;341;18062021131216
94;330;18062021131216
95;315;18062021131216
96;312;18062021131216
97;299;18062021131216
98;293;18062021131216
99;287;18062021131216
100;280;18062021131216
101;282;18062021131216
102;272;18062021131216
103;264;18062021131216
104;261;18062021131216
105;254;18062021131216
106;253;18062021131216
107;245;18062021131216
108;242;18062021131216
109;237;18062021131216
110;233;18062021131216
111;224;18062021131216
112;225;18062021131216
113;217;18062021131216
114;216;18062021131216
115;216;18062021131216
116;211;18062021131216
117;211;18062021131216
118;207;18062021131216
119;205;18062021131216
120;200;18062021131216
121;196;18062021131216
122;194;18062021131216
123;194;18062021131216
124;192;18062021131216
125;188;18062021131216
126;186;18062021131216
127;187;18062021131216
128;188;18062021131216
129;181;18062021131216
130;180;18062021131216
131;178;18062021131216
132;172;18062021131216
133;181;18062021131216
134;172;18062021131216
135;173;18062021131216
136;173;18062021131216
137;168;18062021131216
138;172;18062021131216
139;166;18062021131216
140;167;18062021131216
141;168;18062021131216
142;162;18062021131216
143;159;18062021131216
144;163;18062021131216
145;161;18062021131216
146;162;18062021131216
147;161;18062021131216
148;157;18062021131216
149;159;18062021131216
150;160;18062021131216
151;158;18062021131216
152;155;18062021131216
153;154;18062021131216
154;156;18062021131216
155;156;18062021131216
156;152;18062021131216
157;151;18062021131216
158;152;18062021131216
159;151;18062021131216
160;151;18062021131216
161;151;18062021131216
162;152;18062021131216
163;151;18062021131216
164;151;18062021131216
165;152;18062021131216
166;149;18062021131216
167;151;18062021131216
168;153;18062021131216
169;147;18062021131216
170;150;18062021131216
171;148;18062021131216
172;147;18062021131216
173;151;18062021131216
174;146;18062021131216
175;147;18062021131216
176;147;18062021131216
177;145;18062021131216
178;151;18062021131216
179;147;18062021131216
180;146;18062021131216
181;147;18062021131216
182;150;18062021131216
183;146;18062021131216
184;147;18062021131216
185;143;18062021131216
186;149;18062021131216
187;145;18062021131216
188;145;18062021131216
189;148;18062021131216
190;143;18062021131216
191;147;18062021131216
192;150;18062021131216
193;145;18062021131216
194;148;18062021131216
195;146;18062021131216
196;145;18062021131216
197;143;18062021131216
198;147;18062021131216
199;145;18062021131216
200;0;18062021131216
0;0;18062021131217
1;161;18062021131217
2;150;18062021131217
3;145;18062021131217
4;148;18062021131217
5;147;18062021131217
6;146;18062021131217
7;149;18062021131217
8;150;18062021131217
9;146;18062021131217
10;149;18062021131217
11;147;18062021131217
12;147;18062021131217
13;151;18062021131217
14;148;18062021131217
15;153;18062021131217
16;153;18062021131217
17;153;18062021131217
18;165;18062021131217
19;176;18062021131217
20;205;18062021131217
21;281;18062021131217
22;490;18062021131217
23;937;18062021131217
24;1023;18062021131217
25;1023;18062021131217
26;1023;18062021131217
27;1023;18062021131217
28;1023;18062021131217
29;1023;18062021131217
30;1023;18062021131217
31;823;18062021131217
32;632;18062021131217
33;518;18062021131217
34;454;18062021131217
35;421;18062021131217
36;399;18062021131217
37;408;18062021131217
38;418;18062021131217
39;434;18062021131217
40;445;18062021131217
41;463;18062021131217
42;482;18062021131217
43;494;18062021131217
44;513;18062021131217
45;528;18062021131217
46;534;18062021131217
47;537;18062021131217
48;544;18062021131217
49;549;18062021131217
50;558;18062021131217
51;565;18062021131217
52;570;18062021131217
53;586;18062021131217
54;585;18062021131217
55;605;18062021131217
56;615;18062021131217
57;625;18062021131217
58;648;18062021131217
59;655;18062021131217
60;671;18062021131217
61;687;18062021131217
62;696;18062021131217
63;702;18062021131217
64;703;18062021131217
65;703;18062021131217
66;701;18062021131217
67;694;18062021131217
68;681;18062021131217
69;668;18062021131217
70;648;18062021131217
71;633;18062021131217
72;617;18062021131217
73;591;18062021131217
74;573;18062021131217
75;548;18062021131217
76;530;18062021131217
77;516;18062021131217
78;492;18062021131217
79;476;18062021131217
80;458;18062021131217
81;435;18062021131217
82;429;18062021131217
83;417;18062021131217
84;405;18062021131217
85;399;18062021131217
86;395;18062021131217
87;388;18062021131217
88;384;18062021131217
89;371;18062021131217
90;366;18062021131217
91;358;18062021131217
92;348;18062021131217
93;340;18062021131217
94;329;18062021131217
95;316;18062021131217
96;312;18062021131217
97;301;18062021131217
98;294;18062021131217
99;286;18062021131217
100;280;18062021131217
101;279;18062021131217
102;273;18062021131217
103;265;18062021131217
104;263;18062021131217
105;254;18062021131217
106;252;18062021131217
107;244;18062021131217
108;243;18062021131217
109;236;18062021131217
110;230;18062021131217
111;226;18062021131217
112;226;18062021131217
113;219;18062021131217
114;217;18062021131217
115;216;18062021131217
116;213;18062021131217
117;213;18062021131217
118;205;18062021131217
119;205;18062021131217
120;199;18062021131217
121;195;18062021131217
122;199;18062021131217
123;193;18062021131217
124;192;18062021131217
125;190;18062021131217
126;186;18062021131217
127;187;18062021131217
128;187;18062021131217
129;183;18062021131217
130;181;18062021131217
131;181;18062021131217
132;173;18062021131217
133;182;18062021131217
134;173;18062021131217
135;171;18062021131217
136;172;18062021131217
137;168;18062021131217
138;171;18062021131217
139;166;18062021131217
140;167;18062021131217
141;168;18062021131217
142;164;18062021131217
143;161;18062021131217
144;163;18062021131217
145;161;18062021131217
146;162;18062021131217
147;162;18062021131217
148;157;18062021131217
149;159;18062021131217
150;158;18062021131217
151;158;18062021131217
152;155;18062021131217
153;153;18062021131217
154;156;18062021131217
155;158;18062021131217
156;154;18062021131217
157;154;18062021131217
158;152;18062021131217
159;152;18062021131217
160;152;18062021131217
161;151;18062021131217
162;151;18062021131217
163;152;18062021131217
164;152;18062021131217
165;153;18062021131217
166;149;18062021131217
167;152;18062021131217
168;153;18062021131217
169;145;18062021131217
170;151;18062021131217
171;149;18062021131217
172;147;18062021131217
173;151;18062021131217
174;147;18062021131217
175;148;18062021131217
176;150;18062021131217
177;145;18062021131217
178;150;18062021131217
179;150;18062021131217
180;147;18062021131217
181;147;18062021131217
182;150;18062021131217
183;144;18062021131217
184;148;18062021131217
185;142;18062021131217
186;149;18062021131217
187;146;18062021131217
188;145;18062021131217
189;148;18062021131217
190;146;18062021131217
191;147;18062021131217
192;150;18062021131217
193;144;18062021131217
194;148;18062021131217
195;146;18062021131217
196;146;18062021131217
197;147;18062021131217
198;147;18062021131217
199;144;18062021131217
200;0;18062021131217
0;0;18062021131217
1;161;18062021131217
2;150;18062021131217
3;146;18062021131217
4;149;18062021131217
5;147;18062021131217
6;147;18062021131217
7;148;18062021131217
8;150;18062021131217
9;145;18062021131217
10;150;18062021131217
11;147;18062021131217
12;147;18062021131217
13;152;18062021131217
14;149;18062021131217
15;152;18062021131217
16;153;18062021131217
17;153;18062021131217
18;164;18062021131217
19;178;18062021131217
20;204;18062021131217
21;279;18062021131217
22;484;18062021131217
23;930;18062021131217
24;1023;18062021131217
25;1023;18062021131217
26;1023;18062021131217
27;1023;18062021131217
28;1023;18062021131217
29;1023;18062021131217
30;1023;18062021131217
31;817;18062021131217
32;624;18062021131217
33;511;18062021131217
34;454;18062021131217
35;419;18062021131217
36;400;18062021131217
37;405;18062021131217
38;416;18062021131217
39;430;18062021131217
40;447;18062021131217
41;463;18062021131217
42;486;18062021131217
43;495;18062021131217
44;511;18062021131217
45;527;18062021131217
46;531;18062021131217
47;543;18062021131217
48;544;18062021131217
49;548;18062021131217
50;556;18062021131217
51;562;18062021131217
52;570;18062021131217
53;583;18062021131217
54;590;18062021131217
55;601;18062021131217
56;615;18062021131217
57;629;18062021131217
58;646;18062021131217
59;654;18062021131217
60;673;18062021131217
61;689;18062021131217
62;694;18062021131217
63;704;18062021131217
64;703;18062021131217
65;700;18062021131217
66;702;18062021131217
67;696;18062021131217
68;685;18062021131217
69;666;18062021131217
70;649;18062021131217
71;634;18062021131217
72;618;18062021131217
73;590;18062021131217
74;577;18062021131217
75;551;18062021131217
76;532;18062021131217
77;516;18062021131217
78;497;18062021131217
79;480;18062021131217
80;461;18062021131217
81;437;18062021131217
82;430;18062021131217
83;415;18062021131217
84;405;18062021131217
85;399;18062021131217
86;395;18062021131217
87;393;18062021131217
88;382;18062021131217
89;369;18062021131217
90;370;18062021131217
91;359;18062021131217
92;345;18062021131217
93;340;18062021131217
94;332;18062021131217
95;319;18062021131217
96;313;18062021131217
97;302;18062021131217
98;296;18062021131217
99;289;18062021131217
100;282;18062021131217
101;281;18062021131217
102;274;18062021131217
103;262;18062021131217
104;260;18062021131217
105;253;18062021131217
106;252;18062021131217
107;245;18062021131217
108;243;18062021131217
109;237;18062021131217
110;229;18062021131217
111;226;18062021131217
112;224;18062021131217
113;219;18062021131217
114;217;18062021131217
115;213;18062021131217
116;211;18062021131217
117;212;18062021131217
118;206;18062021131217
119;206;18062021131217
120;202;18062021131217
121;195;18062021131217
122;198;18062021131217
123;192;18062021131217
124;193;18062021131217
125;191;18062021131217
126;185;18062021131217
127;188;18062021131217
128;188;18062021131217
129;181;18062021131217
130;182;18062021131217
131;178;18062021131217
132;175;18062021131217
133;181;18062021131217
134;172;18062021131217
135;171;18062021131217
136;171;18062021131217
137;168;18062021131217
138;171;18062021131217
139;167;18062021131217
140;165;18062021131217
141;168;18062021131217
142;163;18062021131217
143;161;18062021131217
144;164;18062021131217
145;160;18062021131217
146;162;18062021131217
147;163;18062021131217
148;157;18062021131217
149;160;18062021131217
150;160;18062021131217
151;157;18062021131217
152;156;18062021131217
153;155;18062021131217
154;155;18062021131217
155;158;18062021131217
156;154;18062021131217
157;153;18062021131217
158;152;18062021131217
159;151;18062021131217
160;152;18062021131217
161;151;18062021131217
162;151;18062021131217
163;153;18062021131217
164;151;18062021131217
165;151;18062021131217
166;148;18062021131217
167;151;18062021131217
168;151;18062021131217
169;145;18062021131217
170;151;18062021131217
171;149;18062021131217
172;147;18062021131217
173;150;18062021131217
174;148;18062021131217
175;147;18062021131217
176;149;18062021131217
177;145;18062021131217
178;151;18062021131217
179;150;18062021131217
180;147;18062021131217
181;148;18062021131217
182;150;18062021131217
183;146;18062021131217
184;147;18062021131217
185;142;18062021131217
186;150;18062021131217
187;146;18062021131217
188;146;18062021131217
189;149;18062021131217
190;145;18062021131217
191;148;18062021131217
192;150;18062021131217
193;144;18062021131217
194;150;18062021131217
195;146;18062021131217
196;145;18062021131217
197;146;18062021131217
198;145;18062021131217
199;144;18062021131217
200;0;18062021131217
0;0;18062021131218
1;161;18062021131218
2;151;18062021131218
3;146;18062021131218
4;149;18062021131218
5;148;18062021131218
6;147;18062021131218
7;150;18062021131218
8;150;18062021131218
9;145;18062021131218
10;149;18062021131218
11;149;18062021131218
12;146;18062021131218
13;151;18062021131218
14;149;18062021131218
15;152;18062021131218
16;154;18062021131218
17;152;18062021131218
18;163;18062021131218
19;177;18062021131218
20;203;18062021131218
21;278;18062021131218
22;477;18062021131218
23;913;18062021131218
24;1023;18062021131218
25;1023;18062021131218
26;1023;18062021131218
27;1023;18062021131218
28;1023;18062021131218
29;1023;18062021131218
30;1023;18062021131218
31;810;18062021131218
32;616;18062021131218
33;510;18062021131218
34;452;18062021131218
35;419;18062021131218
36;402;18062021131218
37;406;18062021131218
38;413;18062021131218
39;431;18062021131218
40;443;18062021131218
41;457;18062021131218
42;483;18062021131218
43;497;18062021131218
44;508;18062021131218
45;529;18062021131218
46;531;18062021131218
47;538;18062021131218
48;551;18062021131218
49;548;18062021131218
50;551;18062021131218
51;565;18062021131218
52;567;18062021131218
53;579;18062021131218
54;588;18062021131218
55;597;18062021131218
56;615;18062021131218
57;632;18062021131218
58;644;18062021131218
59;657;18062021131218
60;676;18062021131218
61;686;18062021131218
62;687;18062021131218
63;703;18062021131218
64;706;18062021131218
65;696;18062021131218
66;695;18062021131218
67;692;18062021131218
68;683;18062021131218
69;666;18062021131218
70;648;18062021131218
71;636;18062021131218
72;619;18062021131218
73;594;18062021131218
74;570;18062021131218
75;545;18062021131218
76;527;18062021131218
77;512;18062021131218
78;493;18062021131218
79;475;18062021131218
80;461;18062021131218
81;437;18062021131218
82;427;18062021131218
83;418;18062021131218
84;410;18062021131218
85;396;18062021131218
86;393;18062021131218
87;392;18062021131218
88;383;18062021131218
89;372;18062021131218
90;369;18062021131218
91;357;18062021131218
92;342;18062021131218
93;339;18062021131218
94;326;18062021131218
95;316;18062021131218
96;311;18062021131218
97;302;18062021131218
98;295;18062021131218
99;290;18062021131218
100;278;18062021131218
101;283;18062021131218
102;274;18062021131218
103;265;18062021131218
104;261;18062021131218
105;255;18062021131218
106;249;18062021131218
107;244;18062021131218
108;242;18062021131218
109;236;18062021131218
110;229;18062021131218
111;227;18062021131218
112;225;18062021131218
113;218;18062021131218
114;217;18062021131218
115;216;18062021131218
116;212;18062021131218
117;212;18062021131218
118;205;18062021131218
119;208;18062021131218
120;202;18062021131218
121;197;18062021131218
122;196;18062021131218
123;194;18062021131218
124;193;18062021131218
125;190;18062021131218
126;185;18062021131218
127;186;18062021131218
128;188;18062021131218
129;181;18062021131218
130;181;18062021131218
131;180;18062021131218
132;175;18062021131218
133;183;18062021131218
134;171;18062021131218
135;173;18062021131218
136;173;18062021131218
137;169;18062021131218
138;170;18062021131218
139;168;18062021131218
140;167;18062021131218
141;167;18062021131218
142;163;18062021131218
143;160;18062021131218
144;165;18062021131218
145;160;18062021131218
146;162;18062021131218
147;162;18062021131218
148;159;18062021131218
149;160;18062021131218
150;159;18062021131218
151;158;18062021131218
152;154;18062021131218
153;154;18062021131218
154;157;18062021131218
155;157;18062021131218
156;155;18062021131218
157;153;18062021131218
158;151;18062021131218
159;151;18062021131218
160;152;18062021131218
161;150;18062021131218
162;152;18062021131218
163;153;18062021131218
164;152;18062021131218
165;153;18062021131218
166;149;18062021131218
167;152;18062021131218
168;152;18062021131218
169;146;18062021131218
170;150;18062021131218
171;149;18062021131218
172;148;18062021131218
173;151;18062021131218
174;146;18062021131218
175;146;18062021131218
176;149;18062021131218
177;147;18062021131218
178;152;18062021131218
179;148;18062021131218
180;147;18062021131218
181;147;18062021131218
182;150;18062021131218
183;147;18062021131218
184;148;18062021131218
185;144;18062021131218
186;149;18062021131218
187;146;18062021131218
188;145;18062021131218
189;148;18062021131218
190;144;18062021131218
191;147;18062021131218
192;149;18062021131218
193;145;18062021131218
194;148;18062021131218
195;147;18062021131218
196;143;18062021131218
197;145;18062021131218
198;147;18062021131218
199;144;18062021131218
200;0;18062021131218
0;0;18062021131219
1;161;18062021131219
2;150;18062021131219
3;146;18062021131219
4;147;18062021131219
5;146;18062021131219
6;146;18062021131219
7;149;18062021131219
8;150;18062021131219
9;143;18062021131219
10;149;18062021131219
11;149;18062021131219
12;146;18062021131219
13;151;18062021131219
14;147;18062021131219
15;151;18062021131219
16;152;18062021131219
17;152;18062021131219
18;162;18062021131219
19;175;18062021131219
20;204;18062021131219
21;279;18062021131219
22;473;18062021131219
23;907;18062021131219
24;1023;18062021131219
25;1023;18062021131219
26;1023;18062021131219
27;1023;18062021131219
28;1023;18062021131219
29;1023;18062021131219
30;1023;18062021131219
31;804;18062021131219
32;616;18062021131219
33;508;18062021131219
34;450;18062021131219
35;418;18062021131219
36;399;18062021131219
37;405;18062021131219
38;411;18062021131219
39;434;18062021131219
40;446;18062021131219
41;462;18062021131219
42;483;18062021131219
43;499;18062021131219
44;508;18062021131219
45;527;18062021131219
46;532;18062021131219
47;537;18062021131219
48;546;18062021131219
49;549;18062021131219
50;550;18062021131219
51;566;18062021131219
52;570;18062021131219
53;586;18062021131219
54;590;18062021131219
55;603;18062021131219
56;613;18062021131219
57;626;18062021131219
58;650;18062021131219
59;657;18062021131219
60;676;18062021131219
61;688;18062021131219
62;692;18062021131219
63;703;18062021131219
64;706;18062021131219
65;702;18062021131219
66;701;18062021131219
67;692;18062021131219
68;681;18062021131219
69;668;18062021131219
70;650;18062021131219
71;641;18062021131219
72;623;18062021131219
73;591;18062021131219
74;575;18062021131219
75;547;18062021131219
76;531;18062021131219
77;517;18062021131219
78;498;18062021131219
79;478;18062021131219
80;460;18062021131219
81;438;18062021131219
82;426;18062021131219
83;417;18062021131219
84;402;18062021131219
85;399;18062021131219
86;393;18062021131219
87;393;18062021131219
88;384;18062021131219
89;370;18062021131219
90;370;18062021131219
91;358;18062021131219
92;342;18062021131219
93;342;18062021131219
94;331;18062021131219
95;318;18062021131219
96;311;18062021131219
97;302;18062021131219
98;296;18062021131219
99;291;18062021131219
100;281;18062021131219
101;281;18062021131219
102;274;18062021131219
103;263;18062021131219
104;263;18062021131219
105;252;18062021131219
106;251;18062021131219
107;246;18062021131219
108;244;18062021131219
109;236;18062021131219
110;230;18062021131219
111;226;18062021131219
112;225;18062021131219
113;217;18062021131219
114;216;18062021131219
115;216;18062021131219
116;213;18062021131219
117;213;18062021131219
118;206;18062021131219
119;206;18062021131219
120;201;18062021131219
121;196;18062021131219
122;196;18062021131219
123;195;18062021131219
124;194;18062021131219
125;190;18062021131219
126;187;18062021131219
127;185;18062021131219
128;186;18062021131219
129;183;18062021131219
130;182;18062021131219
131;181;18062021131219
132;175;18062021131219
133;182;18062021131219
134;172;18062021131219
135;171;18062021131219
136;174;18062021131219
137;167;18062021131219
138;171;18062021131219
139;167;18062021131219
140;167;18062021131219
141;169;18062021131219
142;163;18062021131219
143;162;18062021131219
144;164;18062021131219
145;161;18062021131219
146;161;18062021131219
147;161;18062021131219
148;158;18062021131219
149;160;18062021131219
150;160;18062021131219
151;158;18062021131219
152;156;18062021131219
153;153;18062021131219
154;157;18062021131219
155;158;18062021131219
156;154;18062021131219
157;153;18062021131219
158;151;18062021131219
159;151;18062021131219
160;151;18062021131219
161;152;18062021131219
162;152;18062021131219
163;152;18062021131219
164;151;18062021131219
165;153;18062021131219
166;149;18062021131219
167;151;18062021131219
168;153;18062021131219
169;147;18062021131219
170;151;18062021131219
171;148;18062021131219
172;146;18062021131219
173;152;18062021131219
174;147;18062021131219
175;147;18062021131219
176;149;18062021131219
177;146;18062021131219
178;150;18062021131219
179;149;18062021131219
180;147;18062021131219
181;147;18062021131219
182;150;18062021131219
183;146;18062021131219
184;148;18062021131219
185;143;18062021131219
186;149;18062021131219
187;146;18062021131219
188;146;18062021131219
189;148;18062021131219
190;144;18062021131219
191;147;18062021131219
192;149;18062021131219
193;145;18062021131219
194;150;18062021131219
195;146;18062021131219
196;145;18062021131219
197;145;18062021131219
198;146;18062021131219
199;144;18062021131219
200;0;18062021131219
0;0;18062021131220
1;161;18062021131220
2;149;18062021131220
3;146;18062021131220
4;148;18062021131220
5;147;18062021131220
6;146;18062021131220
7;150;18062021131220
8;150;18062021131220
9;145;18062021131220
10;150;18062021131220
11;148;18062021131220
12;146;18062021131220
13;151;18062021131220
14;147;18062021131220
15;152;18062021131220
16;152;18062021131220
17;152;18062021131220
18;163;18062021131220
19;176;18062021131220
20;201;18062021131220
21;274;18062021131220
22;464;18062021131220
23;892;18062021131220
24;1023;18062021131220
25;1023;18062021131220
26;1023;18062021131220
27;1023;18062021131220
28;1023;18062021131220
29;1023;18062021131220
30;1023;18062021131220
31;803;18062021131220
32;612;18062021131220
33;507;18062021131220
34;450;18062021131220
35;415;18062021131220
36;399;18062021131220
37;402;18062021131220
38;413;18062021131220
39;431;18062021131220
40;448;18062021131220
41;460;18062021131220
42;485;18062021131220
43;500;18062021131220
44;511;18062021131220
45;526;18062021131220
46;534;18062021131220
47;543;18062021131220
48;545;18062021131220
49;549;18062021131220
50;555;18062021131220
51;563;18062021131220
52;565;18062021131220
53;582;18062021131220
54;595;18062021131220
55;602;18062021131220
56;618;18062021131220
57;633;18062021131220
58;647;18062021131220
59;660;18062021131220
60;672;18062021131220
61;684;18062021131220
62;695;18062021131220
63;699;18062021131220
64;708;18062021131220
65;702;18062021131220
66;702;18062021131220
67;692;18062021131220
68;683;18062021131220
69;668;18062021131220
70;653;18062021131220
71;634;18062021131220
72;619;18062021131220
73;597;18062021131220
74;575;18062021131220
75;544;18062021131220
76;530;18062021131220
77;510;18062021131220
78;494;18062021131220
79;478;18062021131220
80;458;18062021131220
81;438;18062021131220
82;429;18062021131220
83;416;18062021131220
84;407;18062021131220
85;398;18062021131220
86;393;18062021131220
87;387;18062021131220
88;381;18062021131220
89;369;18062021131220
90;370;18062021131220
91;360;18062021131220
92;347;18062021131220
93;341;18062021131220
94;333;18062021131220
95;318;18062021131220
96;311;18062021131220
97;302;18062021131220
98;294;18062021131220
99;288;18062021131220
100;278;18062021131220
101;285;18062021131220
102;273;18062021131220
103;264;18062021131220
104;260;18062021131220
105;256;18062021131220
106;250;18062021131220
107;245;18062021131220
108;242;18062021131220
109;235;18062021131220
110;230;18062021131220
111;226;18062021131220
112;225;18062021131220
113;218;18062021131220
114;216;18062021131220
115;216;18062021131220
116;211;18062021131220
117;213;18062021131220
118;206;18062021131220
119;204;18062021131220
120;201;18062021131220
121;196;18062021131220
122;195;18062021131220
123;192;18062021131220
124;193;18062021131220
125;190;18062021131220
126;187;18062021131220
127;188;18062021131220
128;188;18062021131220
129;183;18062021131220
130;181;18062021131220
131;180;18062021131220
132;175;18062021131220
133;183;18062021131220
134;172;18062021131220
135;172;18062021131220
136;172;18062021131220
137;168;18062021131220
138;171;18062021131220
139;167;18062021131220
140;167;18062021131220
141;169;18062021131220
142;164;18062021131220
143;160;18062021131220
144;164;18062021131220
145;159;18062021131220
146;163;18062021131220
147;162;18062021131220
148;158;18062021131220
149;159;18062021131220
150;160;18062021131220
151;157;18062021131220
152;155;18062021131220
153;153;18062021131220
154;154;18062021131220
155;157;18062021131220
156;156;18062021131220
157;154;18062021131220
158;152;18062021131220
159;152;18062021131220
160;151;18062021131220
161;151;18062021131220
162;151;18062021131220
163;153;18062021131220
164;151;18062021131220
165;153;18062021131220
166;150;18062021131220
167;150;18062021131220
168;152;18062021131220
169;146;18062021131220
170;150;18062021131220
171;148;18062021131220
172;147;18062021131220
173;153;18062021131220
174;146;18062021131220
175;148;18062021131220
176;149;18062021131220
177;147;18062021131220
178;151;18062021131220
179;148;18062021131220
180;147;18062021131220
181;149;18062021131220
182;150;18062021131220
183;145;18062021131220
184;148;18062021131220
185;142;18062021131220
186;150;18062021131220
187;146;18062021131220
188;145;18062021131220
189;147;18062021131220
190;144;18062021131220
191;148;18062021131220
192;149;18062021131220
193;145;18062021131220
194;148;18062021131220
195;146;18062021131220
196;145;18062021131220
197;146;18062021131220
198;146;18062021131220
199;144;18062021131220
200;0;18062021131220
0;0;18062021131221
1;161;18062021131221
2;151;18062021131221
3;145;18062021131221
4;146;18062021131221
5;146;18062021131221
6;146;18062021131221
7;149;18062021131221
8;150;18062021131221
9;146;18062021131221
10;150;18062021131221
11;148;18062021131221
12;146;18062021131221
13;151;18062021131221
14;148;18062021131221
15;152;18062021131221
16;152;18062021131221
17;153;18062021131221
18;162;18062021131221
19;174;18062021131221
20;201;18062021131221
21;270;18062021131221
22;461;18062021131221
23;889;18062021131221
24;1023;18062021131221
25;1023;18062021131221
26;1023;18062021131221
27;1023;18062021131221
28;1023;18062021131221
29;1023;18062021131221
30;1023;18062021131221
31;792;18062021131221
32;608;18062021131221
33;503;18062021131221
34;445;18062021131221
35;412;18062021131221
36;396;18062021131221
37;404;18062021131221
38;412;18062021131221
39;428;18062021131221
40;446;18062021131221
41;456;18062021131221
42;483;18062021131221
43;492;18062021131221
44;511;18062021131221
45;523;18062021131221
46;538;18062021131221
47;541;18062021131221
48;545;18062021131221
49;551;18062021131221
50;558;18062021131221
51;560;18062021131221
52;567;18062021131221
53;583;18062021131221
54;591;18062021131221
55;597;18062021131221
56;618;18062021131221
57;628;18062021131221
58;651;18062021131221
59;652;18062021131221
60;675;18062021131221
61;688;18062021131221
62;690;18062021131221
63;695;18062021131221
64;701;18062021131221
65;702;18062021131221
66;697;18062021131221
67;694;18062021131221
68;678;18062021131221
69;666;18062021131221
70;653;18062021131221
71;631;18062021131221
72;619;18062021131221
73;590;18062021131221
74;574;18062021131221
75;547;18062021131221
76;529;18062021131221
77;516;18062021131221
78;494;18062021131221
79;478;18062021131221
80;454;18062021131221
81;433;18062021131221
82;429;18062021131221
83;416;18062021131221
84;411;18062021131221
85;400;18062021131221
86;395;18062021131221
87;390;18062021131221
88;381;18062021131221
89;371;18062021131221
90;368;18062021131221
91;357;18062021131221
92;344;18062021131221
93;342;18062021131221
94;331;18062021131221
95;316;18062021131221
96;313;18062021131221
97;301;18062021131221
98;294;18062021131221
99;287;18062021131221
100;279;18062021131221
101;281;18062021131221
102;274;18062021131221
103;263;18062021131221
104;261;18062021131221
105;253;18062021131221
106;252;18062021131221
107;245;18062021131221
108;241;18062021131221
109;239;18062021131221
110;230;18062021131221
111;224;18062021131221
112;224;18062021131221
113;219;18062021131221
114;217;18062021131221
115;215;18062021131221
116;212;18062021131221
117;212;18062021131221
118;206;18062021131221
119;207;18062021131221
120;199;18062021131221
121;196;18062021131221
122;198;18062021131221
123;194;18062021131221
124;194;18062021131221
125;189;18062021131221
126;185;18062021131221
127;188;18062021131221
128;189;18062021131221
129;184;18062021131221
130;182;18062021131221
131;181;18062021131221
132;177;18062021131221
133;183;18062021131221
134;174;18062021131221
135;173;18062021131221
136;173;18062021131221
137;170;18062021131221
138;172;18062021131221
139;165;18062021131221
140;166;18062021131221
141;168;18062021131221
142;163;18062021131221
143;160;18062021131221
144;165;18062021131221
145;160;18062021131221
146;162;18062021131221
147;161;18062021131221
148;158;18062021131221
149;159;18062021131221
150;158;18062021131221
151;158;18062021131221
152;153;18062021131221
153;154;18062021131221
154;157;18062021131221
155;156;18062021131221
156;153;18062021131221
157;153;18062021131221
158;151;18062021131221
159;149;18062021131221
160;152;18062021131221
161;151;18062021131221
162;152;18062021131221
163;153;18062021131221
164;152;18062021131221
165;154;18062021131221
166;149;18062021131221
167;152;18062021131221
168;153;18062021131221
169;146;18062021131221
170;150;18062021131221
171;148;18062021131221
172;147;18062021131221
173;150;18062021131221
174;148;18062021131221
175;145;18062021131221
176;149;18062021131221
177;146;18062021131221
178;151;18062021131221
179;148;18062021131221
180;146;18062021131221
181;146;18062021131221
182;149;18062021131221
183;146;18062021131221
184;148;18062021131221
185;144;18062021131221
186;148;18062021131221
187;145;18062021131221
188;146;18062021131221
189;146;18062021131221
190;144;18062021131221
191;147;18062021131221
192;149;18062021131221
193;145;18062021131221
194;149;18062021131221
195;146;18062021131221
196;145;18062021131221
197;145;18062021131221
198;146;18062021131221
199;145;18062021131221
200;0;18062021131221
0;0;18062021131222
1;162;18062021131222
2;150;18062021131222
3;145;18062021131222
4;147;18062021131222
5;147;18062021131222
6;147;18062021131222
7;149;18062021131222
8;151;18062021131222
9;145;18062021131222
10;150;18062021131222
11;149;18062021131222
12;147;18062021131222
13;150;18062021131222
14;149;18062021131222
15;152;18062021131222
16;153;18062021131222
17;153;18062021131222
18;163;18062021131222
19;175;18062021131222
20;203;18062021131222
21;273;18062021131222
22;456;18062021131222
23;880;18062021131222
24;1023;18062021131222
25;1023;18062021131222
26;1023;18062021131222
27;1023;18062021131222
28;1023;18062021131222
29;1023;18062021131222
30;1023;18062021131222
31;791;18062021131222
32;610;18062021131222
33;504;18062021131222
34;441;18062021131222
35;414;18062021131222
36;398;18062021131222
37;405;18062021131222
38;412;18062021131222
39;429;18062021131222
40;441;18062021131222
41;461;18062021131222
42;482;18062021131222
43;489;18062021131222
44;511;18062021131222
45;524;18062021131222
46;536;18062021131222
47;537;18062021131222
48;541;18062021131222
49;548;18062021131222
50;550;18062021131222
51;562;18062021131222
52;564;18062021131222
53;577;18062021131222
54;594;18062021131222
55;602;18062021131222
56;614;18062021131222
57;623;18062021131222
58;644;18062021131222
59;659;18062021131222
60;673;18062021131222
61;683;18062021131222
62;687;18062021131222
63;693;18062021131222
64;706;18062021131222
65;697;18062021131222
66;699;18062021131222
67;694;18062021131222
68;679;18062021131222
69;662;18062021131222
70;645;18062021131222
71;627;18062021131222
72;620;18062021131222
73;589;18062021131222
74;574;18062021131222
75;548;18062021131222
76;532;18062021131222
77;514;18062021131222
78;496;18062021131222
79;477;18062021131222
80;455;18062021131222
81;438;18062021131222
82;425;18062021131222
83;413;18062021131222
84;406;18062021131222
85;397;18062021131222
86;392;18062021131222
87;391;18062021131222
88;382;18062021131222
89;373;18062021131222
90;367;18062021131222
91;359;18062021131222
92;345;18062021131222
93;342;18062021131222
94;329;18062021131222
95;318;18062021131222
96;313;18062021131222
97;301;18062021131222
98;297;18062021131222
99;289;18062021131222
100;278;18062021131222
101;281;18062021131222
102;274;18062021131222
103;266;18062021131222
104;262;18062021131222
105;254;18062021131222
106;254;18062021131222
107;245;18062021131222
108;243;18062021131222
109;237;18062021131222
110;230;18062021131222
111;227;18062021131222
112;226;18062021131222
113;218;18062021131222
114;215;18062021131222
115;216;18062021131222
116;213;18062021131222
117;212;18062021131222
118;205;18062021131222
119;208;18062021131222
120;202;18062021131222
121;197;18062021131222
122;197;18062021131222
123;194;18062021131222
124;192;18062021131222
125;189;18062021131222
126;186;18062021131222
127;185;18062021131222
128;189;18062021131222
129;184;18062021131222
130;180;18062021131222
131;180;18062021131222
132;174;18062021131222
133;182;18062021131222
134;173;18062021131222
135;174;18062021131222
136;171;18062021131222
137;169;18062021131222
138;172;18062021131222
139;167;18062021131222
140;167;18062021131222
141;169;18062021131222
142;164;18062021131222
143;160;18062021131222
144;165;18062021131222
145;161;18062021131222
146;162;18062021131222
147;164;18062021131222
148;157;18062021131222
149;160;18062021131222
150;158;18062021131222
151;158;18062021131222
152;155;18062021131222
153;155;18062021131222
154;157;18062021131222
155;157;18062021131222
156;155;18062021131222
157;153;18062021131222
158;151;18062021131222
159;151;18062021131222
160;152;18062021131222
161;150;18062021131222
162;152;18062021131222
163;152;18062021131222
164;151;18062021131222
165;153;18062021131222
166;149;18062021131222
167;152;18062021131222
168;153;18062021131222
169;146;18062021131222
170;151;18062021131222
171;148;18062021131222
172;148;18062021131222
173;151;18062021131222
174;146;18062021131222
175;148;18062021131222
176;149;18062021131222
177;146;18062021131222
178;151;18062021131222
179;148;18062021131222
180;146;18062021131222
181;148;18062021131222
182;150;18062021131222
183;146;18062021131222
184;148;18062021131222
185;144;18062021131222
186;149;18062021131222
187;147;18062021131222
188;146;18062021131222
189;148;18062021131222
190;144;18062021131222
191;147;18062021131222
192;150;18062021131222
193;145;18062021131222
194;149;18062021131222
195;146;18062021131222
196;145;18062021131222
197;144;18062021131222
198;147;18062021131222
199;145;18062021131222
200;0;18062021131222
0;0;18062021131223
1;162;18062021131223
2;150;18062021131223
3;146;18062021131223
4;148;18062021131223
5;148;18062021131223
6;147;18062021131223
7;150;18062021131223
8;149;18062021131223
9;144;18062021131223
10;151;18062021131223
11;148;18062021131223
12;146;18062021131223
13;151;18062021131223
14;149;18062021131223
15;154;18062021131223
16;153;18062021131223
17;154;18062021131223
18;163;18062021131223
19;174;18062021131223
20;202;18062021131223
21;273;18062021131223
22;463;18062021131223
23;885;18062021131223
24;1023;18062021131223
25;1023;18062021131223
26;1023;18062021131223
27;1023;18062021131223
28;1023;18062021131223
29;1023;18062021131223
30;1023;18062021131223
31;795;18062021131223
32;611;18062021131223
33;501;18062021131223
34;448;18062021131223
35;414;18062021131223
36;398;18062021131223
37;408;18062021131223
38;414;18062021131223
39;434;18062021131223
40;451;18062021131223
41;464;18062021131223
42;484;18062021131223
43;496;18062021131223
44;511;18062021131223
45;525;18062021131223
46;533;18062021131223
47;543;18062021131223
48;547;18062021131223
49;549;18062021131223
50;556;18062021131223
51;568;18062021131223
52;571;18062021131223
53;585;18062021131223
54;594;18062021131223
55;607;18062021131223
56;618;18062021131223
57;629;18062021131223
58;650;18062021131223
59;662;18062021131223
60;677;18062021131223
61;696;18062021131223
62;694;18062021131223
63;707;18062021131223
64;713;18062021131223
65;706;18062021131223
66;705;18062021131223
67;696;18062021131223
68;685;18062021131223
69;676;18062021131223
70;652;18062021131223
71;637;18062021131223
72;624;18062021131223
73;595;18062021131223
74;573;18062021131223
75;548;18062021131223
76;534;18062021131223
77;518;18062021131223
78;497;18062021131223
79;482;18062021131223
80;460;18062021131223
81;436;18062021131223
82;431;18062021131223
83;418;18062021131223
84;405;18062021131223
85;401;18062021131223
86;395;18062021131223
87;391;18062021131223
88;386;18062021131223
89;372;18062021131223
90;371;18062021131223
91;361;18062021131223
92;351;18062021131223
93;343;18062021131223
94;332;18062021131223
95;318;18062021131223
96;313;18062021131223
97;305;18062021131223
98;297;18062021131223
99;291;18062021131223
100;282;18062021131223
101;283;18062021131223
102;275;18062021131223
103;267;18062021131223
104;262;18062021131223
105;254;18062021131223
106;252;18062021131223
107;247;18062021131223
108;242;18062021131223
109;238;18062021131223
110;232;18062021131223
111;228;18062021131223
112;226;18062021131223
113;221;18062021131223
114;217;18062021131223
115;218;18062021131223
116;213;18062021131223
117;212;18062021131223
118;206;18062021131223
119;208;18062021131223
120;204;18062021131223
121;199;18062021131223
122;199;18062021131223
123;195;18062021131223
124;192;18062021131223
125;192;18062021131223
126;187;18062021131223
127;187;18062021131223
128;189;18062021131223
129;182;18062021131223
130;182;18062021131223
131;182;18062021131223
132;175;18062021131223
133;182;18062021131223
134;173;18062021131223
135;173;18062021131223
136;173;18062021131223
137;169;18062021131223
138;173;18062021131223
139;168;18062021131223
140;167;18062021131223
141;170;18062021131223
142;166;18062021131223
143;161;18062021131223
144;163;18062021131223
145;160;18062021131223
146;162;18062021131223
147;162;18062021131223
148;158;18062021131223
149;160;18062021131223
150;159;18062021131223
151;158;18062021131223
152;157;18062021131223
153;155;18062021131223
154;156;18062021131223
155;156;18062021131223
156;154;18062021131223
157;154;18062021131223
158;152;18062021131223
159;152;18062021131223
160;151;18062021131223
161;151;18062021131223
162;150;18062021131223
163;152;18062021131223
164;151;18062021131223
165;153;18062021131223
166;149;18062021131223
167;151;18062021131223
168;154;18062021131223
169;146;18062021131223
170;150;18062021131223
171;148;18062021131223
172;147;18062021131223
173;151;18062021131223
174;146;18062021131223
175;148;18062021131223
176;149;18062021131223
177;146;18062021131223
178;149;18062021131223
179;148;18062021131223
180;147;18062021131223
181;146;18062021131223
182;150;18062021131223
183;147;18062021131223
184;149;18062021131223
185;144;18062021131223
186;149;18062021131223
187;146;18062021131223
188;146;18062021131223
189;148;18062021131223
190;145;18062021131223
191;148;18062021131223
192;151;18062021131223
193;145;18062021131223
194;149;18062021131223
195;146;18062021131223
196;145;18062021131223
197;146;18062021131223
198;147;18062021131223
199;144;18062021131223
200;0;18062021131223
