ind;val;datetime
0;0;
1;167;
2;141;
3;140;
4;140;
5;142;
6;138;
7;140;
8;140;
9;138;
10;142;
11;140;
12;139;
13;142;
14;139;
15;141;
16;140;
17;139;
18;141;
19;140;
20;141;
21;143;
22;143;
23;154;
24;168;
25;184;
26;207;
27;220;
28;210;
29;190;
30;171;
31;158;
32;152;
33;148;
34;146;
35;144;
36;141;
37;143;
38;140;
39;141;
40;142;
41;140;
42;142;
43;141;
44;140;
45;142;
46;139;
47;141;
48;142;
49;139;
50;142;
51;140;
52;139;
53;141;
54;140;
55;139;
56;141;
57;139;
58;142;
59;139;
60;140;
61;141;
62;140;
63;141;
64;143;
65;138;
66;143;
67;141;
68;140;
69;142;
70;139;
71;138;
72;143;
73;138;
74;141;
75;139;
76;138;
77;142;
78;138;
79;140;
80;142;
81;140;
82;143;
83;142;
84;142;
85;143;
86;140;
87;141;
88;142;
89;138;
90;141;
91;140;
92;139;
93;142;
94;141;
95;139;
96;142;
97;141;
98;141;
99;140;
100;139;
101;141;
102;139;
103;140;
104;141;
105;140;
106;143;
107;140;
108;140;
109;143;
110;139;
111;141;
112;142;
113;138;
114;140;
115;142;
116;140;
117;143;
118;140;
119;140;
120;139;
121;139;
122;140;
123;140;
124;138;
125;141;
126;139;
127;140;
128;143;
129;140;
130;141;
131;142;
132;139;
133;144;
134;139;
135;140;
136;142;
137;140;
138;141;
139;141;
140;139;
141;141;
142;140;
143;141;
144;142;
145;138;
146;143;
147;142;
148;139;
149;140;
150;140;
151;140;
152;142;
153;139;
154;142;
155;139;
156;140;
157;141;
158;140;
159;139;
160;142;
161;139;
162;141;
163;140;
164;139;
165;142;
166;142;
167;141;
168;142;
169;138;
170;142;
171;142;
172;141;
173;142;
174;141;
175;139;
176;142;
177;139;
178;142;
179;141;
180;140;
181;142;
182;141;
183;141;
184;143;
185;139;
186;142;
187;141;
188;139;
189;141;
190;141;
191;140;
192;144;
193;140;
194;140;
195;141;
196;141;
197;142;
198;141;
199;140;
200;0;
0;0;
1;167;
2;140;
3;138;
4;139;
5;140;
6;137;
7;139;
8;140;
9;139;
10;140;
11;138;
12;138;
13;141;
14;138;
15;141;
16;142;
17;138;
18;141;
19;140;
20;141;
21;141;
22;144;
23;154;
24;167;
25;184;
26;206;
27;220;
28;212;
29;191;
30;171;
31;159;
32;152;
33;145;
34;146;
35;143;
36;141;
37;142;
38;140;
39;141;
40;142;
41;138;
42;142;
43;140;
44;140;
45;141;
46;138;
47;140;
48;142;
49;139;
50;142;
51;139;
52;139;
53;140;
54;139;
55;140;
56;139;
57;138;
58;141;
59;140;
60;140;
61;141;
62;139;
63;141;
64;141;
65;137;
66;141;
67;140;
68;140;
69;142;
70;139;
71;139;
72;141;
73;137;
74;141;
75;138;
76;138;
77;140;
78;138;
79;139;
80;142;
81;139;
82;143;
83;141;
84;141;
85;141;
86;139;
87;139;
88;142;
89;137;
90;141;
91;140;
92;137;
93;141;
94;140;
95;139;
96;140;
97;139;
98;139;
99;140;
100;138;
101;141;
102;139;
103;139;
104;139;
105;139;
106;143;
107;139;
108;139;
109;141;
110;138;
111;139;
112;142;
113;138;
114;140;
115;140;
116;139;
117;143;
118;139;
119;140;
120;139;
121;139;
122;139;
123;139;
124;138;
125;141;
126;138;
127;139;
128;142;
129;139;
130;140;
131;140;
132;138;
133;143;
134;139;
135;140;
136;141;
137;139;
138;141;
139;140;
140;138;
141;141;
142;138;
143;139;
144;140;
145;138;
146;141;
147;140;
148;139;
149;139;
150;139;
151;140;
152;140;
153;137;
154;141;
155;139;
156;139;
157;140;
158;140;
159;139;
160;140;
161;138;
162;140;
163;141;
164;139;
165;142;
166;140;
167;140;
168;142;
169;138;
170;142;
171;139;
172;139;
173;139;
174;140;
175;137;
176;140;
177;139;
178;142;
179;141;
180;140;
181;141;
182;140;
183;140;
184;141;
185;139;
186;143;
187;140;
188;138;
189;139;
190;139;
191;138;
192;143;
193;139;
194;140;
195;140;
196;139;
197;141;
198;140;
199;138;
200;0;
0;0;
1;166;
2;139;
3;139;
4;140;
5;141;
6;138;
7;140;
8;140;
9;139;
10;142;
11;138;
12;139;
13;141;
14;139;
15;141;
16;140;
17;138;
18;141;
19;140;
20;140;
21;143;
22;143;
23;154;
24;167;
25;183;
26;207;
27;221;
28;211;
29;191;
30;171;
31;159;
32;153;
33;146;
34;146;
35;144;
36;141;
37;143;
38;140;
39;141;
40;141;
41;139;
42;142;
43;140;
44;140;
45;141;
46;137;
47;139;
48;141;
49;139;
50;142;
51;140;
52;138;
53;141;
54;138;
55;140;
56;140;
57;138;
58;141;
59;138;
60;140;
61;141;
62;139;
63;141;
64;142;
65;138;
66;141;
67;139;
68;139;
69;142;
70;138;
71;139;
72;141;
73;138;
74;141;
75;139;
76;139;
77;141;
78;139;
79;140;
80;142;
81;140;
82;144;
83;141;
84;142;
85;141;
86;138;
87;141;
88;141;
89;137;
90;141;
91;140;
92;137;
93;141;
94;140;
95;138;
96;141;
97;139;
98;139;
99;140;
100;138;
101;140;
102;138;
103;139;
104;140;
105;138;
106;141;
107;138;
108;138;
109;141;
110;138;
111;139;
112;142;
113;137;
114;140;
115;140;
116;139;
117;143;
118;139;
119;140;
120;139;
121;137;
122;138;
123;138;
124;138;
125;141;
126;139;
127;139;
128;143;
129;138;
130;141;
131;141;
132;139;
133;142;
134;137;
135;139;
136;141;
137;138;
138;141;
139;140;
140;138;
141;141;
142;138;
143;139;
144;140;
145;138;
146;142;
147;141;
148;139;
149;140;
150;139;
151;140;
152;140;
153;138;
154;141;
155;140;
156;138;
157;140;
158;139;
159;139;
160;141;
161;139;
162;141;
163;141;
164;139;
165;142;
166;140;
167;139;
168;142;
169;138;
170;140;
171;140;
172;139;
173;140;
174;140;
175;139;
176;141;
177;139;
178;141;
179;140;
180;140;
181;142;
182;141;
183;139;
184;140;
185;138;
186;141;
187;140;
188;138;
189;140;
190;139;
191;139;
192;144;
193;140;
194;140;
195;140;
196;139;
197;140;
198;140;
199;140;
200;0;
0;0;
1;166;
2;141;
3;138;
4;139;
5;141;
6;137;
7;139;
8;140;
9;137;
10;141;
11;138;
12;137;
13;140;
14;138;
15;140;
16;140;
17;138;
18;141;
19;139;
20;139;
21;141;
22;143;
23;152;
24;166;
25;181;
26;210;
27;219;
28;212;
29;190;
30;171;
31;160;
32;152;
33;145;
34;145;
35;143;
36;140;
37;142;
38;140;
39;141;
40;140;
41;138;
42;141;
43;139;
44;140;
45;141;
46;138;
47;139;
48;141;
49;139;
50;142;
51;139;
52;138;
53;141;
54;139;
55;139;
56;140;
57;138;
58;141;
59;140;
60;139;
61;140;
62;139;
63;141;
64;142;
65;138;
66;141;
67;139;
68;138;
69;142;
70;138;
71;139;
72;141;
73;137;
74;141;
75;138;
76;138;
77;141;
78;139;
79;139;
80;141;
81;139;
82;142;
83;141;
84;141;
85;142;
86;138;
87;140;
88;141;
89;136;
90;140;
91;139;
92;138;
93;140;
94;139;
95;139;
96;141;
97;139;
98;140;
99;139;
100;139;
101;141;
102;138;
103;139;
104;140;
105;137;
106;143;
107;139;
108;139;
109;140;
110;138;
111;139;
112;142;
113;139;
114;140;
115;142;
116;139;
117;142;
118;138;
119;140;
120;138;
121;138;
122;140;
123;139;
124;138;
125;141;
126;139;
127;139;
128;141;
129;138;
130;139;
131;140;
132;139;
133;142;
134;139;
135;140;
136;142;
137;138;
138;140;
139;139;
140;137;
141;141;
142;139;
143;139;
144;140;
145;137;
146;141;
147;139;
148;138;
149;138;
150;139;
151;140;
152;140;
153;138;
154;141;
155;138;
156;139;
157;140;
158;138;
159;139;
160;141;
161;138;
162;141;
163;141;
164;138;
165;141;
166;140;
167;140;
168;140;
169;138;
170;141;
171;140;
172;139;
173;140;
174;140;
175;139;
176;141;
177;138;
178;141;
179;139;
180;139;
181;141;
182;140;
183;139;
184;141;
185;137;
186;141;
187;141;
188;137;
189;140;
190;139;
191;139;
192;143;
193;139;
194;140;
195;139;
196;139;
197;140;
198;139;
199;139;
200;0;
0;0;
1;167;
2;140;
3;139;
4;140;
5;141;
6;139;
7;140;
8;140;
9;138;
10;142;
11;139;
12;138;
13;141;
14;138;
15;141;
16;140;
17;137;
18;141;
19;140;
20;140;
21;141;
22;143;
23;153;
24;167;
25;183;
26;207;
27;220;
28;211;
29;192;
30;172;
31;160;
32;152;
33;147;
34;145;
35;143;
36;140;
37;143;
38;139;
39;139;
40;142;
41;138;
42;142;
43;140;
44;141;
45;141;
46;138;
47;139;
48;142;
49;139;
50;143;
51;139;
52;139;
53;141;
54;139;
55;137;
56;139;
57;138;
58;140;
59;139;
60;139;
61;141;
62;139;
63;140;
64;143;
65;138;
66;143;
67;139;
68;139;
69;142;
70;138;
71;139;
72;143;
73;137;
74;141;
75;138;
76;138;
77;139;
78;139;
79;140;
80;141;
81;139;
82;143;
83;141;
84;141;
85;142;
86;140;
87;140;
88;142;
89;137;
90;141;
91;141;
92;137;
93;141;
94;139;
95;138;
96;141;
97;139;
98;141;
99;139;
100;139;
101;141;
102;139;
103;139;
104;141;
105;138;
106;142;
107;138;
108;138;
109;140;
110;138;
111;140;
112;142;
113;138;
114;140;
115;141;
116;139;
117;143;
118;140;
119;141;
120;139;
121;138;
122;140;
123;139;
124;138;
125;141;
126;138;
127;138;
128;142;
129;138;
130;141;
131;142;
132;140;
133;143;
134;139;
135;139;
136;142;
137;137;
138;141;
139;140;
140;138;
141;142;
142;139;
143;139;
144;141;
145;137;
146;142;
147;140;
148;138;
149;139;
150;138;
151;140;
152;140;
153;139;
154;141;
155;139;
156;138;
157;139;
158;139;
159;139;
160;141;
161;139;
162;141;
163;140;
164;139;
165;142;
166;140;
167