ind;val;datetime
0;0;29062021125028
1;141;29062021125028
2;124;29062021125028
3;122;29062021125028
4;123;29062021125028
5;125;29062021125028
6;123;29062021125028
7;124;29062021125028
8;125;29062021125028
9;123;29062021125028
10;126;29062021125028
11;125;29062021125028
12;126;29062021125028
13;131;29062021125028
14;129;29062021125028
15;134;29062021125028
16;139;29062021125028
17;145;29062021125028
18;165;29062021125028
19;201;29062021125028
20;289;29062021125028
21;514;29062021125028
22;1003;29062021125028
23;1023;29062021125028
24;1023;29062021125028
25;1023;29062021125028
26;1023;29062021125028
27;1023;29062021125028
28;1023;29062021125028
29;1023;29062021125028
30;1023;29062021125028
31;1023;29062021125028
32;1023;29062021125028
33;1016;29062021125028
34;832;29062021125028
35;642;29062021125028
36;488;29062021125028
37;387;29062021125028
38;320;29062021125028
39;275;29062021125028
40;245;29062021125028
41;223;29062021125028
42;216;29062021125028
43;202;29062021125028
44;198;29062021125028
45;195;29062021125028
46;191;29062021125028
47;189;29062021125028
48;191;29062021125028
49;191;29062021125028
50;192;29062021125028
51;193;29062021125028
52;193;29062021125028
53;194;29062021125028
54;196;29062021125028
55;196;29062021125028
56;200;29062021125028
57;200;29062021125028
58;206;29062021125028
59;206;29062021125028
60;211;29062021125028
61;215;29062021125028
62;214;29062021125028
63;219;29062021125028
64;222;29062021125028
65;217;29062021125028
66;223;29062021125028
67;221;29062021125028
68;218;29062021125028
69;218;29062021125028
70;211;29062021125028
71;212;29062021125028
72;211;29062021125028
73;200;29062021125028
74;204;29062021125028
75;197;29062021125028
76;194;29062021125028
77;192;29062021125028
78;186;29062021125028
79;185;29062021125028
80;182;29062021125028
81;176;29062021125028
82;178;29062021125028
83;175;29062021125028
84;175;29062021125028
85;170;29062021125028
86;168;29062021125028
87;168;29062021125028
88;169;29062021125028
89;164;29062021125028
90;166;29062021125028
91;164;29062021125028
92;160;29062021125028
93;162;29062021125028
94;159;29062021125028
95;155;29062021125028
96;157;29062021125028
97;152;29062021125028
98;153;29062021125028
99;149;29062021125028
100;148;29062021125028
101;149;29062021125028
102;146;29062021125028
103;145;29062021125028
104;146;29062021125028
105;141;29062021125028
106;143;29062021125028
107;141;29062021125028
108;140;29062021125028
109;141;29062021125028
110;138;29062021125028
111;138;29062021125028
112;140;29062021125028
113;135;29062021125028
114;136;29062021125028
115;135;29062021125028
116;134;29062021125028
117;136;29062021125028
118;132;29062021125028
119;133;29062021125028
120;132;29062021125028
121;130;29062021125028
122;132;29062021125028
123;132;29062021125028
124;128;29062021125028
125;130;29062021125028
126;129;29062021125028
127;128;29062021125028
128;130;29062021125028
129;127;29062021125028
130;128;29062021125028
131;128;29062021125028
132;126;29062021125028
133;129;29062021125028
134;125;29062021125028
135;126;29062021125028
136;127;29062021125028
137;124;29062021125028
138;126;29062021125028
139;125;29062021125028
140;123;29062021125028
141;125;29062021125028
142;124;29062021125028
143;122;29062021125028
144;124;29062021125028
145;121;29062021125028
146;124;29062021125028
147;123;29062021125028
148;123;29062021125028
149;122;29062021125028
150;121;29062021125028
151;122;29062021125028
152;123;29062021125028
153;119;29062021125028
154;121;29062021125028
155;120;29062021125028
156;119;29062021125028
157;121;29062021125028
158;120;29062021125028
159;119;29062021125028
160;122;29062021125028
161;120;29062021125028
162;122;29062021125028
163;120;29062021125028
164;118;29062021125028
165;122;29062021125028
166;121;29062021125028
167;121;29062021125028
168;121;29062021125028
169;118;29062021125028
170;121;29062021125028
171;120;29062021125028
172;119;29062021125028
173;120;29062021125028
174;120;29062021125028
175;119;29062021125028
176;120;29062021125028
177;118;29062021125028
178;120;29062021125028
179;120;29062021125028
180;119;29062021125028
181;121;29062021125028
182;120;29062021125028
183;118;29062021125028
184;120;29062021125028
185;117;29062021125028
186;120;29062021125028
187;119;29062021125028
188;118;29062021125028
189;120;29062021125028
190;119;29062021125028
191;119;29062021125028
192;123;29062021125028
193;119;29062021125028
194;119;29062021125028
195;119;29062021125028
196;118;29062021125028
197;120;29062021125028
198;119;29062021125028
199;118;29062021125028
200;0;29062021125028
0;0;29062021125028
1;141;29062021125028
2;122;29062021125028
3;122;29062021125028
4;124;29062021125028
5;124;29062021125028
6;121;29062021125028
7;123;29062021125028
8;124;29062021125028
9;123;29062021125028
10;125;29062021125028
11;124;29062021125028
12;125;29062021125028
13;128;29062021125028
14;129;29062021125028
15;133;29062021125028
16;138;29062021125028
17;144;29062021125028
18;165;29062021125028
19;202;29062021125028
20;290;29062021125028
21;506;29062021125028
22;991;29062021125028
23;1022;29062021125028
24;1023;29062021125028
25;1023;29062021125028
26;1023;29062021125028
27;1023;29062021125028
28;1023;29062021125028
29;1023;29062021125028
30;1023;29062021125028
31;1023;29062021125028
32;1023;29062021125028
33;1018;29062021125028
34;843;29062021125028
35;648;29062021125028
36;493;29062021125028
37;389;29062021125028
38;323;29062021125028
39;277;29062021125028
40;244;29062021125028
41;224;29062021125028
42;215;29062021125028
43;202;29062021125028
44;200;29062021125028
45;193;29062021125028
46;191;29062021125028
47;191;29062021125028
48;192;29062021125028
49;191;29062021125028
50;191;29062021125028
51;190;29062021125028
52;192;29062021125028
53;196;29062021125028
54;193;29062021125028
55;195;29062021125028
56;199;29062021125028
57;200;29062021125028
58;205;29062021125028
59;207;29062021125028
60;212;29062021125028
61;214;29062021125028
62;213;29062021125028
63;217;29062021125028
64;219;29062021125028
65;215;29062021125028
66;218;29062021125028
67;216;29062021125028
68;215;29062021125028
69;216;29062021125028
70;210;29062021125028
71;211;29062021125028
72;210;29062021125028
73;203;29062021125028
74;202;29062021125028
75;195;29062021125028
76;194;29062021125028
77;191;29062021125028
78;187;29062021125028
79;183;29062021125028
80;179;29062021125028
81;176;29062021125028
82;178;29062021125028
83;173;29062021125028
84;171;29062021125028
85;171;29062021125028
86;167;29062021125028
87;168;29062021125028
88;168;29062021125028
89;164;29062021125028
90;164;29062021125028
91;162;29062021125028
92;159;29062021125028
93;159;29062021125028
94;157;29062021125028
95;155;29062021125028
96;155;29062021125028
97;151;29062021125028
98;150;29062021125028
99;148;29062021125028
100;146;29062021125028
101;149;29062021125028
102;144;29062021125028
103;143;29062021125028
104;143;29062021125028
105;142;29062021125028
106;142;29062021125028
107;139;29062021125028
108;138;29062021125028
109;140;29062021125028
110;135;29062021125028
111;136;29062021125028
112;138;29062021125028
113;134;29062021125028
114;135;29062021125028
115;134;29062021125028
116;133;29062021125028
117;136;29062021125028
118;131;29062021125028
119;133;29062021125028
120;131;29062021125028
121;130;29062021125028
122;130;29062021125028
123;129;29062021125028
124;127;29062021125028
125;130;29062021125028
126;127;29062021125028
127;129;29062021125028
128;129;29062021125028
129;126;29062021125028
130;126;29062021125028
131;128;29062021125028
132;125;29062021125028
133;128;29062021125028
134;125;29062021125028
135;124;29062021125028
136;126;29062021125028
137;123;29062021125028
138;125;29062021125028
139;123;29062021125028
140;122;29062021125028
141;124;29062021125028
142;122;29062021125028
143;123;29062021125028
144;123;29062021125028
145;121;29062021125028
146;123;29062021125028
147;121;29062021125028
148;120;29062021125028
149;121;29062021125028
150;120;29062021125028
151;121;29062021125028
152;121;29062021125028
153;119;29062021125028
154;121;29062021125028
155;120;29062021125028
156;119;29062021125028
157;120;29062021125028
158;118;29062021125028
159;119;29062021125028
160;120;29062021125028
161;118;29062021125028
162;121;29062021125028
163;119;29062021125028
164;118;29062021125028
165;120;29062021125028
166;119;29062021125028
167;119;29062021125028
168;120;29062021125028
169;117;29062021125028
170;120;29062021125028
171;119;29062021125028
172;118;29062021125028
173;119;29062021125028
174;118;29062021125028
175;118;29062021125028
176;120;29062021125028
177;117;29062021125028
178;119;29062021125028
179;118;29062021125028
180;117;29062021125028
181;121;29062021125028
182;120;29062021125028
183;118;29062021125028
184;119;29062021125028
185;117;29062021125028
186;119;29062021125028
187;118;29062021125028
188;117;29062021125028
189;119;29062021125028
190;117;29062021125028
191;117;29062021125028
192;121;29062021125028
193;119;29062021125028
194;118;29062021125028
195;118;29062021125028
196;117;29062021125028
197;118;29062021125028
198;118;29062021125028
199;117;29062021125028
200;0;29062021125028
0;0;29062021125028
1;141;29062021125028
2;123;29062021125028
3;120;29062021125028
4;123;29062021125028
5;123;29062021125028
6;121;29062021125028
7;123;29062021125028
8;124;29062021125028
9;123;29062021125028
10;126;29062021125028
11;124;29062021125028
12;125;29062021125028
13;130;29062021125028
14;129;29062021125028
15;134;29062021125028
16;138;29062021125028
17;146;29062021125028
18;164;29062021125028
19;203;29062021125028
20;288;29062021125028
21;507;29062021125028
22;993;29062021125028
23;1023;29062021125028
24;1023;29062021125028
25;1023;29062021125028
26;1023;29062021125028
27;1023;29062021125028
28;1023;29062021125028
29;1023;29062021125028
30;1023;29062021125028
31;1023;29062021125028
32;1023;29062021125028
33;1021;29062021125028
34;844;29062021125028
35;644;29062021125028
36;490;29062021125028
37;392;29062021125028
38;323;29062021125028
39;275;29062021125028
40;246;29062021125028
41;225;29062021125028
42;213;29062021125028
43;203;29062021125028
44;197;29062021125028
45;196;29062021125028
46;193;29062021125028
47;193;29062021125028
48;193;29062021125028
49;190;29062021125028
50;192;29062021125028
51;191;29062021125028
52;190;29062021125028
53;195;29062021125028
54;195;29062021125028
55;198;29062021125028
56;199;29062021125028
57;199;29062021125028
58;205;29062021125028
59;208;29062021125028
60;211;29062021125028
61;213;29062021125028
62;215;29062021125028
63;218;29062021125028
64;219;29062021125028
65;218;29062021125028
66;220;29062021125028
67;219;29062021125028
68;218;29062021125028
69;215;29062021125028
70;211;29062021125028
71;209;29062021125028
72;209;29062021125028
73;204;29062021125028
74;201;29062021125028
75;197;29062021125028
76;193;29062021125028
77;190;29062021125028
78;188;29062021125028
79;183;29062021125028
80;181;29062021125028
81;176;29062021125028
82;178;29062021125028
83;172;29062021125028
84;171;29062021125028
85;170;29062021125028
86;168;29062021125028
87;169;29062021125028
88;169;29062021125028
89;163;29062021125028
90;165;29062021125028
91;163;29062021125028
92;157;29062021125028
93;161;29062021125028
94;157;29062021125028
95;154;29062021125028
96;155;29062021125028
97;152;29062021125028
98;152;29062021125028
99;150;29062021125028
100;146;29062021125028
101;149;29062021125028
102;145;29062021125028
103;144;29062021125028
104;144;29062021125028
105;141;29062021125028
106;144;29062021125028
107;139;29062021125028
108;138;29062021125028
109;140;29062021125028
110;136;29062021125028
111;137;29062021125028
112;137;29062021125028
113;134;29062021125028
114;135;29062021125028
115;136;29062021125028
116;133;29062021125028
117;135;29062021125028
118;131;29062021125028
119;133;29062021125028
120;130;29062021125028
121;129;29062021125028
122;131;29062021125028
123;130;29062021125028
124;129;29062021125028
125;130;29062021125028
126;128;29062021125028
127;128;29062021125028
128;130;29062021125028
129;126;29062021125028
130;126;29062021125028
131;127;29062021125028
132;124;29062021125028
133;129;29062021125028
134;125;29062021125028
135;124;29062021125028
136;126;29062021125028
137;123;29062021125028
138;126;29062021125028
139;123;29062021125028
140;122;29062021125028
141;124;29062021125028
142;122;29062021125028
143;121;29062021125028
144;124;29062021125028
145;121;29062021125028
146;123;29062021125028
147;121;29062021125028
148;120;29062021125028
149;121;29062021125028
150;121;29062021125028
151;121;29062021125028
152;122;29062021125028
153;119;29062021125028
154;122;29062021125028
155;120;29062021125028
156;120;29062021125028
157;120;29062021125028
158;119;29062021125028
159;119;29062021125028
160;121;29062021125028
161;119;29062021125028
162;121;29062021125028
163;120;29062021125028
164;119;29062021125028
165;122;29062021125028
166;119;29062021125028
167;119;29062021125028
168;121;29062021125028
169;118;29062021125028
170;121;29062021125028
171;120;29062021125028
172;119;29062021125028
173;120;29062021125028
174;119;29062021125028
175;118;29062021125028
176;120;29062021125028
177;118;29062021125028
178;120;29062021125028
179;118;29062021125028
180;117;29062021125028
181;120;29062021125028
182;119;29062021125028
183;118;29062021125028
184;119;29062021125028
185;117;29062021125028
186;120;29062021125028
187;119;29062021125028
188;118;29062021125028
189;119;29062021125028
190;118;29062021125028
191;118;29062021125028
192;121;29062021125028
193;119;29062021125028
194;119;29062021125028
195;119;29062021125028
196;117;29062021125028
197;119;29062021125028
198;119;29062021125028
199;118;29062021125028
200;0;29062021125028
0;0;29062021125029
1;141;29062021125029
2;124;29062021125029
3;121;29062021125029
4;122;29062021125029
5;124;29062021125029
6;121;29062021125029
7;123;29062021125029
8;125;29062021125029
9;123;29062021125029
10;126;29062021125029
11;125;29062021125029
12;125;29062021125029
13;129;29062021125029
14;128;29062021125029
15;133;29062021125029
16;138;29062021125029
17;145;29062021125029
18;166;29062021125029
19;201;29062021125029
20;288;29062021125029
21;507;29062021125029
22;993;29062021125029
23;1023;29062021125029
24;1023;29062021125029
25;1023;29062021125029
26;1023;29062021125029
27;1023;29062021125029
28;1023;29062021125029
29;1023;29062021125029
30;1023;29062021125029
31;1023;29062021125029
32;1023;29062021125029
33;1021;29062021125029
34;841;29062021125029
35;648;29062021125029
36;488;29062021125029
37;391;29062021125029
38;323;29062021125029
39;276;29062021125029
40;246;29062021125029
41;224;29062021125029
42;214;29062021125029
43;203;29062021125029
44;198;29062021125029
45;195;29062021125029
46;191;29062021125029
47;191;29062021125029
48;193;29062021125029
49;190;29062021125029
50;193;29062021125029
51;189;29062021125029
52;191;29062021125029
53;195;29062021125029
54;194;29062021125029
55;196;29062021125029
56;201;29062021125029
57;200;29062021125029
58;205;29062021125029
59;207;29062021125029
60;209;29062021125029
61;213;29062021125029
62;214;29062021125029
63;218;29062021125029
64;219;29062021125029
65;218;29062021125029
66;221;29062021125029
67;217;29062021125029
68;217;29062021125029
69;215;29062021125029
70;211;29062021125029
71;209;29062021125029
72;208;29062021125029
73;204;29062021125029
74;202;29062021125029
75;195;29062021125029
76;195;29062021125029
77;191;29062021125029
78;188;29062021125029
79;184;29062021125029
80;182;29062021125029
81;177;29062021125029
82;176;29062021125029
83;172;29062021125029
84;171;29062021125029
85;171;29062021125029
86;167;29062021125029
87;169;29062021125029
88;170;29062021125029
89;164;29062021125029
90;165;29062021125029
91;163;29062021125029
92;159;29062021125029
93;161;29062021125029
94;158;29062021125029
95;155;29062021125029
96;155;29062021125029
97;152;29062021125029
98;151;29062021125029
99;150;29062021125029
100;148;29062021125029
101;148;29062021125029
102;145;29062021125029
103;145;29062021125029
104;144;29062021125029
105;141;29062021125029
106;143;29062021125029
107;141;29062021125029
108;138;29062021125029
109;139;29062021125029
110;137;29062021125029
111;136;29062021125029
112;138;29062021125029
113;133;29062021125029
114;135;29062021125029
115;136;29062021125029
116;134;29062021125029
117;136;29062021125029
118;132;29062021125029
119;133;29062021125029
120;132;29062021125029
121;130;29062021125029
122;131;29062021125029
123;131;29062021125029
124;128;29062021125029
125;130;29062021125029
126;128;29062021125029
127;127;29062021125029
128;129;29062021125029
129;126;29062021125029
130;127;29062021125029
131;127;29062021125029
132;126;29062021125029
133;128;29062021125029
134;124;29062021125029
135;123;29062021125029
136;126;29062021125029
137;123;29062021125029
138;125;29062021125029
139;124;29062021125029
140;122;29062021125029
141;125;29062021125029
142;122;29062021125029
143;122;29062021125029
144;123;29062021125029
145;120;29062021125029
146;123;29062021125029
147;123;29062021125029
148;121;29062021125029
149;121;29062021125029
150;120;29062021125029
151;121;29062021125029
152;121;29062021125029
153;119;29062021125029
154;121;29062021125029
155;121;29062021125029
156;120;29062021125029
157;121;29062021125029
158;119;29062021125029
159;119;29062021125029
160;120;29062021125029
161;119;29062021125029
162;121;29062021125029
163;120;29062021125029
164;119;29062021125029
165;121;29062021125029
166;119;29062021125029
167;121;29062021125029
168;121;29062021125029
169;117;29062021125029
170;120;29062021125029
171;120;29062021125029
172;118;29062021125029
173;119;29062021125029
174;119;29062021125029
175;118;29062021125029
176;120;29062021125029
177;118;29062021125029
178;121;29062021125029
179;119;29062021125029
180;118;29062021125029
181;119;29062021125029
182;120;29062021125029
183;117;29062021125029
184;120;29062021125029
185;117;29062021125029
186;119;29062021125029
187;119;29062021125029
188;117;29062021125029
189;119;29062021125029
190;117;29062021125029
191;118;29062021125029
192;121;29062021125029
193;117;29062021125029
194;118;29062021125029
195;118;29062021125029
196;117;29062021125029
197;120;29062021125029
198;119;29062021125029
199;118;29062021125029
200;0;29062021125029
0;0;29062021125029
1;140;29062021125029
2;122;29062021125029
3;122;29062021125029
4;122;29062021125029
5;123;29062021125029
6;123;29062021125029
7;124;29062021125029
8;124;29062021125029
9;122;29062021125029
10;126;29062021125029
11;124;29062021125029
12;125;29062021125029
13;130;29062021125029
14;129;29062021125029
15;134;29062021125029
16;137;29062021125029
17;144;29062021125029
18;166;29062021125029
19;204;29062021125029
20;285;29062021125029
21;503;29062021125029
22;982;29062021125029
23;1022;29062021125029
24;1023;29062021125029
25;1023;29062021125029
26;1023;29062021125029
27;1023;29062021125029
28;1023;29062021125029
29;1023;29062021125029
30;1023;29062021125029
31;1023;29062021125029
32;1023;29062021125029
33;1022;29062021125029
34;854;29062021125029
35;657;29062021125029
36;503;29062021125029
37;399;29062021125029
38;326;29062021125029
39;278;29062021125029
40;248;29062021125029
41;225;29062021125029
42;215;29062021125029
43;204;29062021125029
44;197;29062021125029
45;195;29062021125029
46;190;29062021125029
47;192;29062021125029
48;192;29062021125029
49;188;29062021125029
50;194;29062021125029
51;190;29062021125029
52;194;29062021125029
53;195;29062021125029
54;194;29062021125029
55;195;29062021125029
56;201;29062021125029
57;200;29062021125029
58;206;29062021125029
59;207;29062021125029
60;209;29062021125029
61;212;29062021125029
62;214;29062021125029
63;218;29062021125029
64;220;29062021125029
65;217;29062021125029
66;219;29062021125029
67;219;29062021125029
68;216;29062021125029
69;215;29062021125029
70;212;29062021125029
71;210;29062021125029
72;209;29062021125029
73;202;29062021125029
74;201;29062021125029
75;197;29062021125029
76;194;29062021125029
77;192;29062021125029
78;187;29062021125029
79;184;29062021125029
80;182;29062021125029
81;177;29062021125029
82;177;29062021125029
83;173;29062021125029
84;170;29062021125029
85;170;29062021125029
86;168;29062021125029
87;168;29062021125029
88;170;29062021125029
89;165;29062021125029
90;167;29062021125029
91;162;29062021125029
92;160;29062021125029
93;161;29062021125029
94;159;29062021125029
95;155;29062021125029
96;156;29062021125029
97;152;29062021125029
98;151;29062021125029
99;150;29062021125029
100;147;29062021125029
101;150;29062021125029
102;146;29062021125029
103;146;29062021125029
104;144;29062021125029
105;142;29062021125029
106;143;29062021125029
107;140;29062021125029
108;138;29062021125029
109;141;29062021125029
110;137;29062021125029
111;137;29062021125029
112;138;29062021125029
113;134;29062021125029
114;135;29062021125029
115;137;29062021125029
116;133;29062021125029
117;136;29062021125029
118;133;29062021125029
119;133;29062021125029
120;131;29062021125029
121;130;29062021125029
122;131;29062021125029
123;129;29062021125029
124;129;29062021125029
125;130;29062021125029
126;129;29062021125029
127;127;29062021125029
128;128;29062021125029
129;127;29062021125029
130;128;29062021125029
131;127;29062021125029
132;124;29062021125029
133;128;29062021125029
134;124;29062021125029
135;125;29062021125029
136;127;29062021125029
137;124;29062021125029
138;125;29062021125029
139;123;29062021125029
140;121;29062021125029
141;124;29062021125029
142;123;29062021125029
143;122;29062021125029
144;124;29062021125029
145;120;29062021125029
146;124;29062021125029
147;122;29062021125029
148;121;29062021125029
149;121;29062021125029
150;121;29062021125029
151;121;29062021125029
152;123;29062021125029
153;121;29062021125029
154;122;29062021125029
155;121;29062021125029
156;119;29062021125029
157;121;29062021125029
158;119;29062021125029
159;119;29062021125029
160;120;29062021125029
161;119;29062021125029
162;121;29062021125029
163;120;29062021125029
164;118;29062021125029
165;121;29062021125029
166;119;29062021125029
167;120;29062021125029
168;120;29062021125029
169;117;29062021125029
170;120;29062021125029
171;120;29062021125029
172;119;29062021125029
173;119;29062021125029
174;119;29062021125029
175;118;29062021125029
176;120;29062021125029
177;117;29062021125029
178;120;29062021125029
179;119;29062021125029
180;118;29062021125029
181;120;29062021125029
182;119;29062021125029
183;118;29062021125029
184;119;29062021125029
185;118;29062021125029
186;120;29062021125029
187;119;29062021125029
188;117;29062021125029
189;118;29062021125029
190;118;29062021125029
191;118;29062021125029
192;121;29062021125029
193;118;29062021125029
194;119;29062021125029
195;117;29062021125029
196;118;29062021125029
197;119;29062021125029
198;119;29062021125029
199;118;29062021125029
200;0;29062021125029
0;0;29062021125030
1;141;29062021125030
2;124;29062021125030
3;122;29062021125030
4;123;29062021125030
5;124;29062021125030
6;121;29062021125030
7;124;29062021125030
8;125;29062021125030
9;123;29062021125030
10;128;29062021125030
11;123;29062021125030
12;125;29062021125030
13;130;29062021125030
14;129;29062021125030
15;134;29062021125030
16;138;29062021125030
17;146;29062021125030
18;167;29062021125030
19;204;29062021125030
20;288;29062021125030
21;504;29062021125030
22;988;29062021125030
23;1023;29062021125030
24;1023;29062021125030
25;1023;29062021125030
26;1023;29062021125030
27;1023;29062021125030
28;1023;29062021125030
29;1023;29062021125030
30;1023;29062021125030
31;1023;29062021125030
32;1023;29062021125030
33;1022;29062021125030
34;853;29062021125030
35;654;29062021125030
36;498;29062021125030
37;395;29062021125030
38;325;29062021125030
39;277;29062021125030
40;248;29062021125030
41;223;29062021125030
42;214;29062021125030
43;204;29062021125030
44;199;29062021125030
45;194;29062021125030
46;192;29062021125030
47;190;29062021125030
48;193;29062021125030
49;190;29062021125030
50;191;29062021125030
51;191;29062021125030
52;192;29062021125030
53;195;29062021125030
54;194;29062021125030
55;197;29062021125030
56;199;29062021125030
57;202;29062021125030
58;207;29062021125030
59;206;29062021125030
60;211;29062021125030
61;214;29062021125030
62;214;29062021125030
63;217;29062021125030
64;219;29062021125030
65;215;29062021125030
66;221;29062021125030
67;218;29062021125030
68;217;29062021125030
69;215;29062021125030
70;210;29062021125030
71;209;29062021125030
72;209;29062021125030
73;202;29062021125030
74;203;29062021125030
75;196;29062021125030
76;191;29062021125030
77;192;29062021125030
78;187;29062021125030
79;183;29062021125030
80;183;29062021125030
81;178;29062021125030
82;178;29062021125030
83;172;29062021125030
84;173;29062021125030
85;171;29062021125030
86;168;29062021125030
87;167;29062021125030
88;171;29062021125030
89;162;29062021125030
90;166;29062021125030
91;163;29062021125030
92;160;29062021125030
93;160;29062021125030
94;157;29062021125030
95;153;29062021125030
96;154;29062021125030
97;152;29062021125030
98;151;29062021125030
99;151;29062021125030
100;148;29062021125030
101;149;29062021125030
102;144;29062021125030
103;144;29062021125030
104;144;29062021125030
105;142;29062021125030
106;145;29062021125030
107;140;29062021125030
108;139;29062021125030
109;139;29062021125030
110;137;29062021125030
111;136;29062021125030
112;139;29062021125030
113;134;29062021125030
114;135;29062021125030
115;136;29062021125030
116;134;29062021125030
117;138;29062021125030
118;133;29062021125030
119;131;29062021125030
120;131;29062021125030
121;129;29062021125030
122;130;29062021125030
123;130;29062021125030
124;127;29062021125030
125;131;29062021125030
126;127;29062021125030
127;128;29062021125030
128;130;29062021125030
129;127;29062021125030
130;127;29062021125030
131;127;29062021125030
132;125;29062021125030
133;128;29062021125030
134;125;29062021125030
135;125;29062021125030
136;127;29062021125030
137;123;29062021125030
138;125;29062021125030
139;124;29062021125030
140;122;29062021125030
141;124;29062021125030
142;122;29062021125030
143;122;29062021125030
144;123;29062021125030
145;120;29062021125030
146;125;29062021125030
147;122;29062021125030
148;121;29062021125030
149;121;29062021125030
150;120;29062021125030
151;121;29062021125030
152;121;29062021125030
153;120;29062021125030
154;123;29062021125030
155;120;29062021125030
156;120;29062021125030
157;121;29062021125030
158;119;29062021125030
159;119;29062021125030
160;121;29062021125030
161;118;29062021125030
162;121;29062021125030
163;120;29062021125030
164;119;29062021125030
165;122;29062021125030
166;121;29062021125030
167;120;29062021125030
168;121;29062021125030
169;118;29062021125030
170;120;29062021125030
171;120;29062021125030
172;120;29062021125030
173;121;29062021125030
174;118;29062021125030
175;118;29062021125030
176;120;29062021125030
177;119;29062021125030
178;120;29062021125030
179;120;29062021125030
180;119;29062021125030
181;120;29062021125030
182;119;29062021125030
183;118;29062021125030
184;120;29062021125030
185;117;29062021125030
186;121;29062021125030
187;120;29062021125030
188;117;29062021125030
189;119;29062021125030
190;117;29062021125030
191;118;29062021125030
192;121;29062021125030
193;118;29062021125030
194;118;29062021125030
195;118;29062021125030
196;118;29062021125030
197;119;29062021125030
198;119;29062021125030
199;117;29062021125030
200;0;29062021125030
0;0;29062021125030
1;141;29062021125030
2;122;29062021125030
3;122;29062021125030
4;123;29062021125030
5;124;29062021125030
6;122;29062021125030
7;123;29062021125030
8;124;29062021125030
9;123;29062021125030
10;126;29062021125030
11;125;29062021125030
12;125;29062021125030
13;129;29062021125030
14;130;29062021125030
15;133;29062021125030
16;137;29062021125030
17;146;29062021125030
18;167;29062021125030
19;203;29062021125030
20;288;29062021125030
21;502;29062021125030
22;988;29062021125030
23;1023;29062021125030
24;1023;29062021125030
25;1023;29062021125030
26;1023;29062021125030
27;1023;29062021125030
28;1023;29062021125030
29;1023;29062021125030
30;1023;29062021125030
31;1023;29062021125030
32;1023;29062021125030
33;1022;29062021125030
34;850;29062021125030
35;654;29062021125030
36;495;29062021125030
37;394;29062021125030
38;324;29062021125030
39;278;29062021125030
40;247;29062021125030
41;226;29062021125030
42;215;29062021125030
43;204;29062021125030
44;200;29062021125030
45;196;29062021125030
46;190;29062021125030
47;190;29062021125030
48;193;29062021125030
49;191;29062021125030
50;192;29062021125030
51;192;29062021125030
52;191;29062021125030
53;194;29062021125030
54;195;29062021125030
55;198;29062021125030
56;201;29062021125030
57;201;29062021125030
58;204;29062021125030
59;206;29062021125030
60;211;29062021125030
61;217;29062021125030
62;213;29062021125030
63;219;29062021125030
64;220;29062021125030
65;217;29062021125030
66;219;29062021125030
67;218;29062021125030
68;218;29062021125030
69;216;29062021125030
70;212;29062021125030
71;209;29062021125030
72;208;29062021125030
73;201;29062021125030
74;201;29062021125030
75;196;29062021125030
76;193;29062021125030
77;192;29062021125030
78;187;29062021125030
79;183;29062021125030
80;182;29062021125030
81;175;29062021125030
82;178;29062021125030
83;172;29062021125030
84;171;29062021125030
85;171;29062021125030
86;167;29062021125030
87;168;29062021125030
88;169;29062021125030
89;164;29062021125030
90;165;29062021125030
91;162;29062021125030
92;158;29062021125030
93;159;29062021125030
94;158;29062021125030
95;155;29062021125030
96;156;29062021125030
97;151;29062021125030
98;151;29062021125030
99;149;29062021125030
100;148;29062021125030
101;149;29062021125030
102;145;29062021125030
103;144;29062021125030
104;144;29062021125030
105;141;29062021125030
106;143;29062021125030
107;140;29062021125030
108;139;29062021125030
109;141;29062021125030
110;136;29062021125030
111;135;29062021125030
112;139;29062021125030
113;135;29062021125030
114;136;29062021125030
115;136;29062021125030
116;134;29062021125030
117;137;29062021125030
118;133;29062021125030
119;132;29062021125030
120;132;29062021125030
121;129;29062021125030
122;130;29062021125030
123;130;29062021125030
124;128;29062021125030
125;131;29062021125030
126;128;29062021125030
127;128;29062021125030
128;130;29062021125030
129;126;29062021125030
130;127;29062021125030
131;127;29062021125030
132;124;29062021125030
133;128;29062021125030
134;125;29062021125030
135;125;29062021125030
136;126;29062021125030
137;123;29062021125030
138;125;29062021125030
139;124;29062021125030
140;122;29062021125030
141;125;29062021125030
142;123;29062021125030
143;122;29062021125030
144;123;29062021125030
145;121;29062021125030
146;124;29062021125030
147;121;29062021125030
148;121;29062021125030
149;121;29062021125030
150;120;29062021125030
151;120;29062021125030
152;121;29062021125030
153;120;29062021125030
154;122;29062021125030
155;120;29062021125030
156;120;29062021125030
157;120;29062021125030
158;119;29062021125030
159;120;29062021125030
160;121;29062021125030
161;119;29062021125030
162;121;29062021125030
163;121;29062021125030
164;118;29062021125030
165;121;29062021125030
166;120;29062021125030
167;120;29062021125030
168;121;29062021125030
169;117;29062021125030
170;120;29062021125030
171;119;29062021125030
172;119;29062021125030
173;120;29062021125030
174;118;29062021125030
175;118;29062021125030
176;120;29062021125030
177;117;29062021125030
178;120;29062021125030
179;118;29062021125030
180;119;29062021125030
181;120;29062021125030
182;119;29062021125030
183;118;29062021125030
184;120;29062021125030
185;117;29062021125030
186;120;29062021125030
187;120;29062021125030
188;116;29062021125030
189;118;29062021125030
190;117;29062021125030
191;118;29062021125030
192;121;29062021125030
193;118;29062021125030
194;118;29062021125030
195;119;29062021125030
196;117;29062021125030
197;119;29062021125030
198;119;29062021125030
199;118;29062021125030
200;0;29062021125030
0;0;29062021125030
1;140;29062021125030
2;122;29062021125030
3;122;29062021125030
4;122;29062021125030
5;123;29062021125030
6;121;29062021125030
7;123;29062021125030
8;124;29062021125030
9;121;29062021125030
10;126;29062021125030
11;124;29062021125030
12;125;29062021125030
13;129;29062021125030
14;129;29062021125030
15;134;29062021125030
16;138;29062021125030
17;145;29062021125030
18;164;29062021125030
19;201;29062021125030
20;284;29062021125030
21;498;29062021125030
22;978;29062021125030
23;1021;29062021125030
24;1023;29062021125030
25;1023;29062021125030
26;1023;29062021125030
27;1023;29062021125030
28;1023;29062021125030
29;1023;29062021125030
30;1023;29062021125030
31;1023;29062021125030
32;1023;29062021125030
33;1023;29062021125030
34;863;29062021125030
35;665;29062021125030
36;503;29062021125030
37;396;29062021125030
38;328;29062021125030
39;284;29062021125030
40;249;29062021125030
41;225;29062021125030
42;214;29062021125030
43;203;29062021125030
44;199;29062021125030
45;196;29062021125030
46;190;29062021125030
47;190;29062021125030
48;192;29062021125030
49;188;29062021125030
50;192;29062021125030
51;191;29062021125030
52;190;29062021125030
53;195;29062021125030
54;195;29062021125030
55;196;29062021125030
56;200;29062021125030
57;201;29062021125030
58;206;29062021125030
59;208;29062021125030
60;210;29062021125030
61;213;29062021125030
62;213;29062021125030
63;214;29062021125030
64;221;29062021125030
65;215;29062021125030
66;220;29062021125030
67;216;29062021125030
68;217;29062021125030
69;217;29062021125030
70;211;29062021125030
71;210;29062021125030
72;209;29062021125030
73;201;29062021125030
74;204;29062021125030
75;195;29062021125030
76;193;29062021125030
77;190;29062021125030
78;188;29062021125030
79;184;29062021125030
80;183;29062021125030
81;176;29062021125030
82;176;29062021125030
83;174;29062021125030
84;171;29062021125030
85;171;29062021125030
86;168;29062021125030
87;167;29062021125030
88;167;29062021125030
89;164;29062021125030
90;163;29062021125030
91;163;29062021125030
92;159;29062021125030
93;160;29062021125030
94;157;29062021125030
95;155;29062021125030
96;155;29062021125030
97;152;29062021125030
98;151;29062021125030
99;149;29062021125030
100;148;29062021125030
101;147;29062021125030
102;144;29062021125030
103;144;29062021125030
104;143;29062021125030
105;140;29062021125030
106;143;29062021125030
107;140;29062021125030
108;137;29062021125030
109;139;29062021125030
110;137;29062021125030
111;137;29062021125030
112;139;29062021125030
113;134;29062021125030
114;134;29062021125030
115;134;29062021125030
116;133;29062021125030
117;136;29062021125030
118;132;29062021125030
119;131;29062021125030
120;131;29062021125030
121;131;29062021125030
122;131;29062021125030
123;130;29062021125030
124;128;29062021125030
125;129;29062021125030
126;127;29062021125030
127;127;29062021125030
128;128;29062021125030
129;125;29062021125030
130;127;29062021125030
131;127;29062021125030
132;125;29062021125030
133;128;29062021125030
134;124;29062021125030
135;123;29062021125030
136;126;29062021125030
137;123;29062021125030
138;124;29062021125030
139;124;29062021125030
140;121;29062021125030
141;124;29062021125030
142;122;29062021125030
143;122;29062021125030
144;123;29062021125030
145;120;29062021125030
146;123;29062021125030
147;121;29062021125030
148;120;29062021125030
149;121;29062021125030
150;121;29062021125030
151;121;29062021125030
152;122;29062021125030
153;119;29062021125030
154;121;29062021125030
155;120;29062021125030
156;118;29062021125030
157;120;29062021125030
158;119;29062021125030
159;120;29062021125030
160;121;29062021125030
161;120;29062021125030
162;121;29062021125030
163;119;29062021125030
164;118;29062021125030
165;121;29062021125030
166;119;29062021125030
167;119;29062021125030
168;120;29062021125030
169;118;29062021125030
170;120;29062021125030
171;120;29062021125030
172;118;29062021125030
173;119;29062021125030
174;118;29062021125030
175;117;29062021125030
176;120;29062021125030
177;117;29062021125030
178;121;29062021125030
179;119;29062021125030
180;118;29062021125030
181;120;29062021125030
182;119;29062021125030
183;118;29062021125030
184;120;29062021125030
185;116;29062021125030
186;120;29062021125030
187;118;29062021125030
188;117;29062021125030
189;119;29062021125030
190;118;29062021125030
191;117;29062021125030
192;120;29062021125030
193;117;29062021125030
194;118;29062021125030
195;118;29062021125030
196;118;29062021125030
197;119;29062021125030
198;118;29062021125030
199;117;29062021125030
200;0;29062021125030
0;0;29062021125031
1;141;29062021125031
2;123;29062021125031
3;122;29062021125031
4;123;29062021125031
5;124;29062021125031
6;122;29062021125031
7;123;29062021125031
8;124;29062021125031
9;122;29062021125031
10;126;29062021125031
11;124;29062021125031
12;125;29062021125031
13;129;29062021125031
14;129;29062021125031
15;134;29062021125031
16;138;29062021125031
17;144;29062021125031
18;165;29062021125031
19;204;29062021125031
20;287;29062021125031
21;502;29062021125031
22;982;29062021125031
23;1023;29062021125031
24;1023;29062021125031
25;1023;29062021125031
26;1023;29062021125031
27;1023;29062021125031
28;1023;29062021125031
29;1023;29062021125031
30;1023;29062021125031
31;1023;29062021125031
32;1023;29062021125031
33;1022;29062021125031
34;853;29062021125031
35;656;29062021125031
36;496;29062021125031
37;396;29062021125031
38;323;29062021125031
39;280;29062021125031
40;247;29062021125031
41;226;29062021125031
42;214;29062021125031
43;203;29062021125031
44;198;29062021125031
45;197;29062021125031
46;190;29062021125031
47;192;29062021125031
48;192;29062021125031
49;190;29062021125031
50;191;29062021125031
51;191;29062021125031
52;191;29062021125031
53;194;29062021125031
54;197;29062021125031
55;196;29062021125031
56;200;29062021125031
57;203;29062021125031
58;207;29062021125031
59;208;29062021125031
60;208;29062021125031
61;211;29062021125031
62;214;29062021125031
63;218;29062021125031
64;220;29062021125031
65;219;29062021125031
66;221;29062021125031
67;220;29062021125031
68;216;29062021125031
69;216;29062021125031
70;213;29062021125031
71;208;29062021125031
72;209;29062021125031
73;203;29062021125031
74;203;29062021125031
75;195;29062021125031
76;192;29062021125031
77;190;29062021125031
78;185;29062021125031
79;183;29062021125031
80;181;29062021125031
81;177;29062021125031
82;177;29062021125031
83;172;29062021125031
84;172;29062021125031
85;171;29062021125031
86;168;29062021125031
87;169;29062021125031
88;168;29062021125031
89;164;29062021125031
90;165;29062021125031
91;164;29062021125031
92;159;29062021125031
93;160;29062021125031
94;158;29062021125031
95;155;29062021125031
96;156;29062021125031
97;153;29062021125031
98;151;29062021125031
99;150;29062021125031
100;146;29062021125031
101;147;29062021125031
102;145;29062021125031
103;145;29062021125031
104;145;29062021125031
105;140;29062021125031
106;143;29062021125031
107;140;29062021125031
108;140;29062021125031
109;141;29062021125031
110;137;29062021125031
111;137;29062021125031
112;137;29062021125031
113;134;29062021125031
114;137;29062021125031
115;136;29062021125031
116;133;29062021125031
117;136;29062021125031
118;132;29062021125031
119;133;29062021125031
120;131;29062021125031
121;130;29062021125031
122;130;29062021125031
123;129;29062021125031
124;129;29062021125031
125;129;29062021125031
126;127;29062021125031
127;128;29062021125031
128;130;29062021125031
129;126;29062021125031
130;127;29062021125031
131;127;29062021125031
132;125;29062021125031
133;128;29062021125031
134;125;29062021125031
135;125;29062021125031
136;126;29062021125031
137;123;29062021125031
138;124;29062021125031
139;124;29062021125031
140;123;29062021125031
141;126;29062021125031
142;123;29062021125031
143;122;29062021125031
144;124;29062021125031
145;121;29062021125031
146;123;29062021125031
147;121;29062021125031
148;120;29062021125031
149;121;29062021125031
150;122;29062021125031
151;121;29062021125031
152;122;29062021125031
153;120;29062021125031
154;121;29062021125031
155;120;29062021125031
156;120;29062021125031
157;120;29062021125031
158;121;29062021125031
159;120;29062021125031
160;121;29062021125031
161;119;29062021125031
162;120;29062021125031
163;122;29062021125031
164;119;29062021125031
165;121;29062021125031
166;119;29062021125031
167;120;29062021125031
168;120;29062021125031
169;118;29062021125031
170;121;29062021125031
171;119;29062021125031
172;118;29062021125031
173;120;29062021125031
174;118;29062021125031
175;118;29062021125031
176;120;29062021125031
177;119;29062021125031
178;121;29062021125031
179;119;29062021125031
180;119;29062021125031
181;121;29062021125031
182;119;29062021125031
183;118;29062021125031
184;119;29062021125031
185;117;29062021125031
186;120;29062021125031
187;119;29062021125031
188;117;29062021125031
189;119;29062021125031
190;118;29062021125031
191;118;29062021125031
192;121;29062021125031
193;118;29062021125031
194;118;29062021125031
195;119;29062021125031
196;118;29062021125031
197;119;29062021125031
198;119;29062021125031
199;118;29062021125031
200;0;29062021125031
0;0;29062021125031
1;141;29062021125031
2;123;29062021125031
3;121;29062021125031
4;122;29062021125031
5;123;29062021125031
6;121;29062021125031
7;122;29062021125031
8;125;29062021125031
9;123;29062021125031
10;127;29062021125031
11;124;29062021125031
12;125;29062021125031
13;128;29062021125031
14;129;29062021125031
15;134;29062021125031
16;139;29062021125031
17;145;29062021125031
18;164;29062021125031
19;204;29062021125031
20;284;29062021125031
21;497;29062021125031
22;975;29062021125031
23;1022;29062021125031
24;1023;29062021125031
25;1023;29062021125031
26;1023;29062021125031
27;1023;29062021125031
28;1023;29062021125031
29;1023;29062021125031
30;1023;29062021125031
31;1023;29062021125031
32;1023;29062021125031
33;1022;29062021125031
34;869;29062021125031
35;667;29062021125031
36;504;29062021125031
37;404;29062021125031
38;326;29062021125031
39;281;29062021125031
40;249;29062021125031
41;222;29062021125031
42;215;29062021125031
43;204;29062021125031
44;198;29062021125031
45;196;29062021125031
46;192;29062021125031
47;189;29062021125031
48;192;29062021125031
49;190;29062021125031
50;192;29062021125031
51;189;29062021125031
52;191;29062021125031
53;195;29062021125031
54;193;29062021125031
55;197;29062021125031
56;198;29062021125031
57;200;29062021125031
58;204;29062021125031
59;207;29062021125031
60;210;29062021125031
61;214;29062021125031
62;213;29062021125031
63;217;29062021125031
64;219;29062021125031
65;215;29062021125031
66;220;29062021125031
67;217;29062021125031
68;212;29062021125031
69;216;29062021125031
70;210;29062021125031
71;208;29062021125031
72;207;29062021125031
73;201;29062021125031
74;202;29062021125031
75;195;29062021125031
76;193;29062021125031
77;193;29062021125031
78;186;29062021125031
79;184;29062021125031
80;182;29062021125031
81;178;29062021125031
82;176;29062021125031
83;173;29062021125031
84;171;29062021125031
85;169;29062021125031
86;169;29062021125031
87;166;29062021125031
88;169;29062021125031
89;165;29062021125031
90;165;29062021125031
91;164;29062021125031
92;159;29062021125031
93;160;29062021125031
94;158;29062021125031
95;154;29062021125031
96;155;29062021125031
97;151;29062021125031
98;151;29062021125031
99;150;29062021125031
100;147;29062021125031
101;149;29062021125031
102;145;29062021125031
103;143;29062021125031
104;143;29062021125031
105;140;29062021125031
106;144;29062021125031
107;140;29062021125031
108;138;29062021125031
109;141;29062021125031
110;137;29062021125031
111;136;29062021125031
112;139;29062021125031
113;133;29062021125031
114;135;29062021125031
115;136;29062021125031
116;133;29062021125031
117;135;29062021125031
118;131;29062021125031
119;131;29062021125031
120;131;29062021125031
121;129;29062021125031
122;130;29062021125031
123;130;29062021125031
124;127;29062021125031
125;129;29062021125031
126;127;29062021125031
127;129;29062021125031
128;129;29062021125031
129;125;29062021125031
130;126;29062021125031
131;126;29062021125031
132;124;29062021125031
133;127;29062021125031
134;123;29062021125031
135;123;29062021125031
136;126;29062021125031
137;123;29062021125031
138;124;29062021125031
139;124;29062021125031
140;122;29062021125031
141;124;29062021125031
142;122;29062021125031
143;122;29062021125031
144;122;29062021125031
145;120;29062021125031
146;123;29062021125031
147;122;29062021125031
148;121;29062021125031
149;121;29062021125031
150;121;29062021125031
151;120;29062021125031
152;120;29062021125031
153;119;29062021125031
154;121;29062021125031
155;120;29062021125031
156;118;29062021125031
157;120;29062021125031
158;119;29062021125031
159;120;29062021125031
160;120;29062021125031
161;119;29062021125031
162;121;29062021125031
163;120;29062021125031
164;118;29062021125031
165;121;29062021125031
166;119;29062021125031
167;119;29062021125031
168;120;29062021125031
169;117;29062021125031
170;121;29062021125031
171;119;29062021125031
172;118;29062021125031
173;119;29062021125031
174;119;29062021125031
175;118;29062021125031
176;119;29062021125031
177;118;29062021125031
178;120;29062021125031
179;118;29062021125031
180;118;29062021125031
181;120;29062021125031
182;119;29062021125031
183;118;29062021125031
184;119;29062021125031
185;116;29062021125031
186;120;29062021125031
187;119;29062021125031
188;118;29062021125031
189;118;29062021125031
190;117;29062021125031
191;117;29062021125031
192;120;29062021125031
193;118;29062021125031
194;118;29062021125031
195;118;29062021125031
196;117;29062021125031
197;119;29062021125031
198;118;29062021125031
199;118;29062021125031
200;0;29062021125031
0;0;29062021125031
1;141;29062021125031
2;123;29062021125031
3;123;29062021125031
4;123;29062021125031
5;124;29062021125031
6;121;29062021125031
7;123;29062021125031
8;124;29062021125031
9;122;29062021125031
10;126;29062021125031
11;125;29062021125031
12;125;29062021125031
13;129;29062021125031
14;129;29062021125031
15;134;29062021125031
16;138;29062021125031
17;145;29062021125031
18;166;29062021125031
19;201;29062021125031
20;287;29062021125031
21;497;29062021125031
22;977;29062021125031
23;1023;29062021125031
24;1023;29062021125031
25;1023;29062021125031
26;1023;29062021125031
27;1023;29062021125031
28;1023;29062021125031
29;1023;29062021125031
30;1023;29062021125031
31;1023;29062021125031
32;1023;29062021125031
33;1023;29062021125031
34;862;29062021125031
35;662;29062021125031
36;502;29062021125031
37;399;29062021125031
38;327;29062021125031
39;276;29062021125031
40;250;29062021125031
41;224;29062021125031
42;215;29062021125031
43;203;29062021125031
44;199;29062021125031
45;195;29062021125031
46;191;29062021125031
47;191;29062021125031
48;192;29062021125031
49;187;29062021125031
50;191;29062021125031
51;189;29062021125031
52;189;29062021125031
53;194;29062021125031
54;193;29062021125031
55;195;29062021125031
56;199;29062021125031
57;200;29062021125031
58;206;29062021125031
59;207;29062021125031
60;209;29062021125031
61;214;29062021125031
62;214;29062021125031
63;216;29062021125031
64;220;29062021125031
65;214;29062021125031
66;220;29062021125031
67;218;29062021125031
68;215;29062021125031
69;214;29062021125031
70;211;29062021125031
71;208;29062021125031
72;210;29062021125031
73;202;29062021125031
74;203;29062021125031
75;194;29062021125031
76;193;29062021125031
77;190;29062021125031
78;187;29062021125031
79;183;29062021125031
80;181;29062021125031
81;176;29062021125031
82;177;29062021125031
83;173;29062021125031
84;172;29062021125031
85;171;29062021125031
86;168;29062021125031
87;169;29062021125031
88;168;29062021125031
89;163;29062021125031
90;166;29062021125031
91;163;29062021125031
92;162;29062021125031
93;160;29062021125031
94;156;29062021125031
95;154;29062021125031
96;154;29062021125031
97;153;29062021125031
98;150;29062021125031
99;149;29062021125031
100;146;29062021125031
101;148;29062021125031
102;144;29062021125031
103;144;29062021125031
104;144;29062021125031
105;141;29062021125031
106;143;29062021125031
107;142;29062021125031
108;138;29062021125031
109;139;29062021125031
110;136;29062021125031
111;136;29062021125031
112;138;29062021125031
113;134;29062021125031
114;135;29062021125031
115;136;29062021125031
116;134;29062021125031
117;136;29062021125031
118;133;29062021125031
119;133;29062021125031
120;132;29062021125031
121;129;29062021125031
122;131;29062021125031
123;130;29062021125031
124;128;29062021125031
125;130;29062021125031
126;127;29062021125031
127;128;29062021125031
128;129;29062021125031
129;127;29062021125031
130;127;29062021125031
131;126;29062021125031
132;125;29062021125031
133;128;29062021125031
134;124;29062021125031
135;124;29062021125031
136;126;29062021125031
137;123;29062021125031
138;124;29062021125031
139;124;29062021125031
140;122;29062021125031
141;125;29062021125031
142;123;29062021125031
143;122;29062021125031
144;123;29062021125031
145;120;29062021125031
146;123;29062021125031
147;122;29062021125031
148;120;29062021125031
149;121;29062021125031
150;121;29062021125031
151;121;29062021125031
152;122;29062021125031
153;119;29062021125031
154;121;29062021125031
155;119;29062021125031
156;119;29062021125031
157;120;29062021125031
158;120;29062021125031
159;119;29062021125031
160;120;29062021125031
161;119;29062021125031
162;121;29062021125031
163;120;29062021125031
164;119;29062021125031
165;120;29062021125031
166;119;29062021125031
167;119;29062021125031
168;121;29062021125031
169;117;29062021125031
170;120;29062021125031
171;119;29062021125031
172;118;29062021125031
173;120;29062021125031
174;119;29062021125031
175;117;29062021125031
176;120;29062021125031
177;118;29062021125031
178;120;29062021125031
179;119;29062021125031
180;118;29062021125031
181;120;29062021125031
182;119;29062021125031
183;118;29062021125031
184;119;29062021125031
185;116;29062021125031
186;120;29062021125031
187;119;29062021125031
188;117;29062021125031
189;119;29062021125031
190;118;29062021125031
191;118;29062021125031
192;121;29062021125031
193;118;29062021125031
194;118;29062021125031
195;119;29062021125031
196;118;29062021125031
197;119;29062021125031
198;119;29062021125031
199;118;29062021125031
200;0;29062021125031
0;0;29062021125031
1;140;29062021125031
2;122;29062021125031
3;121;29062021125031
4;121;29062021125031
5;123;29062021125031
6;121;29062021125031
7;123;29062021125031
8;124;29062021125031
9;122;29062021125031
10;126;29062021125031
11;124;29062021125031
12;125;29062021125031
13;128;29062021125031
14;129;29062021125031
15;132;29062021125031
16;137;29062021125031
17;144;29062021125031
18;166;29062021125031
19;200;29062021125031
20;287;29062021125031
21;493;29062021125031
22;972;29062021125031
23;1021;29062021125031
24;1023;29062021125031
25;1023;29062021125031
26;1023;29062021125031
27;1023;29062021125031
28;1023;29062021125031
29;1023;29062021125031
30;1023;29062021125031
31;1023;29062021125031
32;1023;29062021125031
33;1022;29062021125031
34;863;29062021125031
35;665;29062021125031
36;508;29062021125031
37;402;29062021125031
38;328;29062021125031
39;281;29062021125031
40;248;29062021125031
41;226;29062021125031
42;215;29062021125031
43;203;29062021125031
44;198;29062021125031
45;192;29062021125031
46;189;29062021125031
47;190;29062021125031
48;192;29062021125031
49;190;29062021125031
50;191;29062021125031
51;191;29062021125031
52;189;29062021125031
53;195;29062021125031
54;195;29062021125031
55;195;29062021125031
56;199;29062021125031
57;199;29062021125031
58;206;29062021125031
59;206;29062021125031
60;210;29062021125031
61;213;29062021125031
62;212;29062021125031
63;216;29062021125031
64;220;29062021125031
65;214;29062021125031
66;217;29062021125031
67;218;29062021125031
68;212;29062021125031
69;214;29062021125031
70;210;29062021125031
71;208;29062021125031
72;207;29062021125031
73;201;29062021125031
74;201;29062021125031
75;194;29062021125031
76;191;29062021125031
77;190;29062021125031
78;187;29062021125031
79;182;29062021125031
80;182;29062021125031
81;176;29062021125031
82;175;29062021125031
83;173;29062021125031
84;170;29062021125031
85;170;29062021125031
86;167;29062021125031
87;167;29062021125031
88;167;29062021125031
89;163;29062021125031
90;165;29062021125031
91;164;29062021125031
92;158;29062021125031
93;160;29062021125031
94;156;29062021125031
95;152;29062021125031
96;154;29062021125031
97;152;29062021125031
98;151;29062021125031
99;149;29062021125031
100;146;29062021125031
101;148;29062021125031
102;144;29062021125031
103;144;29062021125031
104;144;29062021125031
105;141;29062021125031
106;143;29062021125031
107;139;29062021125031
108;140;29062021125031
109;140;29062021125031
110;137;29062021125031
111;137;29062021125031
112;138;29062021125031
113;133;29062021125031
114;135;29062021125031
115;135;29062021125031
116;132;29062021125031
117;135;29062021125031
118;131;29062021125031
119;133;29062021125031
120;131;29062021125031
121;130;29062021125031
122;130;29062021125031
123;129;29062021125031
124;128;29062021125031
125;129;29062021125031
126;128;29062021125031
127;126;29062021125031
128;129;29062021125031
129;126;29062021125031
130;126;29062021125031
131;126;29062021125031
132;125;29062021125031
133;128;29062021125031
134;124;29062021125031
135;122;29062021125031
136;126;29062021125031
137;123;29062021125031
138;124;29062021125031
139;123;29062021125031
140;122;29062021125031
141;124;29062021125031
142;122;29062021125031
143;121;29062021125031
144;123;29062021125031
145;121;29062021125031
146;124;29062021125031
147;122;29062021125031
148;120;29062021125031
149;121;29062021125031
150;120;29062021125031
151;121;29062021125031
152;122;29062021125031
153;119;29062021125031
154;121;29062021125031
155;120;29062021125031
156;119;29062021125031
157;120;29062021125031
158;119;29062021125031
159;119;29062021125031
160;120;29062021125031
161;118;29062021125031
162;120;29062021125031
163;119;29062021125031
164;119;29062021125031
165;120;29062021125031
166;119;29062021125031
167;118;29062021125031
168;120;29062021125031
169;117;29062021125031
170;120;29062021125031
171;119;29062021125031
172;118;29062021125031
173;119;29062021125031
174;119;29062021125031
175;119;29062021125031
176;119;29062021125031
177;117;29062021125031
178;120;29062021125031
179;118;29062021125031
180;117;29062021125031
181;119;29062021125031
182;119;29062021125031
183;118;29062021125031
184;119;29062021125031
185;117;29062021125031
186;120;29062021125031
187;119;29062021125031
188;117;29062021125031
189;118;29062021125031
190;117;29062021125031
191;117;29062021125031
192;121;29062021125031
193;117;29062021125031
194;118;29062021125031
195;118;29062021125031
196;117;29062021125031
197;119;29062021125031
198;118;29062021125031
199;117;29062021125031
200;0;29062021125031
0;0;29062021125032
1;141;29062021125032
2;122;29062021125032
3;121;29062021125032
4;122;29062021125032
5;123;29062021125032
6;120;29062021125032
7;123;29062021125032
8;124;29062021125032
9;122;29062021125032
10;126;29062021125032
11;124;29062021125032
12;125;29062021125032
13;130;29062021125032
14;129;29062021125032
15;134;29062021125032
16;139;29062021125032
17;145;29062021125032
18;166;29062021125032
19;200;29062021125032
20;288;29062021125032
21;495;29062021125032
22;977;29062021125032
23;1022;29062021125032
24;1023;29062021125032
25;1023;29062021125032
26;1023;29062021125032
27;1023;29062021125032
28;1023;29062021125032
29;1023;29062021125032
30;1023;29062021125032
31;1023;29062021125032
32;1023;29062021125032
33;1022;29062021125032
34;858;29062021125032
35;665;29062021125032
36;508;29062021125032
37;398;29062021125032
38;330;29062021125032
39;283;29062021125032
40;250;29062021125032
41;224;29062021125032
42;214;29062021125032
43;202;29062021125032
44;197;29062021125032
45;196;29062021125032
46;190;29062021125032
47;190;29062021125032
48;193;29062021125032
49;190;29062021125032
50;190;29062021125032
51;190;29062021125032
52;191;29062021125032
53;195;29062021125032
54;195;29062021125032
55;194;29062021125032
56;200;29062021125032
57;202;29062021125032
58;206;29062021125032
59;206;29062021125032
60;210;29062021125032
61;213;29062021125032
62;211;29062021125032
63;217;29062021125032
64;218;29062021125032
65;217;29062021125032
66;220;29062021125032
67;216;29062021125032
68;214;29062021125032
69;217;29062021125032
70;211;29062021125032
71;208;29062021125032
72;206;29062021125032
73;200;29062021125032
74;200;29062021125032
75;195;29062021125032
76;193;29062021125032
77;191;29062021125032
78;185;29062021125032
79;185;29062021125032
80;181;29062021125032
81;176;29062021125032
82;177;29062021125032
83;173;29062021125032
84;171;29062021125032
85;172;29062021125032
86;169;29062021125032
87;167;29062021125032
88;169;29062021125032
89;163;29062021125032
90;166;29062021125032
91;161;29062021125032
92;159;29062021125032
93;160;29062021125032
94;157;29062021125032
95;155;29062021125032
96;156;29062021125032
97;152;29062021125032
98;150;29062021125032
99;148;29062021125032
100;147;29062021125032
101;148;29062021125032
102;145;29062021125032
103;144;29062021125032
104;144;29062021125032
105;141;29062021125032
106;144;29062021125032
107;140;29062021125032
108;138;29062021125032
109;138;29062021125032
110;136;29062021125032
111;137;29062021125032
112;138;29062021125032
113;134;29062021125032
114;134;29062021125032
115;135;29062021125032
116;133;29062021125032
117;135;29062021125032
118;132;29062021125032
119;132;29062021125032
120;131;29062021125032
121;129;29062021125032
122;130;29062021125032
123;129;29062021125032
124;129;29062021125032
125;130;29062021125032
126;128;29062021125032
127;127;29062021125032
128;130;29062021125032
129;126;29062021125032
130;127;29062021125032
131;127;29062021125032
132;126;29062021125032
133;128;29062021125032
134;126;29062021125032
135;125;29062021125032
136;127;29062021125032
137;122;29062021125032
138;124;29062021125032
139;123;29062021125032
140;121;29062021125032
141;125;29062021125032
142;122;29062021125032
143;122;29062021125032
144;123;29062021125032
145;120;29062021125032
146;123;29062021125032
147;121;29062021125032
148;121;29062021125032
149;121;29062021125032
150;120;29062021125032
151;121;29062021125032
152;121;29062021125032
153;119;29062021125032
154;121;29062021125032
155;120;29062021125032
156;119;29062021125032
157;120;29062021125032
158;118;29062021125032
159;120;29062021125032
160;120;29062021125032
161;119;29062021125032
162;121;29062021125032
163;120;29062021125032
164;117;29062021125032
165;121;29062021125032
166;119;29062021125032
167;120;29062021125032
168;121;29062021125032
169;118;29062021125032
170;121;29062021125032
171;119;29062021125032
172;119;29062021125032
173;119;29062021125032
174;118;29062021125032
175;118;29062021125032
176;119;29062021125032
177;118;29062021125032
178;120;29062021125032
179;119;29062021125032
180;119;29062021125032
181;120;29062021125032
182;119;29062021125032
183;117;29062021125032
184;119;29062021125032
185;117;29062021125032
186;120;29062021125032
187;119;29062021125032
188;117;29062021125032
189;119;29062021125032
190;118;29062021125032
191;119;29062021125032
192;121;29062021125032
193;118;29062021125032
194;117;29062021125032
195;119;29062021125032
196;118;29062021125032
197;118;29062021125032
198;119;29062021125032
199;117;29062021125032
200;0;29062021125032
0;0;29062021125032
1;141;29062021125032
2;123;29062021125032
3;122;29062021125032
4;122;29062021125032
5;123;29062021125032
6;122;29062021125032
7;124;29062021125032
8;125;29062021125032
9;124;29062021125032
10;126;29062021125032
11;125;29062021125032
12;125;29062021125032
13;130;29062021125032
14;129;29062021125032
15;134;29062021125032
16;138;29062021125032
17;145;29062021125032
18;165;29062021125032
19;201;29062021125032
20;284;29062021125032
21;494;29062021125032
22;974;29062021125032
23;1023;29062021125032
24;1023;29062021125032
25;1023;29062021125032
26;1023;29062021125032
27;1023;29062021125032
28;1023;29062021125032
29;1023;29062021125032
30;1023;29062021125032
31;1023;29062021125032
32;1023;29062021125032
33;1023;29062021125032
34;867;29062021125032
35;665;29062021125032
36;504;29062021125032
37;401;29062021125032
38;330;29062021125032
39;281;29062021125032
40;249;29062021125032
41;225;29062021125032
42;213;29062021125032
43;204;29062021125032
44;198;29062021125032
45;196;29062021125032
46;190;29062021125032
47;191;29062021125032
48;192;29062021125032
49;189;29062021125032
50;192;29062021125032
51;191;29062021125032
52;189;29062021125032
53;195;29062021125032
54;193;29062021125032
55;195;29062021125032
56;198;29062021125032
57;198;29062021125032
58;206;29062021125032
59;207;29062021125032
60;208;29062021125032
61;212;29062021125032
62;212;29062021125032
63;214;29062021125032
64;217;29062021125032
65;214;29062021125032
66;219;29062021125032
67;216;29062021125032
68;213;29062021125032
69;215;29062021125032
70;211;29062021125032
71;208;29062021125032
72;207;29062021125032
73;201;29062021125032
74;201;29062021125032
75;196;29062021125032
76;193;29062021125032
77;191;29062021125032
78;187;29062021125032
79;184;29062021125032
80;181;29062021125032
81;177;29062021125032
82;176;29062021125032
83;172;29062021125032
84;171;29062021125032
85;169;29062021125032
86;167;29062021125032
87;167;29062021125032
88;166;29062021125032
89;163;29062021125032
90;166;29062021125032
91;163;29062021125032
92;160;29062021125032
93;160;29062021125032
94;159;29062021125032
95;153;29062021125032
96;155;29062021125032
97;151;29062021125032
98;151;29062021125032
99;150;29062021125032
100;148;29062021125032
101;148;29062021125032
102;145;29062021125032
103;145;29062021125032
104;144;29062021125032
105;140;29062021125032
106;144;29062021125032
107;141;29062021125032
108;139;29062021125032
109;140;29062021125032
110;136;29062021125032
111;136;29062021125032
112;137;29062021125032
113;134;29062021125032
114;136;29062021125032
115;135;29062021125032
116;133;29062021125032
117;136;29062021125032
118;132;29062021125032
119;133;29062021125032
120;131;29062021125032
121;130;29062021125032
122;132;29062021125032
123;131;29062021125032
124;128;29062021125032
125;131;29062021125032
126;128;29062021125032
127;127;29062021125032
128;130;29062021125032
129;126;29062021125032
130;127;29062021125032
131;127;29062021125032
132;126;29062021125032
133;129;29062021125032
134;125;29062021125032
135;125;29062021125032
136;126;29062021125032
137;124;29062021125032
138;125;29062021125032
139;124;29062021125032
140;122;29062021125032
141;124;29062021125032
142;122;29062021125032
143;122;29062021125032
144;123;29062021125032
145;121;29062021125032
146;124;29062021125032
147;122;29062021125032
148;121;29062021125032
149;121;29062021125032
150;121;29062021125032
151;121;29062021125032
152;122;29062021125032
153;120;29062021125032
154;122;29062021125032
155;120;29062021125032
156;120;29062021125032
157;120;29062021125032
158;120;29062021125032
159;119;29062021125032
160;121;29062021125032
161;119;29062021125032
162;121;29062021125032
163;119;29062021125032
164;119;29062021125032
165;122;29062021125032
166;120;29062021125032
167;119;29062021125032
168;121;29062021125032
169;118;29062021125032
170;121;29062021125032
171;120;29062021125032
172;119;29062021125032
173;119;29062021125032
174;119;29062021125032
175;119;29062021125032
176;119;29062021125032
177;117;29062021125032
178;120;29062021125032
179;119;29062021125032
180;118;29062021125032
181;120;29062021125032
182;120;29062021125032
183;118;29062021125032
184;120;29062021125032
185;116;29062021125032
186;119;29062021125032
187;118;29062021125032
188;117;29062021125032
189;119;29062021125032
190;119;29062021125032
191;118;29062021125032
192;120;29062021125032
193;117;29062021125032
194;119;29062021125032
195;118;29062021125032
196;118;29062021125032
197;119;29062021125032
198;118;29062021125032
199;117;29062021125032
200;0;29062021125032
0;0;29062021125032
1;141;29062021125032
2;124;29062021125032
3;122;29062021125032
4;122;29062021125032
5;124;29062021125032
6;122;29062021125032
7;125;29062021125032
8;125;29062021125032
9;124;29062021125032
10;126;29062021125032
11;126;29062021125032
12;126;29062021125032
13;131;29062021125032
14;129;29062021125032
15;133;29062021125032
16;139;29062021125032
17;145;29062021125032
18;165;29062021125032
19;202;29062021125032
20;284;29062021125032
21;491;29062021125032
22;959;29062021125032
23;1023;29062021125032
24;1023;29062021125032
25;1023;29062021125032
26;1023;29062021125032
27;1023;29062021125032
28;1023;29062021125032
29;1023;29062021125032
30;1023;29062021125032
31;1023;29062021125032
32;1023;29062021125032
33;1023;29062021125032
34;862;29062021125032
35;666;29062021125032
36;507;29062021125032
37;398;29062021125032
38;329;29062021125032
39;283;29062021125032
40;249;29062021125032
41;226;29062021125032
42;213;29062021125032
43;204;29062021125032
44;198;29062021125032
45;193;29062021125032
46;191;29062021125032
47;189;29062021125032
48;192;29062021125032
49;188;29062021125032
50;190;29062021125032
51;190;29062021125032
52;190;29062021125032
53;193;29062021125032
54;193;29062021125032
55;195;29062021125032
56;199;29062021125032
57;197;29062021125032
58;206;29062021125032
59;205;29062021125032
60;209;29062021125032
61;212;29062021125032
62;211;29062021125032
63;214;29062021125032
64;216;29062021125032
65;216;29062021125032
66;219;29062021125032
67;215;29062021125032
68;215;29062021125032
69;214;29062021125032
70;211;29062021125032
71;210;29062021125032
72;207;29062021125032
73;201;29062021125032
74;202;29062021125032
75;195;29062021125032
76;191;29062021125032
77;190;29062021125032
78;186;29062021125032
79;184;29062021125032
80;181;29062021125032
81;177;29062021125032
82;175;29062021125032
83;170;29062021125032
84;168;29062021125032
85;171;29062021125032
86;168;29062021125032
87;168;29062021125032
88;169;29062021125032
89;162;29062021125032
90;165;29062021125032
91;162;29062021125032
92;157;29062021125032
93;158;29062021125032
94;157;29062021125032
95;154;29062021125032
96;156;29062021125032
97;151;29062021125032
98;151;29062021125032
99;148;29062021125032
100;147;29062021125032
101;147;29062021125032
102;146;29062021125032
103;144;29062021125032
104;144;29062021125032
105;140;29062021125032
106;144;29062021125032
107;139;29062021125032
108;138;29062021125032
109;139;29062021125032
110;136;29062021125032
111;135;29062021125032
112;138;29062021125032
113;133;29062021125032
114;135;29062021125032
115;136;29062021125032
116;132;29062021125032
117;135;29062021125032
118;132;29062021125032
119;132;29062021125032
120;130;29062021125032
121;128;29062021125032
122;129;29062021125032
123;130;29062021125032
124;127;29062021125032
125;130;29062021125032
126;127;29062021125032
127;127;29062021125032
128;129;29062021125032
129;126;29062021125032
130;126;29062021125032
131;127;29062021125032
132;125;29062021125032
133;129;29062021125032
134;125;29062021125032
135;124;29062021125032
136;126;29062021125032
137;124;29062021125032
138;124;29062021125032
139;122;29062021125032
140;122;29062021125032
141;124;29062021125032
142;123;29062021125032
143;121;29062021125032
144;123;29062021125032
145;120;29062021125032
146;123;29062021125032
147;122;29062021125032
148;120;29062021125032
149;120;29062021125032
150;121;29062021125032
151;121;29062021125032
152;121;29062021125032
153;119;29062021125032
154;122;29062021125032
155;120;29062021125032
156;120;29062021125032
157;119;29062021125032
158;119;29062021125032
159;119;29062021125032
160;121;29062021125032
161;119;29062021125032
162;120;29062021125032
163;120;29062021125032
164;118;29062021125032
165;120;29062021125032
166;118;29062021125032
167;119;29062021125032
168;121;29062021125032
169;118;29062021125032
170;120;29062021125032
171;119;29062021125032
172;119;29062021125032
173;121;29062021125032
174;119;29062021125032
175;118;29062021125032
176;119;29062021125032
177;118;29062021125032
178;120;29062021125032
179;120;29062021125032
180;118;29062021125032
181;120;29062021125032
182;119;29062021125032
183;117;29062021125032
184;119;29062021125032
185;117;29062021125032
186;119;29062021125032
187;118;29062021125032
188;116;29062021125032
189;118;29062021125032
190;118;29062021125032
191;118;29062021125032
192;121;29062021125032
193;118;29062021125032
194;118;29062021125032
195;117;29062021125032
196;117;29062021125032
197;119;29062021125032
198;119;29062021125032
199;116;29062021125032
200;0;29062021125032
