ind;val;datetime
0;0;17062021180054
1;151;17062021180054
2;158;17062021180054
3;150;17062021180054
4;155;17062021180054
5;150;17062021180054
6;152;17062021180054
7;158;17062021180054
8;158;17062021180054
9;148;17062021180054
10;154;17062021180054
11;154;17062021180054
12;150;17062021180054
13;155;17062021180054
14;151;17062021180054
15;155;17062021180054
16;151;17062021180054
17;147;17062021180054
18;152;17062021180054
19;156;17062021180054
20;151;17062021180054
21;149;17062021180054
22;145;17062021180054
23;149;17062021180054
24;157;17062021180054
25;149;17062021180054
26;149;17062021180054
27;147;17062021180054
28;148;17062021180054
29;159;17062021180054
30;152;17062021180054
31;146;17062021180054
32;153;17062021180054
33;148;17062021180054
34;152;17062021180054
35;152;17062021180054
36;150;17062021180054
37;154;17062021180054
38;145;17062021180054
39;154;17062021180054
40;150;17062021180054
41;145;17062021180054
42;148;17062021180054
43;149;17062021180054
44;152;17062021180054
45;167;17062021180054
46;158;17062021180054
47;151;17062021180054
48;146;17062021180054
49;146;17062021180054
50;150;17062021180054
51;149;17062021180054
52;146;17062021180054
53;149;17062021180054
54;145;17062021180054
55;146;17062021180054
56;146;17062021180054
57;147;17062021180054
58;149;17062021180054
59;150;17062021180054
60;153;17062021180054
61;155;17062021180054
62;156;17062021180054
63;150;17062021180054
64;159;17062021180054
65;146;17062021180054
66;149;17062021180054
67;148;17062021180054
68;148;17062021180054
69;150;17062021180054
70;152;17062021180054
71;145;17062021180054
72;149;17062021180054
73;150;17062021180054
74;151;17062021180054
75;152;17062021180054
76;148;17062021180054
77;148;17062021180054
78;152;17062021180054
79;161;17062021180054
80;153;17062021180054
81;146;17062021180054
82;149;17062021180054
83;148;17062021180054
84;148;17062021180054
85;149;17062021180054
86;154;17062021180054
87;156;17062021180054
88;147;17062021180054
89;143;17062021180054
90;153;17062021180054
91;144;17062021180054
92;146;17062021180054
93;158;17062021180054
94;150;17062021180054
95;146;17062021180054
96;148;17062021180054
97;145;17062021180054
98;142;17062021180054
99;148;17062021180054
100;140;17062021180054
101;158;17062021180054
102;155;17062021180054
103;145;17062021180054
104;147;17062021180054
105;143;17062021180054
106;144;17062021180054
107;144;17062021180054
108;148;17062021180054
109;147;17062021180054
110;143;17062021180054
111;142;17062021180054
112;144;17062021180054
113;141;17062021180054
114;141;17062021180054
115;146;17062021180054
116;146;17062021180054
117;147;17062021180054
118;144;17062021180054
119;151;17062021180054
120;146;17062021180054
121;143;17062021180054
122;147;17062021180054
123;145;17062021180054
124;152;17062021180054
125;144;17062021180054
126;144;17062021180054
127;151;17062021180054
128;156;17062021180054
129;149;17062021180054
130;149;17062021180054
131;145;17062021180054
132;144;17062021180054
133;161;17062021180054
134;145;17062021180054
135;148;17062021180054
136;148;17062021180054
137;146;17062021180054
138;154;17062021180054
139;146;17062021180054
140;151;17062021180054
141;153;17062021180054
142;150;17062021180054
143;145;17062021180054
144;153;17062021180054
145;149;17062021180054
146;151;17062021180054
147;157;17062021180054
148;148;17062021180054
149;153;17062021180054
150;154;17062021180054
151;156;17062021180054
152;148;17062021180054
153;148;17062021180054
154;152;17062021180054
155;160;17062021180054
156;153;17062021180054
157;148;17062021180054
158;148;17062021180054
159;146;17062021180054
160;145;17062021180054
161;148;17062021180054
162;148;17062021180054
163;151;17062021180054
164;154;17062021180054
165;153;17062021180054
166;147;17062021180054
167;153;17062021180054
168;156;17062021180054
169;145;17062021180054
170;152;17062021180054
171;151;17062021180054
172;148;17062021180054
173;157;17062021180054
174;147;17062021180054
175;149;17062021180054
176;151;17062021180054
177;148;17062021180054
178;156;17062021180054
179;153;17062021180054
180;151;17062021180054
181;149;17062021180054
182;156;17062021180054
183;148;17062021180054
184;151;17062021180054
185;145;17062021180054
186;155;17062021180054
187;151;17062021180054
188;154;17062021180054
189;154;17062021180054
190;147;17062021180054
191;155;17062021180054
192;155;17062021180054
193;148;17062021180054
194;160;17062021180054
195;152;17062021180054
196;150;17062021180054
197;149;17062021180054
198;154;17062021180054
199;147;17062021180054
200;0;17062021180054
0;0;17062021180055
1;151;17062021180055
2;159;17062021180055
3;148;17062021180055
4;153;17062021180055
5;149;17062021180055
6;153;17062021180055
7;155;17062021180055
8;157;17062021180055
9;147;17062021180055
10;153;17062021180055
11;152;17062021180055
12;151;17062021180055
13;154;17062021180055
14;150;17062021180055
15;153;17062021180055
16;152;17062021180055
17;147;17062021180055
18;152;17062021180055
19;154;17062021180055
20;151;17062021180055
21;147;17062021180055
22;144;17062021180055
23;148;17062021180055
24;157;17062021180055
25;147;17062021180055
26;148;17062021180055
27;148;17062021180055
28;148;17062021180055
29;159;17062021180055
30;152;17062021180055
31;146;17062021180055
32;149;17062021180055
33;147;17062021180055
34;150;17062021180055
35;151;17062021180055
36;151;17062021180055
37;155;17062021180055
38;144;17062021180055
39;151;17062021180055
40;149;17062021180055
41;146;17062021180055
42;150;17062021180055
43;147;17062021180055
44;150;17062021180055
45;165;17062021180055
46;156;17062021180055
47;150;17062021180055
48;144;17062021180055
49;145;17062021180055
50;150;17062021180055
51;148;17062021180055
52;147;17062021180055
53;148;17062021180055
54;144;17062021180055
55;145;17062021180055
56;144;17062021180055
57;146;17062021180055
58;150;17062021180055
59;153;17062021180055
60;153;17062021180055
61;154;17062021180055
62;153;17062021180055
63;149;17062021180055
64;156;17062021180055
65;144;17062021180055
66;148;17062021180055
67;147;17062021180055
68;149;17062021180055
69;150;17062021180055
70;152;17062021180055
71;145;17062021180055
72;147;17062021180055
73;148;17062021180055
74;148;17062021180055
75;150;17062021180055
76;148;17062021180055
77;147;17062021180055
78;152;17062021180055
79;161;17062021180055
80;151;17062021180055
81;143;17062021180055
82;148;17062021180055
83;147;17062021180055
84;146;17062021180055
85;149;17062021180055
86;153;17062021180055
87;155;17062021180055
88;146;17062021180055
89;139;17062021180055
90;152;17062021180055
91;144;17062021180055
92;145;17062021180055
93;154;17062021180055
94;148;17062021180055
95;143;17062021180055
96;147;17062021180055
97;146;17062021180055
98;142;17062021180055
99;145;17062021180055
100;142;17062021180055
101;154;17062021180055
102;154;17062021180055
103;145;17062021180055
104;147;17062021180055
105;143;17062021180055
106;145;17062021180055
107;144;17062021180055
108;147;17062021180055
109;146;17062021180055
110;142;17062021180055
111;140;17062021180055
112;143;17062021180055
113;141;17062021180055
114;141;17062021180055
115;145;17062021180055
116;145;17062021180055
117;148;17062021180055
118;143;17062021180055
119;149;17062021180055
120;145;17062021180055
121;142;17062021180055
122;144;17062021180055
123;143;17062021180055
124;150;17062021180055
125;144;17062021180055
126;142;17062021180055
127;148;17062021180055
128;153;17062021180055
129;148;17062021180055
130;147;17062021180055
131;145;17062021180055
132;141;17062021180055
133;159;17062021180055
134;144;17062021180055
135;147;17062021180055
136;147;17062021180055
137;145;17062021180055
138;153;17062021180055
139;146;17062021180055
140;148;17062021180055
141;152;17062021180055
142;149;17062021180055
143;142;17062021180055
144;151;17062021180055
145;148;17062021180055
146;148;17062021180055
147;155;17062021180055
148;146;17062021180055
149;153;17062021180055
150;153;17062021180055
151;155;17062021180055
152;146;17062021180055
153;147;17062021180055
154;151;17062021180055
155;157;17062021180055
156;150;17062021180055
157;147;17062021180055
158;147;17062021180055
159;145;17062021180055
160;145;17062021180055
161;148;17062021180055
162;147;17062021180055
163;149;17062021180055
164;152;17062021180055
165;152;17062021180055
166;147;17062021180055
167;153;17062021180055
168;155;17062021180055
169;143;17062021180055
170;151;17062021180055
171;146;17062021180055
172;146;17062021180055
173;155;17062021180055
174;147;17062021180055
175;148;17062021180055
176;151;17062021180055
177;146;17062021180055
178;155;17062021180055
179;152;17062021180055
180;148;17062021180055
181;149;17062021180055
182;156;17062021180055
183;148;17062021180055
184;150;17062021180055
185;143;17062021180055
186;154;17062021180055
187;150;17062021180055
188;153;17062021180055
189;152;17062021180055
190;146;17062021180055
191;154;17062021180055
192;154;17062021180055
193;147;17062021180055
194;158;17062021180055
195;152;17062021180055
196;149;17062021180055
197;147;17062021180055
198;152;17062021180055
199;147;17062021180055
200;0;17062021180055
0;0;17062021180057
1;151;17062021180057
2;158;17062021180057
3;146;17062021180057
4;152;17062021180057
5;149;17062021180057
6;151;17062021180057
7;156;17062021180057
8;154;17062021180057
9;146;17062021180057
10;153;17062021180057
11;152;17062021180057
12;149;17062021180057
13;154;17062021180057
14;149;17062021180057
15;153;17062021180057
16;150;17062021180057
17;147;17062021180057
18;151;17062021180057
19;154;17062021180057
20;150;17062021180057
21;146;17062021180057
22;143;17062021180057
23;149;17062021180057
24;156;17062021180057
25;147;17062021180057
26;147;17062021180057
27;146;17062021180057
28;147;17062021180057
29;156;17062021180057
30;152;17062021180057
31;145;17062021180057
32;149;17062021180057
33;147;17062021180057
34;149;17062021180057
35;149;17062021180057
36;149;17062021180057
37;154;17062021180057
38;144;17062021180057
39;152;17062021180057
40;148;17062021180057
41;145;17062021180057
42;148;17062021180057
43;149;17062021180057
44;150;17062021180057
45;163;17062021180057
46;155;17062021180057
47;149;17062021180057
48;144;17062021180057
49;146;17062021180057
50;147;17062021180057
51;148;17062021180057
52;145;17062021180057
53;146;17062021180057
54;143;17062021180057
55;144;17062021180057
56;144;17062021180057
57;144;17062021180057
58;147;17062021180057
59;151;17062021180057
60;151;17062021180057
61;153;17062021180057
62;153;17062021180057
63;148;17062021180057
64;156;17062021180057
65;144;17062021180057
66;147;17062021180057
67;147;17062021180057
68;148;17062021180057
69;149;17062021180057
70;150;17062021180057
71;145;17062021180057
72;146;17062021180057
73;147;17062021180057
74;147;17062021180057
75;149;17062021180057
76;148;17062021180057
77;146;17062021180057
78;151;17062021180057
79;159;17062021180057
80;150;17062021180057
81;142;17062021180057
82;147;17062021180057
83;147;17062021180057
84;144;17062021180057
85;149;17062021180057
86;153;17062021180057
87;155;17062021180057
88;146;17062021180057
89;141;17062021180057
90;152;17062021180057
91;142;17062021180057
92;144;17062021180057
93;154;17062021180057
94;149;17062021180057
95;144;17062021180057
96;146;17062021180057
97;144;17062021180057
98;141;17062021180057
99;146;17062021180057
100;140;17062021180057
101;157;17062021180057
102;153;17062021180057
103;144;17062021180057
104;146;17062021180057
105;143;17062021180057
106;144;17062021180057
107;142;17062021180057
108;146;17062021180057
109;144;17062021180057
110;141;17062021180057
111;141;17062021180057
112;142;17062021180057
113;140;17062021180057
114;140;17062021180057
115;145;17062021180057
116;144;17062021180057
117;146;17062021180057
118;141;17062021180057
119;150;17062021180057
120;144;17062021180057
121;141;17062021180057
122;145;17062021180057
123;143;17062021180057
124;148;17062021180057
125;144;17062021180057
126;143;17062021180057
127;150;17062021180057
128;155;17062021180057
129;149;17062021180057
130;146;17062021180057
131;145;17062021180057
132;142;17062021180057
133;159;17062021180057
134;143;17062021180057
135;145;17062021180057
136;145;17062021180057
137;144;17062021180057
138;153;17062021180057
139;144;17062021180057
140;148;17062021180057
141;152;17062021180057
142;147;17062021180057
143;142;17062021180057
144;150;17062021180057
145;147;17062021180057
146;149;17062021180057
147;155;17062021180057
148;147;17062021180057
149;151;17062021180057
150;152;17062021180057
151;154;17062021180057
152;145;17062021180057
153;147;17062021180057
154;150;17062021180057
155;156;17062021180057
156;151;17062021180057
157;147;17062021180057
158;145;17062021180057
159;144;17062021180057
160;144;17062021180057
161;147;17062021180057
162;147;17062021180057
163;149;17062021180057
164;150;17062021180057
165;153;17062021180057
166;147;17062021180057
167;153;17062021180057
168;156;17062021180057
169;143;17062021180057
170;150;17062021180057
171;146;17062021180057
172;147;17062021180057
173;154;17062021180057
174;145;17062021180057
175;148;17062021180057
176;150;17062021180057
177;146;17062021180057
178;155;17062021180057
179;150;17062021180057
180;148;17062021180057
181;147;17062021180057
182;154;17062021180057
183;147;17062021180057
184;149;17062021180057
185;144;17062021180057
186;153;17062021180057
187;149;17062021180057
188;153;17062021180057
189;152;17062021180057
190;145;17062021180057
191;154;17062021180057
192;154;17062021180057
193;146;17062021180057
194;157;17062021180057
195;150;17062021180057
196;148;17062021180057
197;147;17062021180057
198;151;17062021180057
199;147;17062021180057
200;0;17062021180057
0;0;17062021180058
1;149;17062021180058
2;155;17062021180058
3;146;17062021180058
4;151;17062021180058
5;148;17062021180058
6;150;17062021180058
7;155;17062021180058
8;156;17062021180058
9;144;17062021180058
10;152;17062021180058
11;152;17062021180058
12;147;17062021180058
13;152;17062021180058
14;148;17062021180058
15;152;17062021180058
16;150;17062021180058
17;144;17062021180058
18;150;17062021180058
19;153;17062021180058
20;149;17062021180058
21;144;17062021180058
22;143;17062021180058
23;147;17062021180058
24;156;17062021180058
25;147;17062021180058
26;147;17062021180058
27;146;17062021180058
28;148;17062021180058
29;156;17062021180058
30;151;17062021180058
31;143;17062021180058
32;149;17062021180058
33;145;17062021180058
34;149;17062021180058
35;149;17062021180058
36;149;17062021180058
37;153;17062021180058
38;143;17062021180058
39;150;17062021180058
40;146;17062021180058
41;144;17062021180058
42;148;17062021180058
43;147;17062021180058
44;149;17062021180058
45;163;17062021180058
46;153;17062021180058
47;148;17062021180058
48;144;17062021180058
49;143;17062021180058
50;147;17062021180058
51;148;17062021180058
52;144;17062021180058
53;146;17062021180058
54;141;17062021180058
55;143;17062021180058
56;143;17062021180058
57;146;17062021180058
58;146;17062021180058
59;149;17062021180058
60;150;17062021180058
61;152;17062021180058
62;151;17062021180058
63;147;17062021180058
64;155;17062021180058
65;144;17062021180058
66;148;17062021180058
67;144;17062021180058
68;145;17062021180058
69;148;17062021180058
70;150;17062021180058
71;143;17062021180058
72;149;17062021180058
73;146;17062021180058
74;146;17062021180058
75;148;17062021180058
76;147;17062021180058
77;146;17062021180058
78;150;17062021180058
79;158;17062021180058
80;149;17062021180058
81;142;17062021180058
82;147;17062021180058
83;146;17062021180058
84;144;17062021180058
85;146;17062021180058
86;151;17062021180058
87;153;17062021180058
88;145;17062021180058
89;140;17062021180058
90;151;17062021180058
91;142;17062021180058
92;144;17062021180058
93;153;17062021180058
94;149;17062021180058
95;142;17062021180058
96;145;17062021180058
97;143;17062021180058
98;141;17062021180058
99;145;17062021180058
100;140;17062021180058
101;155;17062021180058
102;153;17062021180058
103;143;17062021180058
104;146;17062021180058
105;142;17062021180058
106;142;17062021180058
107;142;17062021180058
108;146;17062021180058
109;145;17062021180058
110;140;17062021180058
111;141;17062021180058
112;141;17062021180058
113;139;17062021180058
114;139;17062021180058
115;144;17062021180058
116;141;17062021180058
117;145;17062021180058
118;141;17062021180058
119;149;17062021180058
120;144;17062021180058
121;141;17062021180058
122;144;17062021180058
123;142;17062021180058
124;148;17062021180058
125;143;17062021180058
126;142;17062021180058
127;148;17062021180058
128;152;17062021180058
129;147;17062021180058
130;146;17062021180058
131;143;17062021180058
132;140;17062021180058
133;158;17062021180058
134;142;17062021180058
135;145;17062021180058
136;145;17062021180058
137;143;17062021180058
138;150;17062021180058
139;145;17062021180058
140;146;17062021180058
141;150;17062021180058
142;145;17062021180058
143;142;17062021180058
144;149;17062021180058
145;146;17062021180058
146;147;17062021180058
147;153;17062021180058
148;145;17062021180058
149;150;17062021180058
150;152;17062021180058
151;153;17062021180058
152;146;17062021180058
153;146;17062021180058
154;148;17062021180058
155;156;17062021180058
156;149;17062021180058
157;146;17062021180058
158;145;17062021180058
159;144;17062021180058
160;144;17062021180058
161;145;17062021180058
162;146;17062021180058
163;148;17062021180058
164;150;17062021180058
165;150;17062021180058
166;144;17062021180058
167;150;17062021180058
168;154;17062021180058
169;141;17062021180058
170;150;17062021180058
171;146;17062021180058
172;145;17062021180058
173;153;17062021180058
174;144;17062021180058
175;146;17062021180058
176;149;17062021180058
177;145;17062021180058
178;153;17062021180058
179;150;17062021180058
180;147;17062021180058
181;147;17062021180058
182;154;17062021180058
183;146;17062021180058
184;147;17062021180058
185;141;17062021180058
186;151;17062021180058
187;147;17062021180058
188;151;17062021180058
189;153;17062021180058
190;145;17062021180058
191;153;17062021180058
192;152;17062021180058
193;146;17062021180058
194;156;17062021180058
195;149;17062021180058
196;148;17062021180058
197;145;17062021180058
198;149;17062021180058
199;146;17062021180058
200;0;17062021180058
0;0;17062021180059
1;150;17062021180059
2;156;17062021180059
3;147;17062021180059
4;151;17062021180059
5;146;17062021180059
6;149;17062021180059
7;154;17062021180059
8;156;17062021180059
9;146;17062021180059
10;153;17062021180059
11;151;17062021180059
12;147;17062021180059
13;152;17062021180059
14;147;17062021180059
15;153;17062021180059
16;148;17062021180059
17;146;17062021180059
18;149;17062021180059
19;151;17062021180059
20;149;17062021180059
21;144;17062021180059
22;143;17062021180059
23;146;17062021180059
24;154;17062021180059
25;146;17062021180059
26;148;17062021180059
27;146;17062021180059
28;146;17062021180059
29;155;17062021180059
30;150;17062021180059
31;144;17062021180059
32;149;17062021180059
33;144;17062021180059
34;149;17062021180059
35;149;17062021180059
36;148;17062021180059
37;152;17062021180059
38;144;17062021180059
39;150;17062021180059
40;147;17062021180059
41;145;17062021180059
42;147;17062021180059
43;145;17062021180059
44;148;17062021180059
45;163;17062021180059
46;153;17062021180059
47;148;17062021180059
48;144;17062021180059
49;143;17062021180059
50;147;17062021180059
51;147;17062021180059
52;144;17062021180059
53;144;17062021180059
54;140;17062021180059
55;143;17062021180059
56;144;17062021180059
57;145;17062021180059
58;146;17062021180059
59;147;17062021180059
60;149;17062021180059
61;151;17062021180059
62;151;17062021180059
63;146;17062021180059
64;156;17062021180059
65;142;17062021180059
66;146;17062021180059
67;144;17062021180059
68;147;17062021180059
69;147;17062021180059
70;149;17062021180059
71;143;17062021180059
72;146;17062021180059
73;146;17062021180059
74;146;17062021180059
75;148;17062021180059
76;145;17062021180059
77;144;17062021180059
78;149;17062021180059
79;158;17062021180059
80;149;17062021180059
81;141;17062021180059
82;146;17062021180059
83;145;17062021180059
84;143;17062021180059
85;146;17062021180059
86;152;17062021180059
87;154;17062021180059
88;145;17062021180059
89;139;17062021180059
90;150;17062021180059
91;140;17062021180059
92;143;17062021180059
93;154;17062021180059
94;147;17062021180059
95;141;17062021180059
96;144;17062021180059
97;143;17062021180059
98;140;17062021180059
99;145;17062021180059
100;139;17062021180059
101;155;17062021180059
102;152;17062021180059
103;142;17062021180059
104;144;17062021180059
105;142;17062021180059
106;142;17062021180059
107;141;17062021180059
108;145;17062021180059
109;144;17062021180059
110;140;17062021180059
111;138;17062021180059
112;140;17062021180059
113;138;17062021180059
114;139;17062021180059
115;143;17062021180059
116;143;17062021180059
117;145;17062021180059
118;142;17062021180059
119;149;17062021180059
120;143;17062021180059
121;140;17062021180059
122;144;17062021180059
123;141;17062021180059
124;147;17062021180059
125;143;17062021180059
126;141;17062021180059
127;147;17062021180059
128;152;17062021180059
129;147;17062021180059
130;144;17062021180059
131;143;17062021180059
132;139;17062021180059
133;158;17062021180059
134;143;17062021180059
135;145;17062021180059
136;144;17062021180059
137;143;17062021180059
138;150;17062021180059
139;143;17062021180059
140;147;17062021180059
141;150;17062021180059
142;146;17062021180059
143;140;17062021180059
144;149;17062021180059
145;146;17062021180059
146;146;17062021180059
147;153;17062021180059
148;145;17062021180059
149;150;17062021180059
150;154;17062021180059
151;153;17062021180059
152;144;17062021180059
153;147;17062021180059
154;148;17062021180059
155;154;17062021180059
156;149;17062021180059
157;146;17062021180059
158;145;17062021180059
159;144;17062021180059
160;142;17062021180059
161;146;17062021180059
162;146;17062021180059
163;148;17062021180059
164;150;17062021180059
165;150;17062021180059
166;144;17062021180059
167;150;17062021180059
168;152;17062021180059
169;142;17062021180059
170;149;17062021180059
171;145;17062021180059
172;145;17062021180059
173;153;17062021180059
174;144;17062021180059
175;144;17062021180059
176;147;17062021180059
177;145;17062021180059
178;153;17062021180059
179;149;17062021180059
180;146;17062021180059
181;145;17062021180059
182;152;17062021180059
183;145;17062021180059
184;147;17062021180059
185;140;17062021180059
186;151;17062021180059
187;146;17062021180059
188;147;17062021180059
189;151;17062021180059
190;144;17062021180059
191;153;17062021180059
192;152;17062021180059
193;145;17062021180059
194;157;17062021180059
195;149;17062021180059
196;146;17062021180059
197;145;17062021180059
198;148;17062021180059
199;144;17062021180059
200;0;17062021180059
0;0;17062021180100
1;150;17062021180100
2;156;17062021180100
3;145;17062021180100
4;151;17062021180100
5;146;17062021180100
6;149;17062021180100
7;154;17062021180100
8;155;17062021180100
9;145;17062021180100
10;151;17062021180100
11;152;17062021180100
12;147;17062021180100
13;152;17062021180100
14;149;17062021180100
15;151;17062021180100
16;148;17062021180100
17;145;17062021180100
18;150;17062021180100
19;151;17062021180100
20;149;17062021180100
21;145;17062021180100
22;143;17062021180100
23;147;17062021180100
24;153;17062021180100
25;145;17062021180100
26;148;17062021180100
27;146;17062021180100
28;147;17062021180100
29;155;17062021180100
30;150;17062021180100
31;142;17062021180100
32;150;17062021180100
33;146;17062021180100
34;149;17062021180100
35;149;17062021180100
36;146;17062021180100
37;153;17062021180100
38;143;17062021180100
39;150;17062021180100
40;146;17062021180100
41;142;17062021180100
42;146;17062021180100
43;146;17062021180100
44;149;17062021180100
45;162;17062021180100
46;153;17062021180100
47;148;17062021180100
48;142;17062021180100
49;144;17062021180100
50;146;17062021180100
51;148;17062021180100
52;144;17062021180100
53;146;17062021180100
54;141;17062021180100
55;144;17062021180100
56;143;17062021180100
57;145;17062021180100
58;146;17062021180100
59;150;17062021180100
60;151;17062021180100
61;152;17062021180100
62;150;17062021180100
63;146;17062021180100
64;155;17062021180100
65;143;17062021180100
66;147;17062021180100
67;145;17062021180100
68;147;17062021180100
69;147;17062021180100
70;149;17062021180100
71;144;17062021180100
72;147;17062021180100
73;145;17062021180100
74;147;17062021180100
75;149;17062021180100
76;145;17062021180100
77;146;17062021180100
78;149;17062021180100
79;158;17062021180100
80;147;17062021180100
81;142;17062021180100
82;146;17062021180100
83;144;17062021180100
84;143;17062021180100
85;145;17062021180100
86;152;17062021180100
87;153;17062021180100
88;145;17062021180100
89;138;17062021180100
90;148;17062021180100
91;140;17062021180100
92;143;17062021180100
93;153;17062021180100
94;147;17062021180100
95;142;17062021180100
96;144;17062021180100
97;145;17062021180100
98;141;17062021180100
99;144;17062021180100
100;139;17062021180100
101;154;17062021180100
102;153;17062021180100
103;142;17062021180100
104;145;17062021180100
105;142;17062021180100
106;143;17062021180100
107;142;17062021180100
108;145;17062021180100
109;144;17062021180100
110;140;17062021180100
111;138;17062021180100
112;141;17062021180100
113;140;17062021180100
114;139;17062021180100
115;142;17062021180100
116;142;17062021180100
117;144;17062021180100
118;142;17062021180100
119;147;17062021180100
120;144;17062021180100
121;140;17062021180100
122;144;17062021180100
123;141;17062021180100
124;149;17062021180100
125;142;17062021180100
126;140;17062021180100
127;148;17062021180100
128;151;17062021180100
129;145;17062021180100
130;144;17062021180100
131;143;17062021180100
132;141;17062021180100
133;157;17062021180100
134;143;17062021180100
135;144;17062021180100
136;145;17062021180100
137;143;17062021180100
138;150;17062021180100
139;143;17062021180100
140;146;17062021180100
141;149;17062021180100
142;148;17062021180100
143;141;17062021180100
144;148;17062021180100
145;146;17062021180100
146;146;17062021180100
147;153;17062021180100
148;145;17062021180100
149;149;17062021180100
150;153;17062021180100
151;150;17062021180100
152;145;17062021180100
153;147;17062021180100
154;148;17062021180100
155;154;17062021180100
156;148;17062021180100
157;145;17062021180100
158;145;17062021180100
159;143;17062021180100
160;144;17062021180100
161;145;17062021180100
162;147;17062021180100
163;148;17062021180100
164;150;17062021180100
165;150;17062021180100
166;144;17062021180100
167;150;17062021180100
168;154;17062021180100
169;142;17062021180100
170;150;17062021180100
171;145;17062021180100
172;145;17062021180100
173;153;17062021180100
174;145;17062021180100
175;146;17062021180100
176;148;17062021180100
177;142;17062021180100
178;153;17062021180100
179;150;17062021180100
180;148;17062021180100
181;146;17062021180100
182;153;17062021180100
183;146;17062021180100
184;147;17062021180100
185;142;17062021180100
186;150;17062021180100
187;147;17062021180100
188;149;17062021180100
189;151;17062021180100
190;144;17062021180100
191;153;17062021180100
192;152;17062021180100
193;144;17062021180100
194;155;17062021180100
195;148;17062021180100
196;148;17062021180100
197;147;17062021180100
198;150;17062021180100
199;145;17062021180100
200;0;17062021180100
0;0;17062021180100
1;149;17062021180100
2;155;17062021180100
3;145;17062021180100
4;151;17062021180100
5;147;17062021180100
6;150;17062021180100
7;155;17062021180100
8;155;17062021180100
9;145;17062021180100
10;152;17062021180100
11;152;17062021180100
12;148;17062021180100
13;153;17062021180100
14;148;17062021180100
15;151;17062021180100
16;149;17062021180100
17;145;17062021180100
18;150;17062021180100
19;152;17062021180100
20;149;17062021180100
21;145;17062021180100
22;144;17062021180100
23;148;17062021180100
24;155;17062021180100
25;147;17062021180100
26;148;17062021180100
27;147;17062021180100
28;146;17062021180100
29;156;17062021180100
30;150;17062021180100
31;144;17062021180100
32;150;17062021180100
33;144;17062021180100
34;148;17062021180100
35;148;17062021180100
36;148;17062021180100
37;153;17062021180100
38;143;17062021180100
39;150;17062021180100
40;148;17062021180100
41;142;17062021180100
42;147;17062021180100
43;146;17062021180100
44;150;17062021180100
45;164;17062021180100
46;154;17062021180100
47;148;17062021180100
48;143;17062021180100
49;144;17062021180100
50;148;17062021180100
51;147;17062021180100
52;145;17062021180100
53;146;17062021180100
54;142;17062021180100
55;144;17062021180100
56;145;17062021180100
57;146;17062021180100
58;148;17062021180100
59;149;17062021180100
60;150;17062021180100
61;151;17062021180100
62;151;17062021180100
63;147;17062021180100
64;156;17062021180100
65;143;17062021180100
66;147;17062021180100
67;145;17062021180100
68;147;17062021180100
69;147;17062021180100
70;150;17062021180100
71;142;17062021180100
72;146;17062021180100
73;147;17062021180100
74;146;17062021180100
75;150;17062021180100
76;146;17062021180100
77;145;17062021180100
78;148;17062021180100
79;158;17062021180100
80;150;17062021180100
81;142;17062021180100
82;145;17062021180100
83;144;17062021180100
84;143;17062021180100
85;147;17062021180100
86;153;17062021180100
87;153;17062021180100
88;144;17062021180100
89;138;17062021180100
90;150;17062021180100
91;142;17062021180100
92;141;17062021180100
93;154;17062021180100
94;147;17062021180100
95;143;17062021180100
96;146;17062021180100
97;144;17062021180100
98;142;17062021180100
99;146;17062021180100
100;138;17062021180100
101;157;17062021180100
102;154;17062021180100
103;143;17062021180100
104;145;17062021180100
105;143;17062021180100
106;143;17062021180100
107;142;17062021180100
108;146;17062021180100
109;145;17062021180100
110;141;17062021180100
111;140;17062021180100
112;141;17062021180100
113;140;17062021180100
114;140;17062021180100
115;143;17062021180100
116;143;17062021180100
117;145;17062021180100
118;141;17062021180100
119;148;17062021180100
120;142;17062021180100
121;140;17062021180100
122;143;17062021180100
123;141;17062021180100
124;147;17062021180100
125;142;17062021180100
126;141;17062021180100
127;148;17062021180100
128;152;17062021180100
129;145;17062021180100
130;144;17062021180100
131;144;17062021180100
132;140;17062021180100
133;157;17062021180100
134;143;17062021180100
135;144;17062021180100
136;144;17062021180100
137;143;17062021180100
138;151;17062021180100
139;144;17062021180100
140;146;17062021180100
141;149;17062021180100
142;146;17062021180100
143;143;17062021180100
144;150;17062021180100
145;146;17062021180100
146;147;17062021180100
147;152;17062021180100
148;146;17062021180100
149;148;17062021180100
150;151;17062021180100
151;152;17062021180100
152;144;17062021180100
153;146;17062021180100
154;148;17062021180100
155;154;17062021180100
156;150;17062021180100
157;146;17062021180100
158;145;17062021180100
159;144;17062021180100
160;144;17062021180100
161;146;17062021180100
162;147;17062021180100
163;150;17062021180100
164;152;17062021180100
165;151;17062021180100
166;146;17062021180100
167;150;17062021180100
168;153;17062021180100
169;142;17062021180100
170;149;17062021180100
171;145;17062021180100
172;145;17062021180100
173;154;17062021180100
174;144;17062021180100
175;146;17062021180100
176;148;17062021180100
177;145;17062021180100
178;154;17062021180100
179;147;17062021180100
180;146;17062021180100
181;146;17062021180100
182;156;17062021180100
183;146;17062021180100
184;149;17062021180100
185;143;17062021180100
186;152;17062021180100
187;147;17062021180100
188;148;17062021180100
189;151;17062021180100
190;144;17062021180100
191;153;17062021180100
192;153;17062021180100
193;147;17062021180100
194;155;17062021180100
195;149;17062021180100
196;148;17062021180100
197;146;17062021180100
198;149;17062021180100
199;145;17062021180100
200;0;17062021180100
0;0;17062021180101
1;149;17062021180101
2;154;17062021180101
3;145;17062021180101
4;149;17062021180101
5;147;17062021180101
6;149;17062021180101
7;154;17062021180101
8;153;17062021180101
9;144;17062021180101
10;151;17062021180101
11;151;17062021180101
12;147;17062021180101
13;151;17062021180101
14;146;17062021180101
15;150;17062021180101
16;148;17062021180101
17;146;17062021180101
18;149;17062021180101
19;151;17062021180101
20;149;17062021180101
21;144;17062021180101
22;140;17062021180101
23;147;17062021180101
24;154;17062021180101
25;145;17062021180101
26;147;17062021180101
27;145;17062021180101
28;146;17062021180101
29;154;17062021180101
30;150;17062021180101
31;144;17062021180101
32;148;17062021180101
33;144;17062021180101
34;149;17062021180101
35;147;17062021180101
36;147;17062021180101
37;151;17062021180101
38;143;17062021180101
39;149;17062021180101
40;146;17062021180101
41;143;17062021180101
42;144;17062021180101
43;145;17062021180101
44;149;17062021180101
45;161;17062021180101
46;155;17062021180101
47;147;17062021180101
48;142;17062021180101
49;142;17062021180101
50;146;17062021180101
51;146;17062021180101
52;143;17062021180101
53;144;17062021180101
54;141;17062021180101
55;143;17062021180101
56;144;17062021180101
57;142;17062021180101
58;146;17062021180101
59;148;17062021180101
60;149;17062021180101
61;151;17062021180101
62;151;17062021180101
63;145;17062021180101
64;155;17062021180101
65;142;17062021180101
66;145;17062021180101
67;144;17062021180101
68;144;17062021180101
69;146;17062021180101
70;148;17062021180101
71;142;17062021180101
72;144;17062021180101
73;145;17062021180101
74;145;17062021180101
75;147;17062021180101
76;145;17062021180101
77;145;17062021180101
78;148;17062021180101
79;157;17062021180101
80;149;17062021180101
81;142;17062021180101
82;145;17062021180101
83;144;17062021180101
84;143;17062021180101
85;145;17062021180101
86;151;17062021180101
87;152;17062021180101
88;144;17062021180101
89;137;17062021180101
90;148;17062021180101
91;141;17062021180101
92;142;17062021180101
93;152;17062021180101
94;146;17062021180101
95;141;17062021180101
96;145;17062021180101
97;143;17062021180101
98;139;17062021180101
99;144;17062021180101
100;137;17062021180101
101;155;17062021180101
102;151;17062021180101
103;141;17062021180101
104;145;17062021180101
105;141;17062021180101
106;142;17062021180101
107;141;17062021180101
108;145;17062021180101
109;143;17062021180101
110;140;17062021180101
111;138;17062021180101
112;140;17062021180101
113;138;17062021180101
114;138;17062021180101
115;142;17062021180101
116;142;17062021180101
117;144;17062021180101
118;141;17062021180101
119;145;17062021180101
120;142;17062021180101
121;140;17062021180101
122;143;17062021180101
123;140;17062021180101
124;146;17062021180101
125;143;17062021180101
126;141;17062021180101
127;147;17062021180101
128;152;17062021180101
129;146;17062021180101
130;144;17062021180101
131;142;17062021180101
132;140;17062021180101
133;156;17062021180101
134;141;17062021180101
135;144;17062021180101
136;143;17062021180101
137;142;17062021180101
138;151;17062021180101
139;141;17062021180101
140;147;17062021180101
141;149;17062021180101
142;145;17062021180101
143;142;17062021180101
144;148;17062021180101
145;145;17062021180101
146;146;17062021180101
147;152;17062021180101
148;143;17062021180101
149;150;17062021180101
150;151;17062021180101
151;150;17062021180101
152;145;17062021180101
153;145;17062021180101
154;147;17062021180101
155;155;17062021180101
156;148;17062021180101
157;145;17062021180101
158;144;17062021180101
159;144;17062021180101
160;143;17062021180101
161;145;17062021180101
162;145;17062021180101
163;147;17062021180101
164;149;17062021180101
165;150;17062021180101
166;144;17062021180101
167;150;17062021180101
168;152;17062021180101
169;142;17062021180101
170;148;17062021180101
171;144;17062021180101
172;144;17062021180101
173;152;17062021180101
174;143;17062021180101
175;145;17062021180101
176;148;17062021180101
177;144;17062021180101
178;152;17062021180101
179;149;17062021180101
180;145;17062021180101
181;144;17062021180101
182;154;17062021180101
183;146;17062021180101
184;147;17062021180101
185;141;17062021180101
186;150;17062021180101
187;146;17062021180101
188;148;17062021180101
189;150;17062021180101
190;144;17062021180101
191;152;17062021180101
192;152;17062021180101
193;144;17062021180101
194;154;17062021180101
195;148;17062021180101
196;147;17062021180101
197;146;17062021180101
198;149;17062021180101
199;145;17062021180101
200;0;17062021180101
0;0;17062021180102
1;148;17062021180102
2;154;17062021180102
3;145;17062021180102
4;148;17062021180102
5;147;17062021180102
6;148;17062021180102
7;153;17062021180102
8;154;17062021180102
9;146;17062021180102
10;151;17062021180102
11;151;17062021180102
12;146;17062021180102
13;151;17062021180102
14;147;17062021180102
15;150;17062021180102
16;148;17062021180102
17;143;17062021180102
18;150;17062021180102
19;150;17062021180102
20;147;17062021180102
21;144;17062021180102
22;142;17062021180102
23;144;17062021180102
24;152;17062021180102
25;144;17062021180102
26;147;17062021180102
27;144;17062021180102
28;145;17062021180102
29;154;17062021180102
30;149;17062021180102
31;143;17062021180102
32;147;17062021180102
33;144;17062021180102
34;147;17062021180102
35;147;17062021180102
36;145;17062021180102
37;152;17062021180102
38;142;17062021180102
39;149;17062021180102
40;147;17062021180102
41;143;17062021180102
42;145;17062021180102
43;145;17062021180102
44;147;17062021180102
45;160;17062021180102
46;153;17062021180102
47;147;17062021180102
48;141;17062021180102
49;143;17062021180102
50;146;17062021180102
51;146;17062021180102
52;145;17062021180102
53;145;17062021180102
54;140;17062021180102
55;142;17062021180102
56;142;17062021180102
57;143;17062021180102
58;146;17062021180102
59;147;17062021180102
60;149;17062021180102
61;149;17062021180102
62;150;17062021180102
63;146;17062021180102
64;154;17062021180102
65;142;17062021180102
66;145;17062021180102
67;144;17062021180102
68;144;17062021180102
69;146;17062021180102
70;148;17062021180102
71;142;17062021180102
72;144;17062021180102
73;145;17062021180102
74;145;17062021180102
75;146;17062021180102
76;145;17062021180102
77;147;17062021180102
78;147;17062021180102
79;158;17062021180102
80;148;17062021180102
81;140;17062021180102
82;145;17062021180102
83;145;17062021180102
84;143;17062021180102
85;144;17062021180102
86;151;17062021180102
87;153;17062021180102
88;144;17062021180102
89;139;17062021180102
90;148;17062021180102
91;139;17062021180102
92;142;17062021180102
93;153;17062021180102
94;147;17062021180102
95;142;17062021180102
96;144;17062021180102
97;142;17062021180102
98;139;17062021180102
99;143;17062021180102
100;137;17062021180102
101;154;17062021180102
102;152;17062021180102
103;141;17062021180102
104;143;17062021180102
105;141;17062021180102
106;142;17062021180102
107;141;17062021180102
108;145;17062021180102
109;142;17062021180102
110;139;17062021180102
111;138;17062021180102
112;140;17062021180102
113;138;17062021180102
114;138;17062021180102
115;143;17062021180102
116;142;17062021180102
117;144;17062021180102
118;140;17062021180102
119;147;17062021180102
120;142;17062021180102
121;140;17062021180102
122;142;17062021180102
123;140;17062021180102
124;148;17062021180102
125;142;17062021180102
126;140;17062021180102
127;147;17062021180102
128;151;17062021180102
129;147;17062021180102
130;143;17062021180102
131;143;17062021180102
132;139;17062021180102
133;157;17062021180102
134;141;17062021180102
135;145;17062021180102
136;143;17062021180102
137;141;17062021180102
138;150;17062021180102
139;143;17062021180102
140;145;17062021180102
141;149;17062021180102
142;146;17062021180102
143;141;17062021180102
144;149;17062021180102
145;146;17062021180102
146;145;17062021180102
147;151;17062021180102
148;145;17062021180102
149;149;17062021180102
150;151;17062021180102
151;150;17062021180102
152;144;17062021180102
153;144;17062021180102
154;147;17062021180102
155;154;17062021180102
156;147;17062021180102
157;144;17062021180102
158;144;17062021180102
159;143;17062021180102
160;142;17062021180102
161;145;17062021180102
162;145;17062021180102
163;149;17062021180102
164;148;17062021180102
165;149;17062021180102
166;143;17062021180102
167;151;17062021180102
168;153;17062021180102
169;141;17062021180102
170;148;17062021180102
171;143;17062021180102
172;144;17062021180102
173;152;17062021180102
174;144;17062021180102
175;145;17062021180102
176;147;17062021180102
177;143;17062021180102
178;153;17062021180102
179;148;17062021180102
180;146;17062021180102
181;144;17062021180102
182;153;17062021180102
183;144;17062021180102
184;146;17062021180102
185;140;17062021180102
186;150;17062021180102
187;146;17062021180102
188;148;17062021180102
189;149;17062021180102
190;144;17062021180102
191;152;17062021180102
192;151;17062021180102
193;145;17062021180102
194;154;17062021180102
195;147;17062021180102
196;146;17062021180102
197;145;17062021180102
198;148;17062021180102
199;145;17062021180102
200;0;17062021180102
0;0;17062021180103
1;154;17062021180103
2;159;17062021180103
3;149;17062021180103
4;153;17062021180103
5;149;17062021180103
6;152;17062021180103
7;155;17062021180103
8;156;17062021180103
9;146;17062021180103
10;154;17062021180103
11;153;17062021180103
12;150;17062021180103
13;154;17062021180103
14;150;17062021180103
15;153;17062021180103
16;149;17062021180103
17;145;17062021180103
18;150;17062021180103
19;153;17062021180103
20;148;17062021180103
21;145;17062021180103
22;143;17062021180103
23;148;17062021180103
24;155;17062021180103
25;147;17062021180103
26;146;17062021180103
27;146;17062021180103
28;146;17062021180103
29;156;17062021180103
30;151;17062021180103
31;142;17062021180103
32;150;17062021180103
33;145;17062021180103
34;150;17062021180103
35;149;17062021180103
36;149;17062021180103
37;154;17062021180103
38;143;17062021180103
39;150;17062021180103
40;148;17062021180103
41;144;17062021180103
42;147;17062021180103
43;147;17062021180103
44;150;17062021180103
45;165;17062021180103
46;156;17062021180103
47;148;17062021180103
48;143;17062021180103
49;144;17062021180103
50;146;17062021180103
51;147;17062021180103
52;145;17062021180103
53;146;17062021180103
54;143;17062021180103
55;145;17062021180103
56;144;17062021180103
57;144;17062021180103
58;149;17062021180103
59;150;17062021180103
60;151;17062021180103
61;152;17062021180103
62;152;17062021180103
63;148;17062021180103
64;156;17062021180103
65;143;17062021180103
66;146;17062021180103
67;145;17062021180103
68;147;17062021180103
69;149;17062021180103
70;151;17062021180103
71;142;17062021180103
72;148;17062021180103
73;149;17062021180103
74;147;17062021180103
75;149;17062021180103
76;147;17062021180103
77;146;17062021180103
78;150;17062021180103
79;159;17062021180103
80;152;17062021180103
81;143;17062021180103
82;147;17062021180103
83;145;17062021180103
84;144;17062021180103
85;146;17062021180103
86;154;17062021180103
87;155;17062021180103
88;146;17062021180103
89;140;17062021180103
90;151;17062021180103
91;142;17062021180103
92;145;17062021180103
93;155;17062021180103
94;148;17062021180103
95;143;17062021180103
96;145;17062021180103
97;144;17062021180103
98;141;17062021180103
99;145;17062021180103
100;140;17062021180103
101;155;17062021180103
102;152;17062021180103
103;143;17062021180103
104;145;17062021180103
105;142;17062021180103
106;143;17062021180103
107;142;17062021180103
108;145;17062021180103
109;144;17062021180103
110;141;17062021180103
111;140;17062021180103
112;142;17062021180103
113;139;17062021180103
114;140;17062021180103
115;142;17062021180103
116;143;17062021180103
117;145;17062021180103
118;143;17062021180103
119;149;17062021180103
120;144;17062021180103
121;141;17062021180103
122;144;17062021180103
123;142;17062021180103
124;149;17062021180103
125;143;17062021180103
126;141;17062021180103
127;148;17062021180103
128;153;17062021180103
129;148;17062021180103
130;145;17062021180103
131;144;17062021180103
132;141;17062021180103
133;158;17062021180103
134;142;17062021180103
135;145;17062021180103
136;145;17062021180103
137;144;17062021180103
138;152;17062021180103
139;145;17062021180103
140;148;17062021180103
141;151;17062021180103
142;147;17062021180103
143;144;17062021180103
144;151;17062021180103
145;146;17062021180103
146;146;17062021180103
147;154;17062021180103
148;147;17062021180103
149;150;17062021180103
150;152;17062021180103
151;151;17062021180103
152;145;17062021180103
153;145;17062021180103
154;148;17062021180103
155;155;17062021180103
156;150;17062021180103
157;146;17062021180103
158;145;17062021180103
159;143;17062021180103
160;142;17062021180103
161;145;17062021180103
162;147;17062021180103
163;150;17062021180103
164;151;17062021180103
165;151;17062021180103
166;146;17062021180103
167;150;17062021180103
168;154;17062021180103
169;142;17062021180103
170;150;17062021180103
171;144;17062021180103
172;144;17062021180103
173;153;17062021180103
174;144;17062021180103
175;147;17062021180103
176;149;17062021180103
177;145;17062021180103
178;155;17062021180103
179;152;17062021180103
180;149;17062021180103
181;147;17062021180103
182;156;17062021180103
183;147;17062021180103
184;149;17062021180103
185;144;17062021180103
186;152;17062021180103
187;148;17062021180103
188;151;17062021180103
189;153;17062021180103
190;145;17062021180103
191;154;17062021180103
192;153;17062021180103
193;144;17062021180103
194;156;17062021180103
195;149;17062021180103
196;147;17062021180103
197;146;17062021180103
198;150;17062021180103
199;147;17062021180103
200;0;17062021180103
0;0;17062021180104
1;148;17062021180104
2;154;17062021180104
3;144;17062021180104
4;149;17062021180104
5;144;17062021180104
6;149;17062021180104
7;153;17062021180104
8;154;17062021180104
9;143;17062021180104
10;150;17062021180104
11;151;17062021180104
12;145;17062021180104
13;151;17062021180104
14;147;17062021180104
15;151;17062021180104
16;147;17062021180104
17;143;17062021180104
18;147;17062021180104
19;151;17062021180104
20;145;17062021180104
21;143;17062021180104
22;140;17062021180104
23;146;17062021180104
24;153;17062021180104
25;145;17062021180104
26;145;17062021180104
27;145;17062021180104
28;145;17062021180104
29;153;17062021180104
30;149;17062021180104
31;142;17062021180104
32;148;17062021180104
33;143;17062021180104
34;147;17062021180104
35;147;17062021180104
36;145;17062021180104
37;150;17062021180104
38;142;17062021180104
39;148;17062021180104
40;145;17062021180104
41;140;17062021180104
42;145;17062021180104
43;145;17062021180104
44;148;17062021180104
45;161;17062021180104
46;152;17062021180104
47;147;17062021180104
48;142;17062021180104
49;142;17062021180104
50;144;17062021180104
51;145;17062021180104
52;144;17062021180104
53;145;17062021180104
54;140;17062021180104
55;143;17062021180104
56;142;17062021180104
57;144;17062021180104
58;145;17062021180104
59;147;17062021180104
60;148;17062021180104
61;148;17062021180104
62;150;17062021180104
63;146;17062021180104
64;154;17062021180104
65;143;17062021180104
66;144;17062021180104
67;145;17062021180104
68;145;17062021180104
69;144;17062021180104
70;147;17062021180104
71;142;17062021180104
72;144;17062021180104
73;146;17062021180104
74;145;17062021180104
75;147;17062021180104
76;144;17062021180104
77;144;17062021180104
78;147;17062021180104
79;157;17062021180104
80;148;17062021180104
81;140;17062021180104
82;144;17062021180104
83;144;17062021180104
84;143;17062021180104
85;144;17062021180104
86;151;17062021180104
87;151;17062021180104
88;144;17062021180104
89;137;17062021180104
90;147;17062021180104
91;139;17062021180104
92;141;17062021180104
93;152;17062021180104
94;146;17062021180104
95;141;17062021180104
96;143;17062021180104
97;141;17062021180104
98;138;17062021180104
99;142;17062021180104
100;136;17062021180104
101;152;17062021180104
102;152;17062021180104
103;141;17062021180104
104;144;17062021180104
105;139;17062021180104
106;141;17062021180104
107;139;17062021180104
108;144;17062021180104
109;142;17062021180104
110;138;17062021180104
111;138;17062021180104
112;140;17062021180104
113;138;17062021180104
114;138;17062021180104
115;142;17062021180104
116;140;17062021180104
117;143;17062021180104
118;140;17062021180104
119;146;17062021180104
120;142;17062021180104
121;140;17062021180104
122;142;17062021180104
123;140;17062021180104
124;145;17062021180104
125;140;17062021180104
126;138;17062021180104
127;144;17062021180104
128;151;17062021180104
129;144;17062021180104
130;143;17062021180104
131;142;17062021180104
132;139;17062021180104
133;157;17062021180104
134;141;17062021180104
135;142;17062021180104
136;144;17062021180104
137;143;17062021180104
138;149;17062021180104
139;142;17062021180104
140;146;17062021180104
141;147;17062021180104
142;144;17062021180104
143;140;17062021180104
144;148;17062021180104
145;144;17062021180104
146;146;17062021180104
147;152;17062021180104
148;144;17062021180104
149;149;17062021180104
150;151;17062021180104
151;151;17062021180104
152;143;17062021180104
153;145;17062021180104
154;147;17062021180104
155;153;17062021180104
156;148;17062021180104
157;144;17062021180104
158;143;17062021180104
159;142;17062021180104
160;143;17062021180104
161;144;17062021180104
162;143;17062021180104
163;147;17062021180104
164;149;17062021180104
165;148;17062021180104
166;144;17062021180104
167;148;17062021180104
168;150;17062021180104
169;140;17062021180104
170;148;17062021180104
171;142;17062021180104
172;142;17062021180104
173;151;17062021180104
174;143;17062021180104
175;144;17062021180104
176;147;17062021180104
177;143;17062021180104
178;153;17062021180104
179;147;17062021180104
180;145;17062021180104
181;144;17062021180104
182;151;17062021180104
183;146;17062021180104
184;147;17062021180104
185;140;17062021180104
186;149;17062021180104
187;146;17062021180104
188;147;17062021180104
189;148;17062021180104
190;142;17062021180104
191;152;17062021180104
192;150;17062021180104
193;143;17062021180104
194;154;17062021180104
195;147;17062021180104
196;146;17062021180104
197;145;17062021180104
198;148;17062021180104
199;145;17062021180104
200;0;17062021180104
