ind;val;datetime
0;0;29062021164132
1;143;29062021164132
2;168;29062021164132
3;164;29062021164132
4;169;29062021164132
5;172;29062021164132
6;171;29062021164132
7;179;29062021164132
8;185;29062021164132
9;185;29062021164132
10;196;29062021164132
11;200;29062021164132
12;209;29062021164132
13;224;29062021164132
14;241;29062021164132
15;270;29062021164132
16;314;29062021164132
17;401;29062021164132
18;573;29062021164132
19;905;29062021164132
20;1023;29062021164132
21;1023;29062021164132
22;1023;29062021164132
23;1023;29062021164132
24;979;29062021164132
25;929;29062021164132
26;901;29062021164132
27;905;29062021164132
28;930;29062021164132
29;966;29062021164132
30;1023;29062021164132
31;1023;29062021164132
32;1023;29062021164132
33;1023;29062021164132
34;1023;29062021164132
35;1023;29062021164132
36;1023;29062021164132
37;1023;29062021164132
38;1023;29062021164132
39;1023;29062021164132
40;1023;29062021164132
41;1023;29062021164132
42;1002;29062021164132
43;953;29062021164132
44;918;29062021164132
45;893;29062021164132
46;876;29062021164132
47;869;29062021164132
48;868;29062021164132
49;869;29062021164132
50;860;29062021164132
51;877;29062021164132
52;873;29062021164132
53;893;29062021164132
54;913;29062021164132
55;926;29062021164132
56;943;29062021164132
57;959;29062021164132
58;984;29062021164132
59;994;29062021164132
60;1012;29062021164132
61;1021;29062021164132
62;1021;29062021164132
63;1023;29062021164132
64;1023;29062021164132
65;1023;29062021164132
66;1023;29062021164132
67;1023;29062021164132
68;1023;29062021164132
69;1021;29062021164132
70;1013;29062021164132
71;1005;29062021164132
72;995;29062021164132
73;965;29062021164132
74;949;29062021164132
75;910;29062021164132
76;885;29062021164132
77;863;29062021164132
78;832;29062021164132
79;800;29062021164132
80;767;29062021164132
81;737;29062021164132
82;712;29062021164132
83;690;29062021164132
84;671;29062021164132
85;655;29062021164132
86;648;29062021164132
87;638;29062021164132
88;625;29062021164132
89;608;29062021164132
90;594;29062021164132
91;579;29062021164132
92;554;29062021164132
93;538;29062021164132
94;516;29062021164132
95;497;29062021164132
96;480;29062021164132
97;462;29062021164132
98;448;29062021164132
99;433;29062021164132
100;420;29062021164132
101;414;29062021164132
102;401;29062021164132
103;386;29062021164132
104;378;29062021164132
105;366;29062021164132
106;355;29062021164132
107;343;29062021164132
108;337;29062021164132
109;328;29062021164132
110;315;29062021164132
111;309;29062021164132
112;301;29062021164132
113;292;29062021164132
114;287;29062021164132
115;283;29062021164132
116;277;29062021164132
117;273;29062021164132
118;262;29062021164132
119;260;29062021164132
120;253;29062021164132
121;248;29062021164132
122;244;29062021164132
123;240;29062021164132
124;232;29062021164132
125;229;29062021164132
126;222;29062021164132
127;218;29062021164132
128;217;29062021164132
129;209;29062021164132
130;207;29062021164132
131;203;29062021164132
132;197;29062021164132
133;199;29062021164132
134;191;29062021164132
135;187;29062021164132
136;186;29062021164132
137;181;29062021164132
138;181;29062021164132
139;176;29062021164132
140;174;29062021164132
141;175;29062021164132
142;170;29062021164132
143;164;29062021164132
144;166;29062021164132
145;161;29062021164132
146;163;29062021164132
147;162;29062021164132
148;157;29062021164132
149;157;29062021164132
150;156;29062021164132
151;154;29062021164132
152;152;29062021164132
153;149;29062021164132
154;150;29062021164132
155;149;29062021164132
156;147;29062021164132
157;146;29062021164132
158;143;29062021164132
159;144;29062021164132
160;144;29062021164132
161;143;29062021164132
162;143;29062021164132
163;142;29062021164132
164;141;29062021164132
165;143;29062021164132
166;138;29062021164132
167;138;29062021164132
168;141;29062021164132
169;135;29062021164132
170;138;29062021164132
171;137;29062021164132
172;133;29062021164132
173;136;29062021164132
174;133;29062021164132
175;133;29062021164132
176;134;29062021164132
177;131;29062021164132
178;135;29062021164132
179;133;29062021164132
180;131;29062021164132
181;132;29062021164132
182;133;29062021164132
183;130;29062021164132
184;131;29062021164132
185;127;29062021164132
186;131;29062021164132
187;131;29062021164132
188;129;29062021164132
189;131;29062021164132
190;128;29062021164132
191;130;29062021164132
192;133;29062021164132
193;127;29062021164132
194;130;29062021164132
195;129;29062021164132
196;128;29062021164132
197;129;29062021164132
198;129;29062021164132
199;127;29062021164132
200;0;29062021164132
0;0;29062021164133
1;143;29062021164133
2;168;29062021164133
3;167;29062021164133
4;169;29062021164133
5;170;29062021164133
6;174;29062021164133
7;177;29062021164133
8;183;29062021164133
9;185;29062021164133
10;195;29062021164133
11;200;29062021164133
12;208;29062021164133
13;224;29062021164133
14;239;29062021164133
15;269;29062021164133
16;313;29062021164133
17;398;29062021164133
18;575;29062021164133
19;905;29062021164133
20;1023;29062021164133
21;1023;29062021164133
22;1023;29062021164133
23;1023;29062021164133
24;981;29062021164133
25;930;29062021164133
26;901;29062021164133
27;905;29062021164133
28;928;29062021164133
29;965;29062021164133
30;1023;29062021164133
31;1023;29062021164133
32;1023;29062021164133
33;1023;29062021164133
34;1023;29062021164133
35;1023;29062021164133
36;1023;29062021164133
37;1023;29062021164133
38;1023;29062021164133
39;1023;29062021164133
40;1023;29062021164133
41;1023;29062021164133
42;1006;29062021164133
43;954;29062021164133
44;927;29062021164133
45;890;29062021164133
46;875;29062021164133
47;864;29062021164133
48;868;29062021164133
49;866;29062021164133
50;863;29062021164133
51;878;29062021164133
52;880;29062021164133
53;899;29062021164133
54;912;29062021164133
55;922;29062021164133
56;945;29062021164133
57;960;29062021164133
58;983;29062021164133
59;998;29062021164133
60;1014;29062021164133
61;1022;29062021164133
62;1021;29062021164133
63;1023;29062021164133
64;1023;29062021164133
65;1023;29062021164133
66;1023;29062021164133
67;1023;29062021164133
68;1023;29062021164133
69;1021;29062021164133
70;1015;29062021164133
71;1006;29062021164133
72;995;29062021164133
73;965;29062021164133
74;945;29062021164133
75;909;29062021164133
76;889;29062021164133
77;861;29062021164133
78;833;29062021164133
79;803;29062021164133
80;766;29062021164133
81;732;29062021164133
82;715;29062021164133
83;686;29062021164133
84;671;29062021164133
85;652;29062021164133
86;648;29062021164133
87;635;29062021164133
88;621;29062021164133
89;604;29062021164133
90;592;29062021164133
91;574;29062021164133
92;555;29062021164133
93;538;29062021164133
94;514;29062021164133
95;493;29062021164133
96;479;29062021164133
97;461;29062021164133
98;447;29062021164133
99;434;29062021164133
100;419;29062021164133
101;411;29062021164133
102;400;29062021164133
103;383;29062021164133
104;377;29062021164133
105;364;29062021164133
106;359;29062021164133
107;341;29062021164133
108;338;29062021164133
109;322;29062021164133
110;318;29062021164133
111;306;29062021164133
112;301;29062021164133
113;291;29062021164133
114;286;29062021164133
115;284;29062021164133
116;276;29062021164133
117;274;29062021164133
118;263;29062021164133
119;258;29062021164133
120;248;29062021164133
121;246;29062021164133
122;246;29062021164133
123;240;29062021164133
124;234;29062021164133
125;227;29062021164133
126;220;29062021164133
127;218;29062021164133
128;216;29062021164133
129;210;29062021164133
130;205;29062021164133
131;201;29062021164133
132;197;29062021164133
133;198;29062021164133
134;190;29062021164133
135;189;29062021164133
136;186;29062021164133
137;179;29062021164133
138;181;29062021164133
139;176;29062021164133
140;174;29062021164133
141;173;29062021164133
142;168;29062021164133
143;164;29062021164133
144;166;29062021164133
145;161;29062021164133
146;162;29062021164133
147;160;29062021164133
148;157;29062021164133
149;157;29062021164133
150;155;29062021164133
151;153;29062021164133
152;150;29062021164133
153;148;29062021164133
154;151;29062021164133
155;150;29062021164133
156;147;29062021164133
157;145;29062021164133
158;143;29062021164133
159;143;29062021164133
160;143;29062021164133
161;140;29062021164133
162;142;29062021164133
163;141;29062021164133
164;139;29062021164133
165;142;29062021164133
166;138;29062021164133
167;138;29062021164133
168;138;29062021164133
169;133;29062021164133
170;136;29062021164133
171;135;29062021164133
172;133;29062021164133
173;137;29062021164133
174;133;29062021164133
175;133;29062021164133
176;134;29062021164133
177;132;29062021164133
178;134;29062021164133
179;132;29062021164133
180;130;29062021164133
181;132;29062021164133
182;132;29062021164133
183;129;29062021164133
184;130;29062021164133
185;127;29062021164133
186;132;29062021164133
187;129;29062021164133
188;128;29062021164133
189;128;29062021164133
190;126;29062021164133
191;129;29062021164133
192;131;29062021164133
193;128;29062021164133
194;130;29062021164133
195;129;29062021164133
196;128;29062021164133
197;128;29062021164133
198;128;29062021164133
199;126;29062021164133
200;0;29062021164133
0;0;29062021164134
1;143;29062021164134
2;167;29062021164134
3;167;29062021164134
4;168;29062021164134
5;171;29062021164134
6;174;29062021164134
7;177;29062021164134
8;183;29062021164134
9;186;29062021164134
10;194;29062021164134
11;198;29062021164134
12;209;29062021164134
13;223;29062021164134
14;242;29062021164134
15;268;29062021164134
16;313;29062021164134
17;396;29062021164134
18;569;29062021164134
19;900;29062021164134
20;1023;29062021164134
21;1023;29062021164134
22;1023;29062021164134
23;1023;29062021164134
24;984;29062021164134
25;933;29062021164134
26;901;29062021164134
27;905;29062021164134
28;930;29062021164134
29;967;29062021164134
30;1023;29062021164134
31;1023;29062021164134
32;1023;29062021164134
33;1023;29062021164134
34;1023;29062021164134
35;1023;29062021164134
36;1023;29062021164134
37;1023;29062021164134
38;1023;29062021164134
39;1023;29062021164134
40;1023;29062021164134
41;1023;29062021164134
42;1005;29062021164134
43;950;29062021164134
44;920;29062021164134
45;891;29062021164134
46;875;29062021164134
47;862;29062021164134
48;858;29062021164134
49;864;29062021164134
50;859;29062021164134
51;875;29062021164134
52;874;29062021164134
53;895;29062021164134
54;908;29062021164134
55;921;29062021164134
56;944;29062021164134
57;961;29062021164134
58;982;29062021164134
59;994;29062021164134
60;1011;29062021164134
61;1021;29062021164134
62;1021;29062021164134
63;1023;29062021164134
64;1023;29062021164134
65;1023;29062021164134
66;1023;29062021164134
67;1023;29062021164134
68;1023;29062021164134
69;1022;29062021164134
70;1013;29062021164134
71;1001;29062021164134
72;991;29062021164134
73;967;29062021164134
74;943;29062021164134
75;910;29062021164134
76;886;29062021164134
77;862;29062021164134
78;830;29062021164134
79;801;29062021164134
80;764;29062021164134
81;731;29062021164134
82;709;29062021164134
83;682;29062021164134
84;671;29062021164134
85;654;29062021164134
86;643;29062021164134
87;637;29062021164134
88;625;29062021164134
89;604;29062021164134
90;590;29062021164134
91;573;29062021164134
92;550;29062021164134
93;536;29062021164134
94;514;29062021164134
95;498;29062021164134
96;480;29062021164134
97;462;29062021164134
98;448;29062021164134
99;434;29062021164134
100;422;29062021164134
101;411;29062021164134
102;399;29062021164134
103;384;29062021164134
104;377;29062021164134
105;365;29062021164134
106;354;29062021164134
107;344;29062021164134
108;336;29062021164134
109;326;29062021164134
110;317;29062021164134
111;307;29062021164134
112;303;29062021164134
113;290;29062021164134
114;286;29062021164134
115;282;29062021164134
116;277;29062021164134
117;272;29062021164134
118;263;29062021164134
119;263;29062021164134
120;254;29062021164134
121;245;29062021164134
122;243;29062021164134
123;240;29062021164134
124;233;29062021164134
125;230;29062021164134
126;222;29062021164134
127;218;29062021164134
128;215;29062021164134
129;211;29062021164134
130;205;29062021164134
131;203;29062021164134
132;194;29062021164134
133;200;29062021164134
134;187;29062021164134
135;186;29062021164134
136;186;29062021164134
137;180;29062021164134
138;181;29062021164134
139;175;29062021164134
140;172;29062021164134
141;173;29062021164134
142;168;29062021164134
143;165;29062021164134
144;163;29062021164134
145;161;29062021164134
146;161;29062021164134
147;161;29062021164134
148;156;29062021164134
149;157;29062021164134
150;155;29062021164134
151;155;29062021164134
152;151;29062021164134
153;148;29062021164134
154;149;29062021164134
155;150;29062021164134
156;145;29062021164134
157;147;29062021164134
158;143;29062021164134
159;143;29062021164134
160;143;29062021164134
161;142;29062021164134
162;142;29062021164134
163;141;29062021164134
164;140;29062021164134
165;141;29062021164134
166;138;29062021164134
167;138;29062021164134
168;139;29062021164134
169;134;29062021164134
170;137;29062021164134
171;135;29062021164134
172;134;29062021164134
173;136;29062021164134
174;133;29062021164134
175;132;29062021164134
176;134;29062021164134
177;131;29062021164134
178;135;29062021164134
179;132;29062021164134
180;130;29062021164134
181;131;29062021164134
182;131;29062021164134
183;130;29062021164134
184;131;29062021164134
185;126;29062021164134
186;130;29062021164134
187;129;29062021164134
188;127;29062021164134
189;129;29062021164134
190;128;29062021164134
191;129;29062021164134
192;130;29062021164134
193;127;29062021164134
194;129;29062021164134
195;128;29062021164134
196;128;29062021164134
197;128;29062021164134
198;128;29062021164134
199;126;29062021164134
200;0;29062021164134
0;0;29062021164135
1;143;29062021164135
2;169;29062021164135
3;166;29062021164135
4;169;29062021164135
5;172;29062021164135
6;173;29062021164135
7;178;29062021164135
8;183;29062021164135
9;185;29062021164135
10;196;29062021164135
11;197;29062021164135
12;209;29062021164135
13;223;29062021164135
14;239;29062021164135
15;271;29062021164135
16;313;29062021164135
17;401;29062021164135
18;570;29062021164135
19;900;29062021164135
20;1023;29062021164135
21;1023;29062021164135
22;1023;29062021164135
23;1023;29062021164135
24;982;29062021164135
25;932;29062021164135
26;900;29062021164135
27;908;29062021164135
28;931;29062021164135
29;966;29062021164135
30;1023;29062021164135
31;1023;29062021164135
32;1023;29062021164135
33;1023;29062021164135
34;1023;29062021164135
35;1023;29062021164135
36;1023;29062021164135
37;1023;29062021164135
38;1023;29062021164135
39;1023;29062021164135
40;1023;29062021164135
41;1023;29062021164135
42;1005;29062021164135
43;955;29062021164135
44;920;29062021164135
45;891;29062021164135
46;873;29062021164135
47;867;29062021164135
48;862;29062021164135
49;862;29062021164135
50;861;29062021164135
51;872;29062021164135
52;874;29062021164135
53;892;29062021164135
54;914;29062021164135
55;926;29062021164135
56;942;29062021164135
57;959;29062021164135
58;981;29062021164135
59;994;29062021164135
60;1010;29062021164135
61;1021;29062021164135
62;1021;29062021164135
63;1023;29062021164135
64;1023;29062021164135
65;1023;29062021164135
66;1023;29062021164135
67;1023;29062021164135
68;1023;29062021164135
69;1021;29062021164135
70;1013;29062021164135
71;1003;29062021164135
72;994;29062021164135
73;962;29062021164135
74;942;29062021164135
75;912;29062021164135
76;889;29062021164135
77;863;29062021164135
78;836;29062021164135
79;799;29062021164135
80;760;29062021164135
81;735;29062021164135
82;716;29062021164135
83;687;29062021164135
84;673;29062021164135
85;657;29062021164135
86;646;29062021164135
87;635;29062021164135
88;630;29062021164135
89;607;29062021164135
90;596;29062021164135
91;576;29062021164135
92;553;29062021164135
93;535;29062021164135
94;518;29062021164135
95;493;29062021164135
96;481;29062021164135
97;464;29062021164135
98;446;29062021164135
99;433;29062021164135
100;421;29062021164135
101;418;29062021164135
102;405;29062021164135
103;388;29062021164135
104;373;29062021164135
105;365;29062021164135
106;358;29062021164135
107;345;29062021164135
108;336;29062021164135
109;326;29062021164135
110;316;29062021164135
111;307;29062021164135
112;305;29062021164135
113;292;29062021164135
114;285;29062021164135
115;278;29062021164135
116;275;29062021164135
117;272;29062021164135
118;262;29062021164135
119;259;29062021164135
120;251;29062021164135
121;246;29062021164135
122;243;29062021164135
123;240;29062021164135
124;235;29062021164135
125;228;29062021164135
126;221;29062021164135
127;218;29062021164135
128;217;29062021164135
129;209;29062021164135
130;206;29062021164135
131;203;29062021164135
132;195;29062021164135
133;198;29062021164135
134;190;29062021164135
135;189;29062021164135
136;185;29062021164135
137;182;29062021164135
138;181;29062021164135
139;175;29062021164135
140;173;29062021164135
141;173;29062021164135
142;168;29062021164135
143;165;29062021164135
144;166;29062021164135
145;161;29062021164135
146;163;29062021164135
147;160;29062021164135
148;157;29062021164135
149;157;29062021164135
150;155;29062021164135
151;154;29062021164135
152;152;29062021164135
153;150;29062021164135
154;151;29062021164135
155;149;29062021164135
156;146;29062021164135
157;145;29062021164135
158;144;29062021164135
159;142;29062021164135
160;143;29062021164135
161;142;29062021164135
162;141;29062021164135
163;140;29062021164135
164;140;29062021164135
165;141;29062021164135
166;137;29062021164135
167;139;29062021164135
168;139;29062021164135
169;134;29062021164135
170;137;29062021164135
171;135;29062021164135
172;133;29062021164135
173;135;29062021164135
174;133;29062021164135
175;131;29062021164135
176;134;29062021164135
177;131;29062021164135
178;135;29062021164135
179;133;29062021164135
180;131;29062021164135
181;132;29062021164135
182;132;29062021164135
183;130;29062021164135
184;130;29062021164135
185;128;29062021164135
186;131;29062021164135
187;130;29062021164135
188;128;29062021164135
189;130;29062021164135
190;126;29062021164135
191;128;29062021164135
192;131;29062021164135
193;128;29062021164135
194;129;29062021164135
195;128;29062021164135
196;127;29062021164135
197;127;29062021164135
198;129;29062021164135
199;126;29062021164135
200;0;29062021164135
0;0;29062021164136
1;142;29062021164136
2;166;29062021164136
3;167;29062021164136
4;169;29062021164136
5;171;29062021164136
6;174;29062021164136
7;177;29062021164136
8;183;29062021164136
9;184;29062021164136
10;195;29062021164136
11;201;29062021164136
12;209;29062021164136
13;224;29062021164136
14;239;29062021164136
15;269;29062021164136
16;311;29062021164136
17;398;29062021164136
18;575;29062021164136
19;905;29062021164136
20;1023;29062021164136
21;1023;29062021164136
22;1023;29062021164136
23;1023;29062021164136
24;981;29062021164136
25;931;29062021164136
26;901;29062021164136
27;904;29062021164136
28;929;29062021164136
29;965;29062021164136
30;1023;29062021164136
31;1023;29062021164136
32;1023;29062021164136
33;1023;29062021164136
34;1023;29062021164136
35;1023;29062021164136
36;1023;29062021164136
37;1023;29062021164136
38;1023;29062021164136
39;1023;29062021164136
40;1023;29062021164136
41;1023;29062021164136
42;1006;29062021164136
43;958;29062021164136
44;918;29062021164136
45;895;29062021164136
46;875;29062021164136
47;864;29062021164136
48;864;29062021164136
49;864;29062021164136
50;862;29062021164136
51;875;29062021164136
52;880;29062021164136
53;889;29062021164136
54;908;29062021164136
55;925;29062021164136
56;943;29062021164136
57;958;29062021164136
58;982;29062021164136
59;996;29062021164136
60;1010;29062021164136
61;1021;29062021164136
62;1021;29062021164136
63;1023;29062021164136
64;1023;29062021164136
65;1023;29062021164136
66;1023;29062021164136
67;1023;29062021164136
68;1023;29062021164136
69;1022;29062021164136
70;1012;29062021164136
71;1005;29062021164136
72;991;29062021164136
73;965;29062021164136
74;947;29062021164136
75;914;29062021164136
76;889;29062021164136
77;863;29062021164136
78;831;29062021164136
79;800;29062021164136
80;767;29062021164136
81;736;29062021164136
82;714;29062021164136
83;687;29062021164136
84;674;29062021164136
85;659;29062021164136
86;641;29062021164136
87;637;29062021164136
88;625;29062021164136
89;604;29062021164136
90;593;29062021164136
91;574;29062021164136
92;553;29062021164136
93;532;29062021164136
94;517;29062021164136
95;495;29062021164136
96;480;29062021164136
97;460;29062021164136
98;448;29062021164136
99;432;29062021164136
100;422;29062021164136
101;415;29062021164136
102;400;29062021164136
103;385;29062021164136
104;375;29062021164136
105;364;29062021164136
106;355;29062021164136
107;347;29062021164136
108;333;29062021164136
109;327;29062021164136
110;316;29062021164136
111;307;29062021164136
112;303;29062021164136
113;289;29062021164136
114;287;29062021164136
115;281;29062021164136
116;275;29062021164136
117;275;29062021164136
118;263;29062021164136
119;258;29062021164136
120;251;29062021164136
121;247;29062021164136
122;243;29062021164136
123;240;29062021164136
124;234;29062021164136
125;228;29062021164136
126;221;29062021164136
127;219;29062021164136
128;217;29062021164136
129;207;29062021164136
130;204;29062021164136
131;201;29062021164136
132;196;29062021164136
133;198;29062021164136
134;190;29062021164136
135;187;29062021164136
136;185;29062021164136
137;181;29062021164136
138;180;29062021164136
139;175;29062021164136
140;173;29062021164136
141;172;29062021164136
142;169;29062021164136
143;164;29062021164136
144;166;29062021164136
145;161;29062021164136
146;161;29062021164136
147;162;29062021164136
148;156;29062021164136
149;158;29062021164136
150;154;29062021164136
151;154;29062021164136
152;150;29062021164136
153;148;29062021164136
154;148;29062021164136
155;148;29062021164136
156;147;29062021164136
157;145;29062021164136
158;144;29062021164136
159;143;29062021164136
160;144;29062021164136
161;141;29062021164136
162;142;29062021164136
163;141;29062021164136
164;140;29062021164136
165;141;29062021164136
166;138;29062021164136
167;137;29062021164136
168;139;29062021164136
169;132;29062021164136
170;136;29062021164136
171;134;29062021164136
172;134;29062021164136
173;134;29062021164136
174;132;29062021164136
175;130;29062021164136
176;135;29062021164136
177;130;29062021164136
178;135;29062021164136
179;132;29062021164136
180;130;29062021164136
181;131;29062021164136
182;132;29062021164136
183;128;29062021164136
184;130;29062021164136
185;127;29062021164136
186;131;29062021164136
187;130;29062021164136
188;127;29062021164136
189;129;29062021164136
190;127;29062021164136
191;129;29062021164136
192;131;29062021164136
193;127;29062021164136
194;129;29062021164136
195;128;29062021164136
196;127;29062021164136
197;127;29062021164136
198;128;29062021164136
199;125;29062021164136
200;0;29062021164136
0;0;29062021164137
1;142;29062021164137
2;168;29062021164137
3;166;29062021164137
4;168;29062021164137
5;172;29062021164137
6;173;29062021164137
7;178;29062021164137
8;183;29062021164137
9;184;29062021164137
10;197;29062021164137
11;198;29062021164137
12;205;29062021164137
13;223;29062021164137
14;237;29062021164137
15;269;29062021164137
16;311;29062021164137
17;398;29062021164137
18;573;29062021164137
19;902;29062021164137
20;1023;29062021164137
21;1023;29062021164137
22;1023;29062021164137
23;1023;29062021164137
24;984;29062021164137
25;931;29062021164137
26;903;29062021164137
27;905;29062021164137
28;930;29062021164137
29;965;29062021164137
30;1023;29062021164137
31;1023;29062021164137
32;1023;29062021164137
33;1023;29062021164137
34;1023;29062021164137
35;1023;29062021164137
36;1023;29062021164137
37;1023;29062021164137
38;1023;29062021164137
39;1023;29062021164137
40;1023;29062021164137
41;1023;29062021164137
42;1006;29062021164137
43;953;29062021164137
44;917;29062021164137
45;890;29062021164137
46;877;29062021164137
47;867;29062021164137
48;862;29062021164137
49;864;29062021164137
50;863;29062021164137
51;873;29062021164137
52;875;29062021164137
53;887;29062021164137
54;906;29062021164137
55;925;29062021164137
56;939;29062021164137
57;955;29062021164137
58;981;29062021164137
59;994;29062021164137
60;1014;29062021164137
61;1023;29062021164137
62;1021;29062021164137
63;1023;29062021164137
64;1023;29062021164137
65;1023;29062021164137
66;1023;29062021164137
67;1023;29062021164137
68;1023;29062021164137
69;1022;29062021164137
70;1014;29062021164137
71;1005;29062021164137
72;995;29062021164137
73;964;29062021164137
74;948;29062021164137
75;911;29062021164137
76;886;29062021164137
77;859;29062021164137
78;833;29062021164137
79;801;29062021164137
80;763;29062021164137
81;730;29062021164137
82;711;29062021164137
83;687;29062021164137
84;670;29062021164137
85;655;29062021164137
86;647;29062021164137
87;638;29062021164137
88;623;29062021164137
89;603;29062021164137
90;592;29062021164137
91;571;29062021164137
92;553;29062021164137
93;537;29062021164137
94;514;29062021164137
95;491;29062021164137
96;479;29062021164137
97;466;29062021164137
98;446;29062021164137
99;436;29062021164137
100;420;29062021164137
101;415;29062021164137
102;395;29062021164137
103;383;29062021164137
104;374;29062021164137
105;364;29062021164137
106;355;29062021164137
107;344;29062021164137
108;336;29062021164137
109;327;29062021164137
110;315;29062021164137
111;307;29062021164137
112;299;29062021164137
113;289;29062021164137
114;285;29062021164137
115;283;29062021164137
116;276;29062021164137
117;272;29062021164137
118;263;29062021164137
119;258;29062021164137
120;253;29062021164137
121;247;29062021164137
122;243;29062021164137
123;239;29062021164137
124;233;29062021164137
125;227;29062021164137
126;220;29062021164137
127;217;29062021164137
128;216;29062021164137
129;207;29062021164137
130;206;29062021164137
131;202;29062021164137
132;195;29062021164137
133;198;29062021164137
134;189;29062021164137
135;186;29062021164137
136;186;29062021164137
137;181;29062021164137
138;179;29062021164137
139;177;29062021164137
140;173;29062021164137
141;173;29062021164137
142;168;29062021164137
143;166;29062021164137
144;166;29062021164137
145;160;29062021164137
146;162;29062021164137
147;159;29062021164137
148;155;29062021164137
149;156;29062021164137
150;155;29062021164137
151;154;29062021164137
152;151;29062021164137
153;149;29062021164137
154;150;29062021164137
155;148;29062021164137
156;146;29062021164137
157;145;29062021164137
158;144;29062021164137
159;143;29062021164137
160;143;29062021164137
161;141;29062021164137
162;143;29062021164137
163;141;29062021164137
164;139;29062021164137
165;141;29062021164137
166;137;29062021164137
167;138;29062021164137
168;139;29062021164137
169;133;29062021164137
170;137;29062021164137
171;133;29062021164137
172;134;29062021164137
173;135;29062021164137
174;132;29062021164137
175;131;29062021164137
176;133;29062021164137
177;130;29062021164137
178;134;29062021164137
179;131;29062021164137
180;130;29062021164137
181;130;29062021164137
182;132;29062021164137
183;130;29062021164137
184;130;29062021164137
185;126;29062021164137
186;131;29062021164137
187;128;29062021164137
188;127;29062021164137
189;129;29062021164137
190;127;29062021164137
191;129;29062021164137
192;132;29062021164137
193;127;29062021164137
194;130;29062021164137
195;128;29062021164137
196;128;29062021164137
197;128;29062021164137
198;127;29062021164137
199;125;29062021164137
200;0;29062021164137
0;0;29062021164137
1;143;29062021164137
2;167;29062021164137
3;167;29062021164137
4;168;29062021164137
5;171;29062021164137
6;173;29062021164137
7;179;29062021164137
8;184;29062021164137
9;185;29062021164137
10;195;29062021164137
11;201;29062021164137
12;209;29062021164137
13;224;29062021164137
14;240;29062021164137
15;268;29062021164137
16;313;29062021164137
17;396;29062021164137
18;569;29062021164137
19;892;29062021164137
20;1023;29062021164137
21;1023;29062021164137
22;1023;29062021164137
23;1023;29062021164137
24;986;29062021164137
25;933;29062021164137
26;902;29062021164137
27;905;29062021164137
28;927;29062021164137
29;964;29062021164137
30;1023;29062021164137
31;1023;29062021164137
32;1023;29062021164137
33;1023;29062021164137
34;1023;29062021164137
35;1023;29062021164137
36;1023;29062021164137
37;1023;29062021164137
38;1023;29062021164137
39;1023;29062021164137
40;1023;29062021164137
41;1023;29062021164137
42;1006;29062021164137
43;956;29062021164137
44;917;29062021164137
45;891;29062021164137
46;871;29062021164137
47;862;29062021164137
48;862;29062021164137
49;865;29062021164137
50;858;29062021164137
51;872;29062021164137
52;873;29062021164137
53;890;29062021164137
54;906;29062021164137
55;919;29062021164137
56;942;29062021164137
57;958;29062021164137
58;983;29062021164137
59;991;29062021164137
60;1010;29062021164137
61;1019;29062021164137
62;1019;29062021164137
63;1023;29062021164137
64;1023;29062021164137
65;1023;29062021164137
66;1023;29062021164137
67;1023;29062021164137
68;1023;29062021164137
69;1022;29062021164137
70;1008;29062021164137
71;1004;29062021164137
72;992;29062021164137
73;962;29062021164137
74;944;29062021164137
75;909;29062021164137
76;883;29062021164137
77;858;29062021164137
78;833;29062021164137
79;798;29062021164137
80;763;29062021164137
81;728;29062021164137
82;711;29062021164137
83;686;29062021164137
84;670;29062021164137
85;655;29062021164137
86;643;29062021164137
87;634;29062021164137
88;621;29062021164137
89;603;29062021164137
90;595;29062021164137
91;571;29062021164137
92;549;29062021164137
93;536;29062021164137
94;514;29062021164137
95;496;29062021164137
96;481;29062021164137
97;462;29062021164137
98;448;29062021164137
99;432;29062021164137
100;417;29062021164137
101;411;29062021164137
102;400;29062021164137
103;385;29062021164137
104;373;29062021164137
105;364;29062021164137
106;359;29062021164137
107;344;29062021164137
108;337;29062021164137
109;325;29062021164137
110;316;29062021164137
111;305;29062021164137
112;302;29062021164137
113;289;29062021164137
114;286;29062021164137
115;278;29062021164137
116;276;29062021164137
117;273;29062021164137
118;262;29062021164137
119;260;29062021164137
120;252;29062021164137
121;248;29062021164137
122;244;29062021164137
123;238;29062021164137
124;234;29062021164137
125;229;29062021164137
126;222;29062021164137
127;218;29062021164137
128;215;29062021164137
129;208;29062021164137
130;205;29062021164137
131;202;29062021164137
132;194;29062021164137
133;199;29062021164137
134;190;29062021164137
135;188;29062021164137
136;186;29062021164137
137;180;29062021164137
138;181;29062021164137
139;175;29062021164137
140;174;29062021164137
141;174;29062021164137
142;167;29062021164137
143;166;29062021164137
144;166;29062021164137
145;160;29062021164137
146;163;29062021164137
147;161;29062021164137
148;156;29062021164137
149;157;29062021164137
150;154;29062021164137
151;155;29062021164137
152;150;29062021164137
153;149;29062021164137
154;149;29062021164137
155;149;29062021164137
156;147;29062021164137
157;145;29062021164137
158;144;29062021164137
159;143;29062021164137
160;143;29062021164137
161;141;29062021164137
162;142;29062021164137
163;141;29062021164137
164;139;29062021164137
165;140;29062021164137
166;139;29062021164137
167;137;29062021164137
168;139;29062021164137
169;134;29062021164137
170;137;29062021164137
171;134;29062021164137
172;133;29062021164137
173;136;29062021164137
174;132;29062021164137
175;132;29062021164137
176;134;29062021164137
177;131;29062021164137
178;134;29062021164137
179;132;29062021164137
180;130;29062021164137
181;131;29062021164137
182;132;29062021164137
183;129;29062021164137
184;131;29062021164137
185;128;29062021164137
186;131;29062021164137
187;129;29062021164137
188;127;29062021164137
189;130;29062021164137
190;127;29062021164137
191;129;29062021164137
192;131;29062021164137
193;127;29062021164137
194;129;29062021164137
195;128;29062021164137
196;127;29062021164137
197;128;29062021164137
198;128;29062021164137
199;126;29062021164137
200;0;29062021164137
0;0;29062021164138
1;142;29062021164138
2;167;29062021164138
3;165;29062021164138
4;169;29062021164138
5;171;29062021164138
6;173;29062021164138
7;178;29062021164138
8;182;29062021164138
9;184;29062021164138
10;195;29062021164138
11;198;29062021164138
12;206;29062021164138
13;224;29062021164138
14;240;29062021164138
15;267;29062021164138
16;311;29062021164138
17;395;29062021164138
18;571;29062021164138
19;898;29062021164138
20;1023;29062021164138
21;1023;29062021164138
22;1023;29062021164138
23;1023;29062021164138
24;984;29062021164138
25;932;29062021164138
26;903;29062021164138
27;904;29062021164138
28;926;29062021164138
29;962;29062021164138
30;1023;29062021164138
31;1023;29062021164138
32;1023;29062021164138
33;1023;29062021164138
34;1023;29062021164138
35;1023;29062021164138
36;1023;29062021164138
37;1023;29062021164138
38;1023;29062021164138
39;1023;29062021164138
40;1023;29062021164138
41;1023;29062021164138
42;1005;29062021164138
43;952;29062021164138
44;921;29062021164138
45;893;29062021164138
46;877;29062021164138
47;865;29062021164138
48;865;29062021164138
49;865;29062021164138
50;864;29062021164138
51;874;29062021164138
52;874;29062021164138
53;886;29062021164138
54;911;29062021164138
55;923;29062021164138
56;941;29062021164138
57;956;29062021164138
58;977;29062021164138
59;994;29062021164138
60;1010;29062021164138
61;1021;29062021164138
62;1020;29062021164138
63;1023;29062021164138
64;1023;29062021164138
65;1023;29062021164138
66;1023;29062021164138
67;1023;29062021164138
68;1023;29062021164138
69;1019;29062021164138
70;1010;29062021164138
71;1001;29062021164138
72;992;29062021164138
73;961;29062021164138
74;945;29062021164138
75;910;29062021164138
76;885;29062021164138
77;859;29062021164138
78;829;29062021164138
79;801;29062021164138
80;763;29062021164138
81;730;29062021164138
82;712;29062021164138
83;687;29062021164138
84;672;29062021164138
85;653;29062021164138
86;645;29062021164138
87;635;29062021164138
88;627;29062021164138
89;601;29062021164138
90;596;29062021164138
91;576;29062021164138
92;552;29062021164138
93;535;29062021164138
94;518;29062021164138
95;497;29062021164138
96;480;29062021164138
97;460;29062021164138
98;446;29062021164138
99;434;29062021164138
100;419;29062021164138
101;413;29062021164138
102;400;29062021164138
103;384;29062021164138
104;376;29062021164138
105;364;29062021164138
106;360;29062021164138
107;344;29062021164138
108;331;29062021164138
109;322;29062021164138
110;317;29062021164138
111;305;29062021164138
112;303;29062021164138
113;290;29062021164138
114;286;29062021164138
115;282;29062021164138
116;275;29062021164138
117;275;29062021164138
118;263;29062021164138
119;259;29062021164138
120;253;29062021164138
121;248;29062021164138
122;243;29062021164138
123;239;29062021164138
124;234;29062021164138
125;228;29062021164138
126;221;29062021164138
127;219;29062021164138
128;216;29062021164138
129;209;29062021164138
130;207;29062021164138
131;202;29062021164138
132;194;29062021164138
133;198;29062021164138
134;191;29062021164138
135;187;29062021164138
136;185;29062021164138
137;179;29062021164138
138;181;29062021164138
139;176;29062021164138
140;174;29062021164138
141;173;29062021164138
142;169;29062021164138
143;165;29062021164138
144;166;29062021164138
145;161;29062021164138
146;161;29062021164138
147;160;29062021164138
148;157;29062021164138
149;154;29062021164138
150;153;29062021164138
151;153;29062021164138
152;151;29062021164138
153;149;29062021164138
154;148;29062021164138
155;150;29062021164138
156;146;29062021164138
157;145;29062021164138
158;143;29062021164138
159;142;29062021164138
160;143;29062021164138
161;141;29062021164138
162;141;29062021164138
163;141;29062021164138
164;139;29062021164138
165;140;29062021164138
166;137;29062021164138
167;137;29062021164138
168;138;29062021164138
169;133;29062021164138
170;136;29062021164138
171;135;29062021164138
172;135;29062021164138
173;135;29062021164138
174;132;29062021164138
175;132;29062021164138
176;133;29062021164138
177;130;29062021164138
178;134;29062021164138
179;132;29062021164138
180;131;29062021164138
181;131;29062021164138
182;132;29062021164138
183;129;29062021164138
184;130;29062021164138
185;127;29062021164138
186;132;29062021164138
187;129;29062021164138
188;127;29062021164138
189;130;29062021164138
190;128;29062021164138
191;129;29062021164138
192;131;29062021164138
193;127;29062021164138
194;129;29062021164138
195;127;29062021164138
196;127;29062021164138
197;128;29062021164138
198;128;29062021164138
199;127;29062021164138
200;0;29062021164138
0;0;29062021164138
1;143;29062021164138
2;166;29062021164138
3;167;29062021164138
4;169;29062021164138
5;171;29062021164138
6;172;29062021164138
7;180;29062021164138
8;184;29062021164138
9;186;29062021164138
10;193;29062021164138
11;198;29062021164138
12;207;29062021164138
13;223;29062021164138
14;236;29062021164138
15;268;29062021164138
16;311;29062021164138
17;396;29062021164138
18;571;29062021164138
19;896;29062021164138
20;1023;29062021164138
21;1023;29062021164138
22;1023;29062021164138
23;1023;29062021164138
24;984;29062021164138
25;933;29062021164138
26;900;29062021164138
27;905;29062021164138
28;929;29062021164138
29;963;29062021164138
30;1023;29062021164138
31;1023;29062021164138
32;1023;29062021164138
33;1023;29062021164138
34;1023;29062021164138
35;1023;29062021164138
36;1023;29062021164138
37;1023;29062021164138
38;1023;29062021164138
39;1023;29062021164138
40;1023;29062021164138
41;1023;29062021164138
42;1008;29062021164138
43;955;29062021164138
44;919;29062021164138
45;890;29062021164138
46;874;29062021164138
47;864;29062021164138
48;863;29062021164138
49;859;29062021164138
50;857;29062021164138
51;866;29062021164138
52;873;29062021164138
53;892;29062021164138
54;911;29062021164138
55;925;29062021164138
56;942;29062021164138
57;957;29062021164138
58;981;29062021164138
59;989;29062021164138
60;1010;29062021164138
61;1019;29062021164138
62;1021;29062021164138
63;1023;29062021164138
64;1023;29062021164138
65;1023;29062021164138
66;1023;29062021164138
67;1023;29062021164138
68;1023;29062021164138
69;1020;29062021164138
70;1012;29062021164138
71;1004;29062021164138
72;991;29062021164138
73;965;29062021164138
74;944;29062021164138
75;908;29062021164138
76;890;29062021164138
77;859;29062021164138
78;829;29062021164138
79;795;29062021164138
80;761;29062021164138
81;732;29062021164138
82;712;29062021164138
83;688;29062021164138
84;670;29062021164138
85;654;29062021164138
86;645;29062021164138
87;635;29062021164138
88;623;29062021164138
89;604;29062021164138
90;591;29062021164138
91;571;29062021164138
92;554;29062021164138
93;532;29062021164138
94;512;29062021164138
95;496;29062021164138
96;480;29062021164138
97;460;29062021164138
98;447;29062021164138
99;436;29062021164138
100;420;29062021164138
101;414;29062021164138
102;401;29062021164138
103;382;29062021164138
104;376;29062021164138
105;363;29062021164138
106;357;29062021164138
107;344;29062021164138
108;334;29062021164138
109;329;29062021164138
110;315;29062021164138
111;304;29062021164138
112;299;29062021164138
113;285;29062021164138
114;288;29062021164138
115;281;29062021164138
116;276;29062021164138
117;271;29062021164138
118;263;29062021164138
119;259;29062021164138
120;254;29062021164138
121;247;29062021164138
122;242;29062021164138
123;237;29062021164138
124;234;29062021164138
125;228;29062021164138
126;221;29062021164138
127;219;29062021164138
128;217;29062021164138
129;209;29062021164138
130;205;29062021164138
131;203;29062021164138
132;196;29062021164138
133;199;29062021164138
134;189;29062021164138
135;186;29062021164138
136;185;29062021164138
137;181;29062021164138
138;181;29062021164138
139;176;29062021164138
140;172;29062021164138
141;172;29062021164138
142;168;29062021164138
143;162;29062021164138
144;166;29062021164138
145;161;29062021164138
146;162;29062021164138
147;161;29062021164138
148;158;29062021164138
149;157;29062021164138
150;155;29062021164138
151;153;29062021164138
152;151;29062021164138
153;148;29062021164138
154;150;29062021164138
155;149;29062021164138
156;147;29062021164138
157;145;29062021164138
158;144;29062021164138
159;142;29062021164138
160;143;29062021164138
161;141;29062021164138
162;142;29062021164138
163;141;29062021164138
164;140;29062021164138
165;141;29062021164138
166;138;29062021164138
167;138;29062021164138
168;139;29062021164138
169;133;29062021164138
170;137;29062021164138
171;136;29062021164138
172;133;29062021164138
173;135;29062021164138
174;133;29062021164138
175;132;29062021164138
176;134;29062021164138
177;131;29062021164138
178;133;29062021164138
179;132;29062021164138
180;130;29062021164138
181;131;29062021164138
182;131;29062021164138
183;129;29062021164138
184;131;29062021164138
185;127;29062021164138
186;132;29062021164138
187;129;29062021164138
188;129;29062021164138
189;130;29062021164138
190;127;29062021164138
191;128;29062021164138
192;132;29062021164138
193;127;29062021164138
194;129;29062021164138
195;128;29062021164138
196;127;29062021164138
197;127;29062021164138
198;128;29062021164138
199;126;29062021164138
200;0;29062021164138
0;0;29062021164139
1;142;29062021164139
2;166;29062021164139
3;165;29062021164139
4;169;29062021164139
5;169;29062021164139
6;171;29062021164139
7;178;29062021164139
8;182;29062021164139
9;183;29062021164139
10;192;29062021164139
11;199;29062021164139
12;206;29062021164139
13;224;29062021164139
14;238;29062021164139
15;265;29062021164139
16;308;29062021164139
17;394;29062021164139
18;563;29062021164139
19;886;29062021164139
20;1023;29062021164139
21;1023;29062021164139
22;1023;29062021164139
23;1023;29062021164139
24;988;29062021164139
25;935;29062021164139
26;903;29062021164139
27;904;29062021164139
28;929;29062021164139
29;963;29062021164139
30;1023;29062021164139
31;1023;29062021164139
32;1023;29062021164139
33;1023;29062021164139
34;1023;29062021164139
35;1023;29062021164139
36;1023;29062021164139
37;1023;29062021164139
38;1023;29062021164139
39;1023;29062021164139
40;1023;29062021164139
41;1023;29062021164139
42;1004;29062021164139
43;951;29062021164139
44;911;29062021164139
45;882;29062021164139
46;864;29062021164139
47;856;29062021164139
48;849;29062021164139
49;852;29062021164139
50;853;29062021164139
51;864;29062021164139
52;865;29062021164139
53;886;29062021164139
54;897;29062021164139
55;912;29062021164139
56;932;29062021164139
57;951;29062021164139
58;974;29062021164139
59;986;29062021164139
60;1005;29062021164139
61;1016;29062021164139
62;1016;29062021164139
63;1023;29062021164139
64;1023;29062021164139
65;1023;29062021164139
66;1023;29062021164139
67;1023;29062021164139
68;1020;29062021164139
69;1016;29062021164139
70;1006;29062021164139
71;1000;29062021164139
72;984;29062021164139
73;958;29062021164139
74;940;29062021164139
75;899;29062021164139
76;874;29062021164139
77;849;29062021164139
78;819;29062021164139
79;795;29062021164139
80;757;29062021164139
81;726;29062021164139
82;706;29062021164139
83;680;29062021164139
84;669;29062021164139
85;647;29062021164139
86;636;29062021164139
87;633;29062021164139
88;616;29062021164139
89;597;29062021164139
90;587;29062021164139
91;568;29062021164139
92;545;29062021164139
93;528;29062021164139
94;514;29062021164139
95;490;29062021164139
96;476;29062021164139
97;459;29062021164139
98;444;29062021164139
99;427;29062021164139
100;411;29062021164139
101;409;29062021164139
102;396;29062021164139
103;380;29062021164139
104;370;29062021164139
105;362;29062021164139
106;353;29062021164139
107;339;29062021164139
108;332;29062021164139
109;324;29062021164139
110;313;29062021164139
111;304;29062021164139
112;297;29062021164139
113;288;29062021164139
114;282;29062021164139
115;280;29062021164139
116;274;29062021164139
117;272;29062021164139
118;261;29062021164139
119;256;29062021164139
120;251;29062021164139
121;246;29062021164139
122;242;29062021164139
123;236;29062021164139
124;235;29062021164139
125;228;29062021164139
126;220;29062021164139
127;216;29062021164139
128;214;29062021164139
129;207;29062021164139
130;206;29062021164139
131;200;29062021164139
132;195;29062021164139
133;197;29062021164139
134;190;29062021164139
135;186;29062021164139
136;185;29062021164139
137;180;29062021164139
138;179;29062021164139
139;174;29062021164139
140;172;29062021164139
141;173;29062021164139
142;167;29062021164139
143;163;29062021164139
144;165;29062021164139
145;161;29062021164139
146;160;29062021164139
147;160;29062021164139
148;156;29062021164139
149;155;29062021164139
150;154;29062021164139
151;155;29062021164139
152;151;29062021164139
153;149;29062021164139
154;150;29062021164139
155;147;29062021164139
156;145;29062021164139
157;145;29062021164139
158;143;29062021164139
159;143;29062021164139
160;143;29062021164139
161;140;29062021164139
162;141;29062021164139
163;141;29062021164139
164;140;29062021164139
165;141;29062021164139
166;138;29062021164139
167;139;29062021164139
168;140;29062021164139
169;134;29062021164139
170;136;29062021164139
171;134;29062021164139
172;133;29062021164139
173;135;29062021164139
174;132;29062021164139
175;131;29062021164139
176;133;29062021164139
177;131;29062021164139
178;133;29062021164139
179;132;29062021164139
180;130;29062021164139
181;131;29062021164139
182;131;29062021164139
183;129;29062021164139
184;130;29062021164139
185;127;29062021164139
186;131;29062021164139
187;129;29062021164139
188;126;29062021164139
189;129;29062021164139
190;127;29062021164139
191;128;29062021164139
192;132;29062021164139
193;127;29062021164139
194;130;29062021164139
195;127;29062021164139
196;127;29062021164139
197;127;29062021164139
198;128;29062021164139
199;127;29062021164139
200;0;29062021164139
