ind;val;datetime
0;0;29062021130722
1;141;29062021130722
2;134;29062021130722
3;132;29062021130722
4;133;29062021130722
5;135;29062021130722
6;133;29062021130722
7;137;29062021130722
8;139;29062021130722
9;138;29062021130722
10;143;29062021130722
11;142;29062021130722
12;144;29062021130722
13;151;29062021130722
14;156;29062021130722
15;166;29062021130722
16;178;29062021130722
17;202;29062021130722
18;257;29062021130722
19;366;29062021130722
20;613;29062021130722
21;1023;29062021130722
22;1023;29062021130722
23;1023;29062021130722
24;1023;29062021130722
25;1023;29062021130722
26;1023;29062021130722
27;1023;29062021130722
28;1023;29062021130722
29;1023;29062021130722
30;1023;29062021130722
31;1023;29062021130722
32;1023;29062021130722
33;1023;29062021130722
34;1023;29062021130722
35;1023;29062021130722
36;1023;29062021130722
37;1023;29062021130722
38;950;29062021130722
39;794;29062021130722
40;671;29062021130722
41;582;29062021130722
42;529;29062021130722
43;478;29062021130722
44;461;29062021130722
45;441;29062021130722
46;432;29062021130722
47;427;29062021130722
48;431;29062021130722
49;429;29062021130722
50;429;29062021130722
51;434;29062021130722
52;436;29062021130722
53;451;29062021130722
54;458;29062021130722
55;464;29062021130722
56;476;29062021130722
57;489;29062021130722
58;504;29062021130722
59;515;29062021130722
60;530;29062021130722
61;543;29062021130722
62;551;29062021130722
63;563;29062021130722
64;570;29062021130722
65;573;29062021130722
66;580;29062021130722
67;581;29062021130722
68;573;29062021130722
69;568;29062021130722
70;555;29062021130722
71;550;29062021130722
72;539;29062021130722
73;520;29062021130722
74;510;29062021130722
75;490;29062021130722
76;481;29062021130722
77;466;29062021130722
78;450;29062021130722
79;433;29062021130722
80;417;29062021130722
81;404;29062021130722
82;395;29062021130722
83;384;29062021130722
84;374;29062021130722
85;369;29062021130722
86;365;29062021130722
87;359;29062021130722
88;358;29062021130722
89;345;29062021130722
90;345;29062021130722
91;337;29062021130722
92;326;29062021130722
93;318;29062021130722
94;311;29062021130722
95;298;29062021130722
96;295;29062021130722
97;285;29062021130722
98;278;29062021130722
99;269;29062021130722
100;268;29062021130722
101;264;29062021130722
102;256;29062021130722
103;248;29062021130722
104;247;29062021130722
105;239;29062021130722
106;239;29062021130722
107;230;29062021130722
108;226;29062021130722
109;221;29062021130722
110;215;29062021130722
111;214;29062021130722
112;211;29062021130722
113;204;29062021130722
114;203;29062021130722
115;201;29062021130722
116;196;29062021130722
117;197;29062021130722
118;192;29062021130722
119;188;29062021130722
120;185;29062021130722
121;180;29062021130722
122;181;29062021130722
123;179;29062021130722
124;175;29062021130722
125;175;29062021130722
126;170;29062021130722
127;168;29062021130722
128;169;29062021130722
129;162;29062021130722
130;163;29062021130722
131;161;29062021130722
132;159;29062021130722
133;160;29062021130722
134;155;29062021130722
135;155;29062021130722
136;154;29062021130722
137;150;29062021130722
138;149;29062021130722
139;147;29062021130722
140;145;29062021130722
141;146;29062021130722
142;142;29062021130722
143;142;29062021130722
144;142;29062021130722
145;139;29062021130722
146;141;29062021130722
147;140;29062021130722
148;137;29062021130722
149;136;29062021130722
150;135;29062021130722
151;136;29062021130722
152;136;29062021130722
153;133;29062021130722
154;134;29062021130722
155;132;29062021130722
156;132;29062021130722
157;132;29062021130722
158;130;29062021130722
159;129;29062021130722
160;130;29062021130722
161;129;29062021130722
162;130;29062021130722
163;129;29062021130722
164;127;29062021130722
165;130;29062021130722
166;127;29062021130722
167;127;29062021130722
168;128;29062021130722
169;125;29062021130722
170;127;29062021130722
171;125;29062021130722
172;125;29062021130722
173;125;29062021130722
174;123;29062021130722
175;124;29062021130722
176;125;29062021130722
177;123;29062021130722
178;125;29062021130722
179;124;29062021130722
180;122;29062021130722
181;124;29062021130722
182;124;29062021130722
183;122;29062021130722
184;124;29062021130722
185;121;29062021130722
186;124;29062021130722
187;122;29062021130722
188;119;29062021130722
189;122;29062021130722
190;121;29062021130722
191;121;29062021130722
192;124;29062021130722
193;122;29062021130722
194;121;29062021130722
195;123;29062021130722
196;120;29062021130722
197;122;29062021130722
198;121;29062021130722
199;120;29062021130722
200;0;29062021130722
0;0;29062021130723
1;141;29062021130723
2;133;29062021130723
3;132;29062021130723
4;134;29062021130723
5;136;29062021130723
6;133;29062021130723
7;137;29062021130723
8;140;29062021130723
9;138;29062021130723
10;142;29062021130723
11;143;29062021130723
12;144;29062021130723
13;151;29062021130723
14;155;29062021130723
15;165;29062021130723
16;177;29062021130723
17;200;29062021130723
18;255;29062021130723
19;369;29062021130723
20;610;29062021130723
21;1023;29062021130723
22;1023;29062021130723
23;1023;29062021130723
24;1023;29062021130723
25;1023;29062021130723
26;1023;29062021130723
27;1023;29062021130723
28;1023;29062021130723
29;1023;29062021130723
30;1023;29062021130723
31;1023;29062021130723
32;1023;29062021130723
33;1023;29062021130723
34;1023;29062021130723
35;1023;29062021130723
36;1023;29062021130723
37;1023;29062021130723
38;961;29062021130723
39;807;29062021130723
40;680;29062021130723
41;583;29062021130723
42;535;29062021130723
43;485;29062021130723
44;463;29062021130723
45;443;29062021130723
46;436;29062021130723
47;433;29062021130723
48;430;29062021130723
49;429;29062021130723
50;430;29062021130723
51;435;29062021130723
52;441;29062021130723
53;450;29062021130723
54;459;29062021130723
55;464;29062021130723
56;477;29062021130723
57;488;29062021130723
58;510;29062021130723
59;515;29062021130723
60;532;29062021130723
61;545;29062021130723
62;551;29062021130723
63;569;29062021130723
64;571;29062021130723
65;573;29062021130723
66;580;29062021130723
67;578;29062021130723
68;575;29062021130723
69;570;29062021130723
70;554;29062021130723
71;551;29062021130723
72;538;29062021130723
73;517;29062021130723
74;514;29062021130723
75;488;29062021130723
76;478;29062021130723
77;465;29062021130723
78;451;29062021130723
79;436;29062021130723
80;418;29062021130723
81;406;29062021130723
82;397;29062021130723
83;384;29062021130723
84;376;29062021130723
85;372;29062021130723
86;364;29062021130723
87;363;29062021130723
88;359;29062021130723
89;346;29062021130723
90;346;29062021130723
91;336;29062021130723
92;326;29062021130723
93;318;29062021130723
94;310;29062021130723
95;300;29062021130723
96;294;29062021130723
97;284;29062021130723
98;280;29062021130723
99;271;29062021130723
100;265;29062021130723
101;266;29062021130723
102;255;29062021130723
103;249;29062021130723
104;242;29062021130723
105;239;29062021130723
106;238;29062021130723
107;231;29062021130723
108;226;29062021130723
109;223;29062021130723
110;215;29062021130723
111;212;29062021130723
112;211;29062021130723
113;204;29062021130723
114;204;29062021130723
115;199;29062021130723
116;196;29062021130723
117;197;29062021130723
118;192;29062021130723
119;190;29062021130723
120;185;29062021130723
121;181;29062021130723
122;180;29062021130723
123;179;29062021130723
124;175;29062021130723
125;175;29062021130723
126;171;29062021130723
127;168;29062021130723
128;168;29062021130723
129;162;29062021130723
130;162;29062021130723
131;162;29062021130723
132;157;29062021130723
133;160;29062021130723
134;154;29062021130723
135;153;29062021130723
136;153;29062021130723
137;150;29062021130723
138;149;29062021130723
139;147;29062021130723
140;144;29062021130723
141;145;29062021130723
142;142;29062021130723
143;142;29062021130723
144;143;29062021130723
145;138;29062021130723
146;141;29062021130723
147;138;29062021130723
148;136;29062021130723
149;136;29062021130723
150;134;29062021130723
151;134;29062021130723
152;134;29062021130723
153;132;29062021130723
154;133;29062021130723
155;131;29062021130723
156;131;29062021130723
157;129;29062021130723
158;131;29062021130723
159;128;29062021130723
160;129;29062021130723
161;128;29062021130723
162;129;29062021130723
163;129;29062021130723
164;127;29062021130723
165;130;29062021130723
166;126;29062021130723
167;126;29062021130723
168;127;29062021130723
169;123;29062021130723
170;126;29062021130723
171;125;29062021130723
172;123;29062021130723
173;125;29062021130723
174;124;29062021130723
175;123;29062021130723
176;124;29062021130723
177;122;29062021130723
178;124;29062021130723
179;123;29062021130723
180;122;29062021130723
181;124;29062021130723
182;122;29062021130723
183;121;29062021130723
184;122;29062021130723
185;120;29062021130723
186;123;29062021130723
187;121;29062021130723
188;120;29062021130723
189;122;29062021130723
190;120;29062021130723
191;120;29062021130723
192;123;29062021130723
193;120;29062021130723
194;120;29062021130723
195;120;29062021130723
196;120;29062021130723
197;120;29062021130723
198;121;29062021130723
199;119;29062021130723
200;0;29062021130723
0;0;29062021130723
1;141;29062021130723
2;133;29062021130723
3;131;29062021130723
4;134;29062021130723
5;136;29062021130723
6;134;29062021130723
7;136;29062021130723
8;138;29062021130723
9;138;29062021130723
10;142;29062021130723
11;141;29062021130723
12;143;29062021130723
13;152;29062021130723
14;155;29062021130723
15;165;29062021130723
16;178;29062021130723
17;201;29062021130723
18;256;29062021130723
19;364;29062021130723
20;615;29062021130723
21;1023;29062021130723
22;1023;29062021130723
23;1023;29062021130723
24;1023;29062021130723
25;1023;29062021130723
26;1023;29062021130723
27;1023;29062021130723
28;1023;29062021130723
29;1023;29062021130723
30;1023;29062021130723
31;1023;29062021130723
32;1023;29062021130723
33;1023;29062021130723
34;1023;29062021130723
35;1023;29062021130723
36;1023;29062021130723
37;1023;29062021130723
38;959;29062021130723
39;810;29062021130723
40;678;29062021130723
41;584;29062021130723
42;532;29062021130723
43;489;29062021130723
44;464;29062021130723
45;444;29062021130723
46;435;29062021130723
47;427;29062021130723
48;430;29062021130723
49;432;29062021130723
50;432;29062021130723
51;430;29062021130723
52;438;29062021130723
53;447;29062021130723
54;456;29062021130723
55;468;29062021130723
56;475;29062021130723
57;489;29062021130723
58;505;29062021130723
59;512;29062021130723
60;533;29062021130723
61;540;29062021130723
62;550;29062021130723
63;564;29062021130723
64;568;29062021130723
65;572;29062021130723
66;580;29062021130723
67;579;29062021130723
68;572;29062021130723
69;570;29062021130723
70;551;29062021130723
71;548;29062021130723
72;539;29062021130723
73;523;29062021130723
74;514;29062021130723
75;493;29062021130723
76;479;29062021130723
77;463;29062021130723
78;449;29062021130723
79;433;29062021130723
80;418;29062021130723
81;404;29062021130723
82;394;29062021130723
83;381;29062021130723
84;373;29062021130723
85;368;29062021130723
86;367;29062021130723
87;360;29062021130723
88;359;29062021130723
89;348;29062021130723
90;347;29062021130723
91;334;29062021130723
92;325;29062021130723
93;320;29062021130723
94;313;29062021130723
95;299;29062021130723
96;295;29062021130723
97;286;29062021130723
98;280;29062021130723
99;274;29062021130723
100;265;29062021130723
101;261;29062021130723
102;258;29062021130723
103;250;29062021130723
104;245;29062021130723
105;238;29062021130723
106;239;29062021130723
107;231;29062021130723
108;227;29062021130723
109;219;29062021130723
110;217;29062021130723
111;211;29062021130723
112;212;29062021130723
113;203;29062021130723
114;201;29062021130723
115;201;29062021130723
116;199;29062021130723
117;199;29062021130723
118;192;29062021130723
119;190;29062021130723
120;184;29062021130723
121;183;29062021130723
122;183;29062021130723
123;179;29062021130723
124;175;29062021130723
125;175;29062021130723
126;170;29062021130723
127;168;29062021130723
128;168;29062021130723
129;163;29062021130723
130;163;29062021130723
131;161;29062021130723
132;158;29062021130723
133;160;29062021130723
134;153;29062021130723
135;155;29062021130723
136;154;29062021130723
137;149;29062021130723
138;151;29062021130723
139;148;29062021130723
140;145;29062021130723
141;146;29062021130723
142;142;29062021130723
143;141;29062021130723
144;143;29062021130723
145;138;29062021130723
146;141;29062021130723
147;138;29062021130723
148;137;29062021130723
149;137;29062021130723
150;135;29062021130723
151;136;29062021130723
152;135;29062021130723
153;133;29062021130723
154;134;29062021130723
155;133;29062021130723
156;131;29062021130723
157;131;29062021130723
158;129;29062021130723
159;130;29062021130723
160;130;29062021130723
161;128;29062021130723
162;130;29062021130723
163;129;29062021130723
164;128;29062021130723
165;128;29062021130723
166;127;29062021130723
167;127;29062021130723
168;127;29062021130723
169;124;29062021130723
170;126;29062021130723
171;125;29062021130723
172;124;29062021130723
173;125;29062021130723
174;125;29062021130723
175;123;29062021130723
176;125;29062021130723
177;123;29062021130723
178;124;29062021130723
179;123;29062021130723
180;122;29062021130723
181;125;29062021130723
182;123;29062021130723
183;122;29062021130723
184;124;29062021130723
185;121;29062021130723
186;124;29062021130723
187;122;29062021130723
188;120;29062021130723
189;121;29062021130723
190;121;29062021130723
191;121;29062021130723
192;124;29062021130723
193;120;29062021130723
194;121;29062021130723
195;121;29062021130723
196;119;29062021130723
197;121;29062021130723
198;122;29062021130723
199;120;29062021130723
200;0;29062021130723
0;0;29062021130724
1;142;29062021130724
2;134;29062021130724
3;132;29062021130724
4;133;29062021130724
5;134;29062021130724
6;134;29062021130724
7;136;29062021130724
8;138;29062021130724
9;139;29062021130724
10;143;29062021130724
11;142;29062021130724
12;144;29062021130724
13;150;29062021130724
14;154;29062021130724
15;165;29062021130724
16;178;29062021130724
17;202;29062021130724
18;255;29062021130724
19;366;29062021130724
20;609;29062021130724
21;1023;29062021130724
22;1023;29062021130724
23;1023;29062021130724
24;1023;29062021130724
25;1023;29062021130724
26;1023;29062021130724
27;1023;29062021130724
28;1023;29062021130724
29;1023;29062021130724
30;1023;29062021130724
31;1023;29062021130724
32;1023;29062021130724
33;1023;29062021130724
34;1023;29062021130724
35;1023;29062021130724
36;1023;29062021130724
37;1023;29062021130724
38;959;29062021130724
39;801;29062021130724
40;673;29062021130724
41;586;29062021130724
42;533;29062021130724
43;487;29062021130724
44;460;29062021130724
45;444;29062021130724
46;431;29062021130724
47;428;29062021130724
48;428;29062021130724
49;428;29062021130724
50;434;29062021130724
51;439;29062021130724
52;439;29062021130724
53;446;29062021130724
54;458;29062021130724
55;461;29062021130724
56;480;29062021130724
57;490;29062021130724
58;507;29062021130724
59;514;29062021130724
60;532;29062021130724
61;544;29062021130724
62;547;29062021130724
63;563;29062021130724
64;570;29062021130724
65;574;29062021130724
66;579;29062021130724
67;578;29062021130724
68;572;29062021130724
69;566;29062021130724
70;553;29062021130724
71;546;29062021130724
72;541;29062021130724
73;519;29062021130724
74;508;29062021130724
75;488;29062021130724
76;480;29062021130724
77;467;29062021130724
78;448;29062021130724
79;432;29062021130724
80;417;29062021130724
81;399;29062021130724
82;397;29062021130724
83;383;29062021130724
84;374;29062021130724
85;366;29062021130724
86;364;29062021130724
87;358;29062021130724
88;356;29062021130724
89;347;29062021130724
90;346;29062021130724
91;338;29062021130724
92;326;29062021130724
93;316;29062021130724
94;310;29062021130724
95;299;29062021130724
96;295;29062021130724
97;284;29062021130724
98;277;29062021130724
99;271;29062021130724
100;267;29062021130724
101;262;29062021130724
102;255;29062021130724
103;248;29062021130724
104;244;29062021130724
105;239;29062021130724
106;238;29062021130724
107;231;29062021130724
108;226;29062021130724
109;222;29062021130724
110;215;29062021130724
111;212;29062021130724
112;211;29062021130724
113;204;29062021130724
114;203;29062021130724
115;200;29062021130724
116;197;29062021130724
117;198;29062021130724
118;191;29062021130724
119;188;29062021130724
120;185;29062021130724
121;183;29062021130724
122;181;29062021130724
123;177;29062021130724
124;174;29062021130724
125;176;29062021130724
126;170;29062021130724
127;167;29062021130724
128;170;29062021130724
129;163;29062021130724
130;165;29062021130724
131;162;29062021130724
132;158;29062021130724
133;160;29062021130724
134;155;29062021130724
135;153;29062021130724
136;155;29062021130724
137;150;29062021130724
138;151;29062021130724
139;148;29062021130724
140;144;29062021130724
141;147;29062021130724
142;143;29062021130724
143;141;29062021130724
144;143;29062021130724
145;138;29062021130724
146;142;29062021130724
147;139;29062021130724
148;137;29062021130724
149;136;29062021130724
150;135;29062021130724
151;135;29062021130724
152;134;29062021130724
153;132;29062021130724
154;133;29062021130724
155;133;29062021130724
156;131;29062021130724
157;132;29062021130724
158;130;29062021130724
159;129;29062021130724
160;130;29062021130724
161;128;29062021130724
162;129;29062021130724
163;128;29062021130724
164;127;29062021130724
165;130;29062021130724
166;128;29062021130724
167;127;29062021130724
168;128;29062021130724
169;125;29062021130724
170;126;29062021130724
171;127;29062021130724
172;124;29062021130724
173;125;29062021130724
174;125;29062021130724
175;123;29062021130724
176;125;29062021130724
177;122;29062021130724
178;125;29062021130724
179;122;29062021130724
180;123;29062021130724
181;123;29062021130724
182;122;29062021130724
183;122;29062021130724
184;123;29062021130724
185;120;29062021130724
186;123;29062021130724
187;123;29062021130724
188;121;29062021130724
189;122;29062021130724
190;120;29062021130724
191;121;29062021130724
192;124;29062021130724
193;120;29062021130724
194;121;29062021130724
195;121;29062021130724
196;120;29062021130724
197;121;29062021130724
198;121;29062021130724
199;120;29062021130724
200;0;29062021130724
0;0;29062021130726
1;141;29062021130726
2;134;29062021130726
3;131;29062021130726
4;133;29062021130726
5;135;29062021130726
6;133;29062021130726
7;138;29062021130726
8;138;29062021130726
9;138;29062021130726
10;142;29062021130726
11;141;29062021130726
12;146;29062021130726
13;150;29062021130726
14;155;29062021130726
15;165;29062021130726
16;178;29062021130726
17;200;29062021130726
18;256;29062021130726
19;364;29062021130726
20;611;29062021130726
21;1023;29062021130726
22;1023;29062021130726
23;1023;29062021130726
24;1023;29062021130726
25;1023;29062021130726
26;1023;29062021130726
27;1023;29062021130726
28;1023;29062021130726
29;1023;29062021130726
30;1023;29062021130726
31;1023;29062021130726
32;1023;29062021130726
33;1023;29062021130726
34;1023;29062021130726
35;1023;29062021130726
36;1023;29062021130726
37;1023;29062021130726
38;961;29062021130726
39;803;29062021130726
40;677;29062021130726
41;585;29062021130726
42;531;29062021130726
43;486;29062021130726
44;463;29062021130726
45;439;29062021130726
46;434;29062021130726
47;429;29062021130726
48;430;29062021130726
49;425;29062021130726
50;433;29062021130726
51;435;29062021130726
52;437;29062021130726
53;448;29062021130726
54;455;29062021130726
55;464;29062021130726
56;477;29062021130726
57;491;29062021130726
58;504;29062021130726
59;515;29062021130726
60;530;29062021130726
61;541;29062021130726
62;551;29062021130726
63;566;29062021130726
64;568;29062021130726
65;570;29062021130726
66;579;29062021130726
67;581;29062021130726
68;573;29062021130726
69;567;29062021130726
70;555;29062021130726
71;551;29062021130726
72;539;29062021130726
73;523;29062021130726
74;510;29062021130726
75;494;29062021130726
76;477;29062021130726
77;465;29062021130726
78;450;29062021130726
79;432;29062021130726
80;418;29062021130726
81;403;29062021130726
82;397;29062021130726
83;384;29062021130726
84;376;29062021130726
85;369;29062021130726
86;364;29062021130726
87;362;29062021130726
88;359;29062021130726
89;349;29062021130726
90;344;29062021130726
91;335;29062021130726
92;326;29062021130726
93;319;29062021130726
94;310;29062021130726
95;299;29062021130726
96;295;29062021130726
97;285;29062021130726
98;279;29062021130726
99;272;29062021130726
100;265;29062021130726
101;262;29062021130726
102;255;29062021130726
103;251;29062021130726
104;246;29062021130726
105;239;29062021130726
106;238;29062021130726
107;231;29062021130726
108;226;29062021130726
109;222;29062021130726
110;216;29062021130726
111;213;29062021130726
112;211;29062021130726
113;206;29062021130726
114;202;29062021130726
115;201;29062021130726
116;197;29062021130726
117;196;29062021130726
118;190;29062021130726
119;190;29062021130726
120;184;29062021130726
121;183;29062021130726
122;181;29062021130726
123;180;29062021130726
124;176;29062021130726
125;175;29062021130726
126;171;29062021130726
127;169;29062021130726
128;167;29062021130726
129;162;29062021130726
130;163;29062021130726
131;163;29062021130726
132;157;29062021130726
133;159;29062021130726
134;154;29062021130726
135;154;29062021130726
136;153;29062021130726
137;149;29062021130726
138;150;29062021130726
139;147;29062021130726
140;146;29062021130726
141;147;29062021130726
142;143;29062021130726
143;141;29062021130726
144;143;29062021130726
145;139;29062021130726
146;141;29062021130726
147;140;29062021130726
148;137;29062021130726
149;135;29062021130726
150;135;29062021130726
151;135;29062021130726
152;134;29062021130726
153;132;29062021130726
154;133;29062021130726
155;132;29062021130726
156;131;29062021130726
157;130;29062021130726
158;129;29062021130726
159;129;29062021130726
160;131;29062021130726
161;128;29062021130726
162;129;29062021130726
163;129;29062021130726
164;126;29062021130726
165;129;29062021130726
166;128;29062021130726
167;127;29062021130726
168;128;29062021130726
169;123;29062021130726
170;127;29062021130726
171;125;29062021130726
172;125;29062021130726
173;125;29062021130726
174;124;29062021130726
175;123;29062021130726
176;124;29062021130726
177;122;29062021130726
178;124;29062021130726
179;123;29062021130726
180;123;29062021130726
181;123;29062021130726
182;122;29062021130726
183;121;29062021130726
184;123;29062021130726
185;120;29062021130726
186;123;29062021130726
187;123;29062021130726
188;120;29062021130726
189;121;29062021130726
190;121;29062021130726
191;121;29062021130726
192;125;29062021130726
193;120;29062021130726
194;120;29062021130726
195;121;29062021130726
196;120;29062021130726
197;121;29062021130726
198;121;29062021130726
199;119;29062021130726
200;0;29062021130726
0;0;29062021130726
1;140;29062021130726
2;133;29062021130726
3;132;29062021130726
4;132;29062021130726
5;134;29062021130726
6;133;29062021130726
7;135;29062021130726
8;139;29062021130726
9;137;29062021130726
10;141;29062021130726
11;141;29062021130726
12;144;29062021130726
13;151;29062021130726
14;154;29062021130726
15;165;29062021130726
16;178;29062021130726
17;200;29062021130726
18;255;29062021130726
19;362;29062021130726
20;608;29062021130726
21;1023;29062021130726
22;1023;29062021130726
23;1023;29062021130726
24;1023;29062021130726
25;1023;29062021130726
26;1023;29062021130726
27;1023;29062021130726
28;1023;29062021130726
29;1023;29062021130726
30;1023;29062021130726
31;1023;29062021130726
32;1023;29062021130726
33;1023;29062021130726
34;1023;29062021130726
35;1023;29062021130726
36;1023;29062021130726
37;1023;29062021130726
38;971;29062021130726
39;815;29062021130726
40;685;29062021130726
41;594;29062021130726
42;534;29062021130726
43;487;29062021130726
44;463;29062021130726
45;444;29062021130726
46;433;29062021130726
47;432;29062021130726
48;431;29062021130726
49;430;29062021130726
50;429;29062021130726
51;434;29062021130726
52;435;29062021130726
53;451;29062021130726
54;454;29062021130726
55;465;29062021130726
56;477;29062021130726
57;486;29062021130726
58;506;29062021130726
59;518;29062021130726
60;528;29062021130726
61;546;29062021130726
62;551;29062021130726
63;562;29062021130726
64;571;29062021130726
65;574;29062021130726
66;578;29062021130726
67;578;29062021130726
68;574;29062021130726
69;567;29062021130726
70;555;29062021130726
71;547;29062021130726
72;539;29062021130726
73;522;29062021130726
74;511;29062021130726
75;492;29062021130726
76;479;29062021130726
77;467;29062021130726
78;449;29062021130726
79;432;29062021130726
80;418;29062021130726
81;400;29062021130726
82;394;29062021130726
83;384;29062021130726
84;372;29062021130726
85;366;29062021130726
86;363;29062021130726
87;360;29062021130726
88;354;29062021130726
89;349;29062021130726
90;343;29062021130726
91;338;29062021130726
92;326;29062021130726
93;319;29062021130726
94;309;29062021130726
95;299;29062021130726
96;292;29062021130726
97;284;29062021130726
98;280;29062021130726
99;272;29062021130726
100;267;29062021130726
101;262;29062021130726
102;253;29062021130726
103;249;29062021130726
104;246;29062021130726
105;239;29062021130726
106;239;29062021130726
107;231;29062021130726
108;227;29062021130726
109;224;29062021130726
110;216;29062021130726
111;213;29062021130726
112;210;29062021130726
113;204;29062021130726
114;202;29062021130726
115;199;29062021130726
116;197;29062021130726
117;195;29062021130726
118;193;29062021130726
119;191;29062021130726
120;187;29062021130726
121;182;29062021130726
122;182;29062021130726
123;180;29062021130726
124;174;29062021130726
125;176;29062021130726
126;167;29062021130726
127;168;29062021130726
128;167;29062021130726
129;164;29062021130726
130;162;29062021130726
131;163;29062021130726
132;155;29062021130726
133;160;29062021130726
134;154;29062021130726
135;153;29062021130726
136;154;29062021130726
137;149;29062021130726
138;150;29062021130726
139;147;29062021130726
140;146;29062021130726
141;147;29062021130726
142;143;29062021130726
143;142;29062021130726
144;142;29062021130726
145;138;29062021130726
146;141;29062021130726
147;139;29062021130726
148;136;29062021130726
149;137;29062021130726
150;134;29062021130726
151;135;29062021130726
152;134;29062021130726
153;132;29062021130726
154;134;29062021130726
155;132;29062021130726
156;129;29062021130726
157;131;29062021130726
158;129;29062021130726
159;129;29062021130726
160;129;29062021130726
161;128;29062021130726
162;129;29062021130726
163;128;29062021130726
164;127;29062021130726
165;128;29062021130726
166;126;29062021130726
167;127;29062021130726
168;127;29062021130726
169;124;29062021130726
170;126;29062021130726
171;126;29062021130726
172;124;29062021130726
173;125;29062021130726
174;123;29062021130726
175;122;29062021130726
176;124;29062021130726
177;122;29062021130726
178;124;29062021130726
179;123;29062021130726
180;121;29062021130726
181;124;29062021130726
182;122;29062021130726
183;120;29062021130726
184;123;29062021130726
185;120;29062021130726
186;123;29062021130726
187;121;29062021130726
188;120;29062021130726
189;122;29062021130726
190;121;29062021130726
191;120;29062021130726
192;124;29062021130726
193;120;29062021130726
194;121;29062021130726
195;121;29062021130726
196;120;29062021130726
197;122;29062021130726
198;121;29062021130726
199;119;29062021130726
200;0;29062021130726
0;0;29062021130726
1;141;29062021130726
2;134;29062021130726
3;132;29062021130726
4;133;29062021130726
5;135;29062021130726
6;135;29062021130726
7;137;29062021130726
8;139;29062021130726
9;139;29062021130726
10;144;29062021130726
11;143;29062021130726
12;145;29062021130726
13;152;29062021130726
14;155;29062021130726
15;164;29062021130726
16;177;29062021130726
17;202;29062021130726
18;255;29062021130726
19;363;29062021130726
20;608;29062021130726
21;1023;29062021130726
22;1023;29062021130726
23;1023;29062021130726
24;1023;29062021130726
25;1023;29062021130726
26;1023;29062021130726
27;1023;29062021130726
28;1023;29062021130726
29;1023;29062021130726
30;1023;29062021130726
31;1023;29062021130726
32;1023;29062021130726
33;1023;29062021130726
34;1023;29062021130726
35;1023;29062021130726
36;1023;29062021130726
37;1023;29062021130726
38;963;29062021130726
39;812;29062021130726
40;678;29062021130726
41;591;29062021130726
42;528;29062021130726
43;487;29062021130726
44;465;29062021130726
45;448;29062021130726
46;433;29062021130726
47;429;29062021130726
48;425;29062021130726
49;427;29062021130726
50;430;29062021130726
51;433;29062021130726
52;438;29062021130726
53;452;29062021130726
54;455;29062021130726
55;466;29062021130726
56;478;29062021130726
57;489;29062021130726
58;501;29062021130726
59;512;29062021130726
60;528;29062021130726
61;542;29062021130726
62;549;29062021130726
63;565;29062021130726
64;574;29062021130726
65;571;29062021130726
66;578;29062021130726
67;576;29062021130726
68;569;29062021130726
69;567;29062021130726
70;552;29062021130726
71;548;29062021130726
72;539;29062021130726
73;517;29062021130726
74;506;29062021130726
75;490;29062021130726
76;481;29062021130726
77;465;29062021130726
78;449;29062021130726
79;434;29062021130726
80;416;29062021130726
81;404;29062021130726
82;394;29062021130726
83;384;29062021130726
84;375;29062021130726
85;368;29062021130726
86;360;29062021130726
87;359;29062021130726
88;357;29062021130726
89;349;29062021130726
90;343;29062021130726
91;337;29062021130726
92;322;29062021130726
93;319;29062021130726
94;309;29062021130726
95;301;29062021130726
96;295;29062021130726
97;286;29062021130726
98;279;29062021130726
99;270;29062021130726
100;264;29062021130726
101;262;29062021130726
102;256;29062021130726
103;249;29062021130726
104;245;29062021130726
105;237;29062021130726
106;237;29062021130726
107;230;29062021130726
108;225;29062021130726
109;223;29062021130726
110;215;29062021130726
111;212;29062021130726
112;210;29062021130726
113;203;29062021130726
114;202;29062021130726
115;201;29062021130726
116;196;29062021130726
117;196;29062021130726
118;191;29062021130726
119;189;29062021130726
120;186;29062021130726
121;183;29062021130726
122;182;29062021130726
123;179;29062021130726
124;175;29062021130726
125;175;29062021130726
126;169;29062021130726
127;170;29062021130726
128;169;29062021130726
129;165;29062021130726
130;163;29062021130726
131;163;29062021130726
132;158;29062021130726
133;159;29062021130726
134;155;29062021130726
135;153;29062021130726
136;154;29062021130726
137;149;29062021130726
138;149;29062021130726
139;149;29062021130726
140;145;29062021130726
141;146;29062021130726
142;143;29062021130726
143;141;29062021130726
144;142;29062021130726
145;139;29062021130726
146;140;29062021130726
147;138;29062021130726
148;136;29062021130726
149;136;29062021130726
150;136;29062021130726
151;134;29062021130726
152;135;29062021130726
153;132;29062021130726
154;133;29062021130726
155;132;29062021130726
156;131;29062021130726
157;131;29062021130726
158;129;29062021130726
159;129;29062021130726
160;131;29062021130726
161;127;29062021130726
162;130;29062021130726
163;129;29062021130726
164;126;29062021130726
165;128;29062021130726
166;127;29062021130726
167;127;29062021130726
168;128;29062021130726
169;125;29062021130726
170;127;29062021130726
171;125;29062021130726
172;124;29062021130726
173;125;29062021130726
174;124;29062021130726
175;124;29062021130726
176;125;29062021130726
177;122;29062021130726
178;124;29062021130726
179;124;29062021130726
180;122;29062021130726
181;124;29062021130726
182;122;29062021130726
183;122;29062021130726
184;123;29062021130726
185;119;29062021130726
186;123;29062021130726
187;123;29062021130726
188;121;29062021130726
189;123;29062021130726
190;120;29062021130726
191;121;29062021130726
192;124;29062021130726
193;121;29062021130726
194;121;29062021130726
195;121;29062021130726
196;120;29062021130726
197;122;29062021130726
198;121;29062021130726
199;120;29062021130726
200;0;29062021130726
0;0;29062021130727
1;141;29062021130727
2;133;29062021130727
3;133;29062021130727
4;135;29062021130727
5;136;29062021130727
6;134;29062021130727
7;136;29062021130727
8;139;29062021130727
9;137;29062021130727
10;143;29062021130727
11;143;29062021130727
12;146;29062021130727
13;151;29062021130727
14;155;29062021130727
15;165;29062021130727
16;178;29062021130727
17;201;29062021130727
18;253;29062021130727
19;363;29062021130727
20;609;29062021130727
21;1023;29062021130727
22;1023;29062021130727
23;1023;29062021130727
24;1023;29062021130727
25;1023;29062021130727
26;1023;29062021130727
27;1023;29062021130727
28;1023;29062021130727
29;1023;29062021130727
30;1023;29062021130727
31;1023;29062021130727
32;1023;29062021130727
33;1023;29062021130727
34;1023;29062021130727
35;1023;29062021130727
36;1023;29062021130727
37;1023;29062021130727
38;965;29062021130727
39;811;29062021130727
40;677;29062021130727
41;587;29062021130727
42;535;29062021130727
43;488;29062021130727
44;461;29062021130727
45;445;29062021130727
46;430;29062021130727
47;428;29062021130727
48;428;29062021130727
49;425;29062021130727
50;431;29062021130727
51;435;29062021130727
52;436;29062021130727
53;447;29062021130727
54;460;29062021130727
55;465;29062021130727
56;475;29062021130727
57;486;29062021130727
58;502;29062021130727
59;515;29062021130727
60;532;29062021130727
61;543;29062021130727
62;548;29062021130727
63;566;29062021130727
64;570;29062021130727
65;573;29062021130727
66;583;29062021130727
67;577;29062021130727
68;572;29062021130727
69;568;29062021130727
70;556;29062021130727
71;548;29062021130727
72;539;29062021130727
73;524;29062021130727
74;513;29062021130727
75;489;29062021130727
76;475;29062021130727
77;468;29062021130727
78;444;29062021130727
79;436;29062021130727
80;416;29062021130727
81;401;29062021130727
82;393;29062021130727
83;384;29062021130727
84;376;29062021130727
85;371;29062021130727
86;362;29062021130727
87;358;29062021130727
88;356;29062021130727
89;349;29062021130727
90;343;29062021130727
91;341;29062021130727
92;322;29062021130727
93;318;29062021130727
94;306;29062021130727
95;299;29062021130727
96;292;29062021130727
97;286;29062021130727
98;278;29062021130727
99;272;29062021130727
100;266;29062021130727
101;262;29062021130727
102;255;29062021130727
103;251;29062021130727
104;244;29062021130727
105;239;29062021130727
106;239;29062021130727
107;231;29062021130727
108;227;29062021130727
109;222;29062021130727
110;215;29062021130727
111;212;29062021130727
112;210;29062021130727
113;206;29062021130727
114;202;29062021130727
115;201;29062021130727
116;197;29062021130727
117;198;29062021130727
118;190;29062021130727
119;189;29062021130727
120;185;29062021130727
121;183;29062021130727
122;182;29062021130727
123;179;29062021130727
124;176;29062021130727
125;174;29062021130727
126;171;29062021130727
127;167;29062021130727
128;170;29062021130727
129;162;29062021130727
130;163;29062021130727
131;162;29062021130727
132;158;29062021130727
133;159;29062021130727
134;154;29062021130727
135;153;29062021130727
136;154;29062021130727
137;149;29062021130727
138;150;29062021130727
139;147;29062021130727
140;145;29062021130727
141;146;29062021130727
142;143;29062021130727
143;140;29062021130727
144;142;29062021130727
145;140;29062021130727
146;141;29062021130727
147;139;29062021130727
148;138;29062021130727
149;136;29062021130727
150;136;29062021130727
151;136;29062021130727
152;134;29062021130727
153;133;29062021130727
154;133;29062021130727
155;131;29062021130727
156;130;29062021130727
157;130;29062021130727
158;128;29062021130727
159;129;29062021130727
160;130;29062021130727
161;129;29062021130727
162;130;29062021130727
163;129;29062021130727
164;127;29062021130727
165;128;29062021130727
166;127;29062021130727
167;126;29062021130727
168;127;29062021130727
169;123;29062021130727
170;126;29062021130727
171;126;29062021130727
172;123;29062021130727
173;126;29062021130727
174;124;29062021130727
175;123;29062021130727
176;124;29062021130727
177;122;29062021130727
178;124;29062021130727
179;123;29062021130727
180;123;29062021130727
181;124;29062021130727
182;123;29062021130727
183;121;29062021130727
184;123;29062021130727
185;120;29062021130727
186;124;29062021130727
187;122;29062021130727
188;120;29062021130727
189;121;29062021130727
190;121;29062021130727
191;120;29062021130727
192;125;29062021130727
193;121;29062021130727
194;121;29062021130727
195;121;29062021130727
196;119;29062021130727
197;120;29062021130727
198;121;29062021130727
199;120;29062021130727
200;0;29062021130727
0;0;29062021130729
1;141;29062021130729
2;134;29062021130729
3;132;29062021130729
4;134;29062021130729
5;134;29062021130729
6;134;29062021130729
7;136;29062021130729
8;137;29062021130729
9;139;29062021130729
10;143;29062021130729
11;144;29062021130729
12;145;29062021130729
13;151;29062021130729
14;154;29062021130729
15;163;29062021130729
16;178;29062021130729
17;203;29062021130729
18;257;29062021130729
19;366;29062021130729
20;609;29062021130729
21;1023;29062021130729
22;1023;29062021130729
23;1023;29062021130729
24;1023;29062021130729
25;1023;29062021130729
26;1023;29062021130729
27;1023;29062021130729
28;1023;29062021130729
29;1023;29062021130729
30;1023;29062021130729
31;1023;29062021130729
32;1023;29062021130729
33;1023;29062021130729
34;1023;29062021130729
35;1023;29062021130729
36;1023;29062021130729
37;1023;29062021130729
38;960;29062021130729
39;810;29062021130729
40;678;29062021130729
41;585;29062021130729
42;533;29062021130729
43;483;29062021130729
44;464;29062021130729
45;443;29062021130729
46;432;29062021130729
47;427;29062021130729
48;428;29062021130729
49;430;29062021130729
50;430;29062021130729
51;435;29062021130729
52;437;29062021130729
53;452;29062021130729
54;457;29062021130729
55;466;29062021130729
56;479;29062021130729
57;487;29062021130729
58;504;29062021130729
59;514;29062021130729
60;533;29062021130729
61;543;29062021130729
62;551;29062021130729
63;561;29062021130729
64;572;29062021130729
65;575;29062021130729
66;580;29062021130729
67;577;29062021130729
68;569;29062021130729
69;566;29062021130729
70;558;29062021130729
71;549;29062021130729
72;542;29062021130729
73;520;29062021130729
74;510;29062021130729
75;488;29062021130729
76;477;29062021130729
77;464;29062021130729
78;449;29062021130729
79;434;29062021130729
80;420;29062021130729
81;401;29062021130729
82;398;29062021130729
83;382;29062021130729
84;377;29062021130729
85;368;29062021130729
86;364;29062021130729
87;360;29062021130729
88;356;29062021130729
89;348;29062021130729
90;347;29062021130729
91;338;29062021130729
92;327;29062021130729
93;317;29062021130729
94;308;29062021130729
95;300;29062021130729
96;292;29062021130729
97;285;29062021130729
98;280;29062021130729
99;274;29062021130729
100;264;29062021130729
101;263;29062021130729
102;256;29062021130729
103;251;29062021130729
104;245;29062021130729
105;239;29062021130729
106;237;29062021130729
107;230;29062021130729
108;226;29062021130729
109;223;29062021130729
110;217;29062021130729
111;212;29062021130729
112;211;29062021130729
113;203;29062021130729
114;202;29062021130729
115;201;29062021130729
116;199;29062021130729
117;198;29062021130729
118;191;29062021130729
119;190;29062021130729
120;185;29062021130729
121;183;29062021130729
122;182;29062021130729
123;178;29062021130729
124;174;29062021130729
125;174;29062021130729
126;170;29062021130729
127;168;29062021130729
128;168;29062021130729
129;163;29062021130729
130;163;29062021130729
131;161;29062021130729
132;158;29062021130729
133;161;29062021130729
134;155;29062021130729
135;152;29062021130729
136;152;29062021130729
137;149;29062021130729
138;149;29062021130729
139;148;29062021130729
140;146;29062021130729
141;147;29062021130729
142;142;29062021130729
143;141;29062021130729
144;142;29062021130729
145;138;29062021130729
146;139;29062021130729
147;138;29062021130729
148;137;29062021130729
149;136;29062021130729
150;135;29062021130729
151;135;29062021130729
152;134;29062021130729
153;133;29062021130729
154;135;29062021130729
155;132;29062021130729
156;130;29062021130729
157;131;29062021130729
158;129;29062021130729
159;129;29062021130729
160;130;29062021130729
161;128;29062021130729
162;130;29062021130729
163;129;29062021130729
164;127;29062021130729
165;129;29062021130729
166;127;29062021130729
167;127;29062021130729
168;127;29062021130729
169;124;29062021130729
170;126;29062021130729
171;125;29062021130729
172;125;29062021130729
173;125;29062021130729
174;124;29062021130729
175;123;29062021130729
176;124;29062021130729
177;122;29062021130729
178;124;29062021130729
179;124;29062021130729
180;123;29062021130729
181;124;29062021130729
182;124;29062021130729
183;122;29062021130729
184;124;29062021130729
185;120;29062021130729
186;124;29062021130729
187;122;29062021130729
188;120;29062021130729
189;122;29062021130729
190;120;29062021130729
191;121;29062021130729
192;124;29062021130729
193;121;29062021130729
194;121;29062021130729
195;120;29062021130729
196;120;29062021130729
197;122;29062021130729
198;121;29062021130729
199;121;29062021130729
200;0;29062021130729
0;0;29062021130729
1;141;29062021130729
2;134;29062021130729
3;132;29062021130729
4;133;29062021130729
5;135;29062021130729
6;133;29062021130729
7;136;29062021130729
8;138;29062021130729
9;138;29062021130729
10;142;29062021130729
11;142;29062021130729
12;143;29062021130729
13;151;29062021130729
14;155;29062021130729
15;165;29062021130729
16;178;29062021130729
17;201;29062021130729
18;256;29062021130729
19;361;29062021130729
20;606;29062021130729
21;1023;29062021130729
22;1023;29062021130729
23;1023;29062021130729
24;1023;29062021130729
25;1022;29062021130729
26;1023;29062021130729
27;1023;29062021130729
28;1023;29062021130729
29;1023;29062021130729
30;1023;29062021130729
31;1023;29062021130729
32;1023;29062021130729
33;1023;29062021130729
34;1023;29062021130729
35;1023;29062021130729
36;1023;29062021130729
37;1023;29062021130729
38;968;29062021130729
39;815;29062021130729
40;685;29062021130729
41;591;29062021130729
42;534;29062021130729
43;491;29062021130729
44;461;29062021130729
45;445;29062021130729
46;433;29062021130729
47;430;29062021130729
48;429;29062021130729
49;424;29062021130729
50;429;29062021130729
51;439;29062021130729
52;436;29062021130729
53;451;29062021130729
54;454;29062021130729
55;462;29062021130729
56;475;29062021130729
57;487;29062021130729
58;505;29062021130729
59;512;29062021130729
60;529;29062021130729
61;545;29062021130729
62;552;29062021130729
63;562;29062021130729
64;571;29062021130729
65;572;29062021130729
66;578;29062021130729
67;573;29062021130729
68;570;29062021130729
69;570;29062021130729
70;555;29062021130729
71;549;29062021130729
72;538;29062021130729
73;518;29062021130729
74;509;29062021130729
75;491;29062021130729
76;478;29062021130729
77;466;29062021130729
78;452;29062021130729
79;435;29062021130729
80;418;29062021130729
81;401;29062021130729
82;394;29062021130729
83;379;29062021130729
84;374;29062021130729
85;371;29062021130729
86;366;29062021130729
87;362;29062021130729
88;357;29062021130729
89;348;29062021130729
90;344;29062021130729
91;339;29062021130729
92;328;29062021130729
93;319;29062021130729
94;311;29062021130729
95;300;29062021130729
96;294;29062021130729
97;286;29062021130729
98;280;29062021130729
99;273;29062021130729
100;263;29062021130729
101;263;29062021130729
102;257;29062021130729
103;250;29062021130729
104;244;29062021130729
105;235;29062021130729
106;238;29062021130729
107;231;29062021130729
108;227;29062021130729
109;223;29062021130729
110;216;29062021130729
111;211;29062021130729
112;212;29062021130729
113;204;29062021130729
114;204;29062021130729
115;201;29062021130729
116;197;29062021130729
117;197;29062021130729
118;191;29062021130729
119;190;29062021130729
120;186;29062021130729
121;184;29062021130729
122;181;29062021130729
123;178;29062021130729
124;174;29062021130729
125;175;29062021130729
126;170;29062021130729
127;169;29062021130729
128;167;29062021130729
129;163;29062021130729
130;163;29062021130729
131;162;29062021130729
132;156;29062021130729
133;161;29062021130729
134;154;29062021130729
135;152;29062021130729
136;154;29062021130729
137;149;29062021130729
138;151;29062021130729
139;147;29062021130729
140;144;29062021130729
141;145;29062021130729
142;142;29062021130729
143;143;29062021130729
144;142;29062021130729
145;139;29062021130729
146;141;29062021130729
147;139;29062021130729
148;137;29062021130729
149;137;29062021130729
150;136;29062021130729
151;136;29062021130729
152;134;29062021130729
153;132;29062021130729
154;135;29062021130729
155;131;29062021130729
156;131;29062021130729
157;131;29062021130729
158;129;29062021130729
159;129;29062021130729
160;130;29062021130729
161;128;29062021130729
162;129;29062021130729
163;128;29062021130729
164;128;29062021130729
165;129;29062021130729
166;127;29062021130729
167;126;29062021130729
168;127;29062021130729
169;124;29062021130729
170;125;29062021130729
171;124;29062021130729
172;123;29062021130729
173;125;29062021130729
174;124;29062021130729
175;123;29062021130729
176;124;29062021130729
177;122;29062021130729
178;124;29062021130729
179;122;29062021130729
180;122;29062021130729
181;123;29062021130729
182;124;29062021130729
183;122;29062021130729
184;123;29062021130729
185;120;29062021130729
186;124;29062021130729
187;122;29062021130729
188;119;29062021130729
189;122;29062021130729
190;119;29062021130729
191;120;29062021130729
192;123;29062021130729
193;121;29062021130729
194;121;29062021130729
195;122;29062021130729
196;119;29062021130729
197;121;29062021130729
198;121;29062021130729
199;119;29062021130729
200;0;29062021130729
0;0;29062021130730
1;141;29062021130730
2;134;29062021130730
3;132;29062021130730
4;134;29062021130730
5;135;29062021130730
6;133;29062021130730
7;137;29062021130730
8;137;29062021130730
9;138;29062021130730
10;143;29062021130730
11;143;29062021130730
12;145;29062021130730
13;151;29062021130730
14;155;29062021130730
15;165;29062021130730
16;179;29062021130730
17;201;29062021130730
18;256;29062021130730
19;365;29062021130730
20;609;29062021130730
21;1023;29062021130730
22;1023;29062021130730
23;1023;29062021130730
24;1023;29062021130730
25;1023;29062021130730
26;1023;29062021130730
27;1023;29062021130730
28;1023;29062021130730
29;1023;29062021130730
30;1023;29062021130730
31;1023;29062021130730
32;1023;29062021130730
33;1023;29062021130730
34;1023;29062021130730
35;1023;29062021130730
36;1023;29062021130730
37;1023;29062021130730
38;965;29062021130730
39;805;29062021130730
40;680;29062021130730
41;589;29062021130730
42;531;29062021130730
43;485;29062021130730
44;459;29062021130730
45;443;29062021130730
46;426;29062021130730
47;427;29062021130730
48;426;29062021130730
49;430;29062021130730
50;427;29062021130730
51;435;29062021130730
52;437;29062021130730
53;452;29062021130730
54;455;29062021130730
55;465;29062021130730
56;477;29062021130730
57;485;29062021130730
58;505;29062021130730
59;515;29062021130730
60;530;29062021130730
61;546;29062021130730
62;551;29062021130730
63;565;29062021130730
64;572;29062021130730
65;569;29062021130730
66;576;29062021130730
67;578;29062021130730
68;569;29062021130730
69;562;29062021130730
70;556;29062021130730
71;547;29062021130730
72;540;29062021130730
73;523;29062021130730
74;510;29062021130730
75;491;29062021130730
76;473;29062021130730
77;463;29062021130730
78;449;29062021130730
79;430;29062021130730
80;416;29062021130730
81;400;29062021130730
82;393;29062021130730
83;383;29062021130730
84;375;29062021130730
85;369;29062021130730
86;363;29062021130730
87;360;29062021130730
88;358;29062021130730
89;344;29062021130730
90;347;29062021130730
91;338;29062021130730
92;324;29062021130730
93;323;29062021130730
94;312;29062021130730
95;301;29062021130730
96;295;29062021130730
97;286;29062021130730
98;277;29062021130730
99;271;29062021130730
100;267;29062021130730
101;263;29062021130730
102;255;29062021130730
103;252;29062021130730
104;247;29062021130730
105;239;29062021130730
106;237;29062021130730
107;233;29062021130730
108;225;29062021130730
109;220;29062021130730
110;216;29062021130730
111;214;29062021130730
112;211;29062021130730
113;203;29062021130730
114;201;29062021130730
115;199;29062021130730
116;196;29062021130730
117;199;29062021130730
118;191;29062021130730
119;189;29062021130730
120;187;29062021130730
121;183;29062021130730
122;183;29062021130730
123;179;29062021130730
124;176;29062021130730
125;174;29062021130730
126;171;29062021130730
127;169;29062021130730
128;169;29062021130730
129;164;29062021130730
130;163;29062021130730
131;160;29062021130730
132;159;29062021130730
133;159;29062021130730
134;156;29062021130730
135;154;29062021130730
136;155;29062021130730
137;148;29062021130730
138;149;29062021130730
139;147;29062021130730
140;146;29062021130730
141;147;29062021130730
142;143;29062021130730
143;142;29062021130730
144;143;29062021130730
145;139;29062021130730
146;142;29062021130730
147;139;29062021130730
148;136;29062021130730
149;136;29062021130730
150;136;29062021130730
151;135;29062021130730
152;135;29062021130730
153;132;29062021130730
154;134;29062021130730
155;131;29062021130730
156;130;29062021130730
157;130;29062021130730
158;130;29062021130730
159;130;29062021130730
160;131;29062021130730
161;129;29062021130730
162;130;29062021130730
163;129;29062021130730
164;128;29062021130730
165;129;29062021130730
166;127;29062021130730
167;126;29062021130730
168;128;29062021130730
169;124;29062021130730
170;127;29062021130730
171;126;29062021130730
172;125;29062021130730
173;125;29062021130730
174;124;29062021130730
175;123;29062021130730
176;124;29062021130730
177;122;29062021130730
178;124;29062021130730
179;124;29062021130730
180;121;29062021130730
181;124;29062021130730
182;122;29062021130730
183;122;29062021130730
184;124;29062021130730
185;120;29062021130730
186;124;29062021130730
187;122;29062021130730
188;120;29062021130730
189;122;29062021130730
190;121;29062021130730
191;122;29062021130730
192;124;29062021130730
193;121;29062021130730
194;121;29062021130730
195;121;29062021130730
196;120;29062021130730
197;121;29062021130730
198;121;29062021130730
199;120;29062021130730
200;0;29062021130730
0;0;29062021130731
1;141;29062021130731
2;134;29062021130731
3;133;29062021130731
4;133;29062021130731
5;135;29062021130731
6;133;29062021130731
7;137;29062021130731
8;139;29062021130731
9;137;29062021130731
10;143;29062021130731
11;142;29062021130731
12;145;29062021130731
13;152;29062021130731
14;155;29062021130731
15;166;29062021130731
16;177;29062021130731
17;201;29062021130731
18;257;29062021130731
19;362;29062021130731
20;610;29062021130731
21;1023;29062021130731
22;1023;29062021130731
23;1023;29062021130731
24;1023;29062021130731
25;1023;29062021130731
26;1023;29062021130731
27;1023;29062021130731
28;1023;29062021130731
29;1023;29062021130731
30;1023;29062021130731
31;1023;29062021130731
32;1023;29062021130731
33;1023;29062021130731
34;1023;29062021130731
35;1023;29062021130731
36;1023;29062021130731
37;1023;29062021130731
38;964;29062021130731
39;811;29062021130731
40;679;29062021130731
41;585;29062021130731
42;534;29062021130731
43;485;29062021130731
44;462;29062021130731
45;440;29062021130731
46;426;29062021130731
47;427;29062021130731
48;428;29062021130731
49;424;29062021130731
50;429;29062021130731
51;433;29062021130731
52;437;29062021130731
53;449;29062021130731
54;454;29062021130731
55;459;29062021130731
56;477;29062021130731
57;487;29062021130731
58;506;29062021130731
59;517;29062021130731
60;529;29062021130731
61;540;29062021130731
62;549;29062021130731
63;565;29062021130731
64;570;29062021130731
65;573;29062021130731
66;575;29062021130731
67;576;29062021130731
68;569;29062021130731
69;568;29062021130731
70;554;29062021130731
71;544;29062021130731
72;535;29062021130731
73;519;29062021130731
74;509;29062021130731
75;487;29062021130731
76;474;29062021130731
77;461;29062021130731
78;448;29062021130731
79;433;29062021130731
80;416;29062021130731
81;401;29062021130731
82;393;29062021130731
83;378;29062021130731
84;374;29062021130731
85;371;29062021130731
86;364;29062021130731
87;359;29062021130731
88;359;29062021130731
89;345;29062021130731
90;345;29062021130731
91;337;29062021130731
92;325;29062021130731
93;319;29062021130731
94;310;29062021130731
95;300;29062021130731
96;293;29062021130731
97;285;29062021130731
98;277;29062021130731
99;274;29062021130731
100;266;29062021130731
101;263;29062021130731
102;255;29062021130731
103;250;29062021130731
104;243;29062021130731
105;239;29062021130731
106;239;29062021130731
107;230;29062021130731
108;224;29062021130731
109;223;29062021130731
110;216;29062021130731
111;213;29062021130731
112;211;29062021130731
113;204;29062021130731
114;202;29062021130731
115;200;29062021130731
116;197;29062021130731
117;197;29062021130731
118;191;29062021130731
119;190;29062021130731
120;184;29062021130731
121;182;29062021130731
122;183;29062021130731
123;178;29062021130731
124;176;29062021130731
125;176;29062021130731
126;169;29062021130731
127;167;29062021130731
128;168;29062021130731
129;163;29062021130731
130;162;29062021130731
131;161;29062021130731
132;157;29062021130731
133;160;29062021130731
134;155;29062021130731
135;154;29062021130731
136;154;29062021130731
137;149;29062021130731
138;151;29062021130731
139;148;29062021130731
140;146;29062021130731
141;147;29062021130731
142;142;29062021130731
143;140;29062021130731
144;142;29062021130731
145;138;29062021130731
146;141;29062021130731
147;139;29062021130731
148;136;29062021130731
149;136;29062021130731
150;135;29062021130731
151;136;29062021130731
152;134;29062021130731
153;132;29062021130731
154;134;29062021130731
155;132;29062021130731
156;131;29062021130731
157;131;29062021130731
158;129;29062021130731
159;129;29062021130731
160;130;29062021130731
161;128;29062021130731
162;130;29062021130731
163;128;29062021130731
164;126;29062021130731
165;129;29062021130731
166;126;29062021130731
167;127;29062021130731
168;127;29062021130731
169;123;29062021130731
170;125;29062021130731
171;125;29062021130731
172;125;29062021130731
173;126;29062021130731
174;124;29062021130731
175;123;29062021130731
176;124;29062021130731
177;122;29062021130731
178;123;29062021130731
179;123;29062021130731
180;122;29062021130731
181;123;29062021130731
182;122;29062021130731
183;122;29062021130731
184;123;29062021130731
185;121;29062021130731
186;124;29062021130731
187;122;29062021130731
188;120;29062021130731
189;122;29062021130731
190;121;29062021130731
191;120;29062021130731
192;124;29062021130731
193;120;29062021130731
194;121;29062021130731
195;122;29062021130731
196;120;29062021130731
197;122;29062021130731
198;122;29062021130731
199;120;29062021130731
200;0;29062021130731
