ind;val;datetime
0;0;30062021114023
1;148;30062021114023
2;135;30062021114023
3;133;30062021114023
4;135;30062021114023
5;137;30062021114023
6;135;30062021114023
7;137;30062021114023
8;139;30062021114023
9;136;30062021114023
10;142;30062021114023
11;142;30062021114023
12;143;30062021114023
13;148;30062021114023
14;150;30062021114023
15;157;30062021114023
16;166;30062021114023
17;185;30062021114023
18;222;30062021114023
19;307;30062021114023
20;480;30062021114023
21;899;30062021114023
22;1023;30062021114023
23;1023;30062021114023
24;1023;30062021114023
25;1023;30062021114023
26;1023;30062021114023
27;1023;30062021114023
28;1023;30062021114023
29;1023;30062021114023
30;1023;30062021114023
31;1023;30062021114023
32;1023;30062021114023
33;1023;30062021114023
34;1023;30062021114023
35;933;30062021114023
36;713;30062021114023
37;552;30062021114023
38;446;30062021114023
39;371;30062021114023
40;321;30062021114023
41;287;30062021114023
42;271;30062021114023
43;257;30062021114023
44;251;30062021114023
45;248;30062021114023
46;245;30062021114023
47;241;30062021114023
48;240;30062021114023
49;237;30062021114023
50;237;30062021114023
51;233;30062021114023
52;233;30062021114023
53;237;30062021114023
54;234;30062021114023
55;235;30062021114023
56;239;30062021114023
57;244;30062021114023
58;249;30062021114023
59;250;30062021114023
60;252;30062021114023
61;260;30062021114023
62;256;30062021114023
63;260;30062021114023
64;263;30062021114023
65;260;30062021114023
66;264;30062021114023
67;260;30062021114023
68;261;30062021114023
69;260;30062021114023
70;251;30062021114023
71;249;30062021114023
72;248;30062021114023
73;241;30062021114023
74;241;30062021114023
75;233;30062021114023
76;228;30062021114023
77;224;30062021114023
78;218;30062021114023
79;218;30062021114023
80;212;30062021114023
81;207;30062021114023
82;206;30062021114023
83;201;30062021114023
84;198;30062021114023
85;197;30062021114023
86;194;30062021114023
87;194;30062021114023
88;194;30062021114023
89;188;30062021114023
90;190;30062021114023
91;185;30062021114023
92;180;30062021114023
93;184;30062021114023
94;178;30062021114023
95;173;30062021114023
96;175;30062021114023
97;172;30062021114023
98;170;30062021114023
99;166;30062021114023
100;165;30062021114023
101;166;30062021114023
102;164;30062021114023
103;162;30062021114023
104;160;30062021114023
105;157;30062021114023
106;159;30062021114023
107;156;30062021114023
108;155;30062021114023
109;155;30062021114023
110;151;30062021114023
111;150;30062021114023
112;152;30062021114023
113;148;30062021114023
114;149;30062021114023
115;150;30062021114023
116;146;30062021114023
117;149;30062021114023
118;144;30062021114023
119;145;30062021114023
120;144;30062021114023
121;142;30062021114023
122;143;30062021114023
123;142;30062021114023
124;140;30062021114023
125;141;30062021114023
126;139;30062021114023
127;139;30062021114023
128;141;30062021114023
129;137;30062021114023
130;138;30062021114023
131;140;30062021114023
132;135;30062021114023
133;139;30062021114023
134;135;30062021114023
135;134;30062021114023
136;137;30062021114023
137;133;30062021114023
138;135;30062021114023
139;133;30062021114023
140;132;30062021114023
141;135;30062021114023
142;131;30062021114023
143;132;30062021114023
144;133;30062021114023
145;129;30062021114023
146;132;30062021114023
147;131;30062021114023
148;130;30062021114023
149;131;30062021114023
150;130;30062021114023
151;131;30062021114023
152;130;30062021114023
153;128;30062021114023
154;130;30062021114023
155;129;30062021114023
156;128;30062021114023
157;129;30062021114023
158;128;30062021114023
159;128;30062021114023
160;129;30062021114023
161;126;30062021114023
162;129;30062021114023
163;128;30062021114023
164;129;30062021114023
165;129;30062021114023
166;128;30062021114023
167;128;30062021114023
168;129;30062021114023
169;125;30062021114023
170;128;30062021114023
171;127;30062021114023
172;127;30062021114023
173;128;30062021114023
174;127;30062021114023
175;126;30062021114023
176;128;30062021114023
177;126;30062021114023
178;128;30062021114023
179;127;30062021114023
180;126;30062021114023
181;127;30062021114023
182;127;30062021114023
183;126;30062021114023
184;127;30062021114023
185;125;30062021114023
186;128;30062021114023
187;126;30062021114023
188;125;30062021114023
189;127;30062021114023
190;126;30062021114023
191;126;30062021114023
192;130;30062021114023
193;126;30062021114023
194;127;30062021114023
195;127;30062021114023
196;126;30062021114023
197;126;30062021114023
198;126;30062021114023
199;126;30062021114023
200;0;30062021114023
0;0;30062021114023
1;148;30062021114023
2;136;30062021114023
3;134;30062021114023
4;136;30062021114023
5;137;30062021114023
6;134;30062021114023
7;137;30062021114023
8;139;30062021114023
9;137;30062021114023
10;141;30062021114023
11;140;30062021114023
12;141;30062021114023
13;148;30062021114023
14;150;30062021114023
15;158;30062021114023
16;167;30062021114023
17;184;30062021114023
18;224;30062021114023
19;304;30062021114023
20;481;30062021114023
21;888;30062021114023
22;1023;30062021114023
23;1023;30062021114023
24;1023;30062021114023
25;1023;30062021114023
26;1023;30062021114023
27;1023;30062021114023
28;1023;30062021114023
29;1023;30062021114023
30;1023;30062021114023
31;1023;30062021114023
32;1023;30062021114023
33;1023;30062021114023
34;1023;30062021114023
35;944;30062021114023
36;719;30062021114023
37;555;30062021114023
38;447;30062021114023
39;374;30062021114023
40;323;30062021114023
41;289;30062021114023
42;270;30062021114023
43;257;30062021114023
44;253;30062021114023
45;250;30062021114023
46;244;30062021114023
47;241;30062021114023
48;243;30062021114023
49;236;30062021114023
50;236;30062021114023
51;234;30062021114023
52;232;30062021114023
53;236;30062021114023
54;233;30062021114023
55;239;30062021114023
56;241;30062021114023
57;243;30062021114023
58;247;30062021114023
59;252;30062021114023
60;253;30062021114023
61;257;30062021114023
62;258;30062021114023
63;262;30062021114023
64;265;30062021114023
65;264;30062021114023
66;264;30062021114023
67;262;30062021114023
68;260;30062021114023
69;260;30062021114023
70;252;30062021114023
71;250;30062021114023
72;247;30062021114023
73;240;30062021114023
74;239;30062021114023
75;232;30062021114023
76;229;30062021114023
77;226;30062021114023
78;221;30062021114023
79;216;30062021114023
80;213;30062021114023
81;207;30062021114023
82;206;30062021114023
83;200;30062021114023
84;198;30062021114023
85;196;30062021114023
86;194;30062021114023
87;193;30062021114023
88;193;30062021114023
89;191;30062021114023
90;191;30062021114023
91;185;30062021114023
92;181;30062021114023
93;183;30062021114023
94;179;30062021114023
95;177;30062021114023
96;176;30062021114023
97;171;30062021114023
98;169;30062021114023
99;169;30062021114023
100;167;30062021114023
101;167;30062021114023
102;163;30062021114023
103;161;30062021114023
104;161;30062021114023
105;157;30062021114023
106;158;30062021114023
107;155;30062021114023
108;153;30062021114023
109;154;30062021114023
110;152;30062021114023
111;151;30062021114023
112;152;30062021114023
113;147;30062021114023
114;148;30062021114023
115;149;30062021114023
116;146;30062021114023
117;148;30062021114023
118;145;30062021114023
119;146;30062021114023
120;144;30062021114023
121;141;30062021114023
122;143;30062021114023
123;142;30062021114023
124;141;30062021114023
125;141;30062021114023
126;139;30062021114023
127;139;30062021114023
128;140;30062021114023
129;137;30062021114023
130;138;30062021114023
131;137;30062021114023
132;135;30062021114023
133;139;30062021114023
134;134;30062021114023
135;134;30062021114023
136;135;30062021114023
137;133;30062021114023
138;135;30062021114023
139;133;30062021114023
140;132;30062021114023
141;134;30062021114023
142;131;30062021114023
143;132;30062021114023
144;133;30062021114023
145;130;30062021114023
146;133;30062021114023
147;132;30062021114023
148;130;30062021114023
149;131;30062021114023
150;130;30062021114023
151;131;30062021114023
152;130;30062021114023
153;127;30062021114023
154;129;30062021114023
155;129;30062021114023
156;128;30062021114023
157;129;30062021114023
158;128;30062021114023
159;128;30062021114023
160;129;30062021114023
161;128;30062021114023
162;129;30062021114023
163;129;30062021114023
164;128;30062021114023
165;129;30062021114023
166;126;30062021114023
167;128;30062021114023
168;129;30062021114023
169;125;30062021114023
170;128;30062021114023
171;127;30062021114023
172;128;30062021114023
173;128;30062021114023
174;126;30062021114023
175;126;30062021114023
176;128;30062021114023
177;126;30062021114023
178;128;30062021114023
179;128;30062021114023
180;127;30062021114023
181;128;30062021114023
182;127;30062021114023
183;126;30062021114023
184;127;30062021114023
185;125;30062021114023
186;128;30062021114023
187;126;30062021114023
188;125;30062021114023
189;127;30062021114023
190;125;30062021114023
191;126;30062021114023
192;130;30062021114023
193;126;30062021114023
194;126;30062021114023
195;127;30062021114023
196;125;30062021114023
197;127;30062021114023
198;128;30062021114023
199;126;30062021114023
200;0;30062021114023
0;0;30062021114024
1;148;30062021114024
2;135;30062021114024
3;134;30062021114024
4;134;30062021114024
5;136;30062021114024
6;135;30062021114024
7;137;30062021114024
8;139;30062021114024
9;138;30062021114024
10;142;30062021114024
11;141;30062021114024
12;142;30062021114024
13;149;30062021114024
14;150;30062021114024
15;158;30062021114024
16;167;30062021114024
17;183;30062021114024
18;224;30062021114024
19;306;30062021114024
20;479;30062021114024
21;888;30062021114024
22;1023;30062021114024
23;1023;30062021114024
24;1023;30062021114024
25;1023;30062021114024
26;1023;30062021114024
27;1023;30062021114024
28;1023;30062021114024
29;1023;30062021114024
30;1023;30062021114024
31;1023;30062021114024
32;1023;30062021114024
33;1023;30062021114024
34;1023;30062021114024
35;947;30062021114024
36;722;30062021114024
37;549;30062021114024
38;446;30062021114024
39;375;30062021114024
40;321;30062021114024
41;287;30062021114024
42;271;30062021114024
43;257;30062021114024
44;252;30062021114024
45;247;30062021114024
46;243;30062021114024
47;242;30062021114024
48;241;30062021114024
49;237;30062021114024
50;238;30062021114024
51;236;30062021114024
52;232;30062021114024
53;237;30062021114024
54;236;30062021114024
55;237;30062021114024
56;241;30062021114024
57;244;30062021114024
58;248;30062021114024
59;250;30062021114024
60;253;30062021114024
61;259;30062021114024
62;258;30062021114024
63;261;30062021114024
64;264;30062021114024
65;261;30062021114024
66;265;30062021114024
67;261;30062021114024
68;259;30062021114024
69;260;30062021114024
70;254;30062021114024
71;249;30062021114024
72;249;30062021114024
73;240;30062021114024
74;241;30062021114024
75;231;30062021114024
76;230;30062021114024
77;226;30062021114024
78;221;30062021114024
79;217;30062021114024
80;212;30062021114024
81;206;30062021114024
82;206;30062021114024
83;200;30062021114024
84;200;30062021114024
85;199;30062021114024
86;195;30062021114024
87;193;30062021114024
88;195;30062021114024
89;186;30062021114024
90;189;30062021114024
91;185;30062021114024
92;182;30062021114024
93;183;30062021114024
94;180;30062021114024
95;175;30062021114024
96;175;30062021114024
97;170;30062021114024
98;169;30062021114024
99;167;30062021114024
100;166;30062021114024
101;167;30062021114024
102;163;30062021114024
103;160;30062021114024
104;161;30062021114024
105;156;30062021114024
106;159;30062021114024
107;157;30062021114024
108;155;30062021114024
109;156;30062021114024
110;151;30062021114024
111;151;30062021114024
112;152;30062021114024
113;148;30062021114024
114;149;30062021114024
115;150;30062021114024
116;146;30062021114024
117;149;30062021114024
118;145;30062021114024
119;144;30062021114024
120;142;30062021114024
121;142;30062021114024
122;143;30062021114024
123;142;30062021114024
124;140;30062021114024
125;141;30062021114024
126;139;30062021114024
127;140;30062021114024
128;140;30062021114024
129;137;30062021114024
130;138;30062021114024
131;136;30062021114024
132;134;30062021114024
133;139;30062021114024
134;135;30062021114024
135;135;30062021114024
136;136;30062021114024
137;133;30062021114024
138;134;30062021114024
139;133;30062021114024
140;132;30062021114024
141;133;30062021114024
142;132;30062021114024
143;131;30062021114024
144;132;30062021114024
145;129;30062021114024
146;133;30062021114024
147;132;30062021114024
148;130;30062021114024
149;130;30062021114024
150;130;30062021114024
151;130;30062021114024
152;130;30062021114024
153;128;30062021114024
154;130;30062021114024
155;129;30062021114024
156;128;30062021114024
157;129;30062021114024
158;128;30062021114024
159;127;30062021114024
160;128;30062021114024
161;127;30062021114024
162;130;30062021114024
163;129;30062021114024
164;127;30062021114024
165;129;30062021114024
166;128;30062021114024
167;128;30062021114024
168;129;30062021114024
169;126;30062021114024
170;129;30062021114024
171;128;30062021114024
172;128;30062021114024
173;128;30062021114024
174;127;30062021114024
175;126;30062021114024
176;127;30062021114024
177;126;30062021114024
178;129;30062021114024
179;127;30062021114024
180;126;30062021114024
181;127;30062021114024
182;127;30062021114024
183;127;30062021114024
184;128;30062021114024
185;124;30062021114024
186;128;30062021114024
187;126;30062021114024
188;125;30062021114024
189;127;30062021114024
190;125;30062021114024
191;127;30062021114024
192;130;30062021114024
193;126;30062021114024
194;127;30062021114024
195;127;30062021114024
196;127;30062021114024
197;128;30062021114024
198;127;30062021114024
199;125;30062021114024
200;0;30062021114024
0;0;30062021114025
1;147;30062021114025
2;135;30062021114025
3;132;30062021114025
4;134;30062021114025
5;135;30062021114025
6;134;30062021114025
7;136;30062021114025
8;139;30062021114025
9;137;30062021114025
10;140;30062021114025
11;139;30062021114025
12;141;30062021114025
13;147;30062021114025
14;149;30062021114025
15;157;30062021114025
16;167;30062021114025
17;185;30062021114025
18;225;30062021114025
19;302;30062021114025
20;481;30062021114025
21;885;30062021114025
22;1023;30062021114025
23;1023;30062021114025
24;1023;30062021114025
25;1023;30062021114025
26;1023;30062021114025
27;1023;30062021114025
28;1023;30062021114025
29;1023;30062021114025
30;1023;30062021114025
31;1023;30062021114025
32;1023;30062021114025
33;1023;30062021114025
34;1023;30062021114025
35;959;30062021114025
36;725;30062021114025
37;566;30062021114025
38;447;30062021114025
39;378;30062021114025
40;324;30062021114025
41;290;30062021114025
42;271;30062021114025
43;258;30062021114025
44;251;30062021114025
45;249;30062021114025
46;244;30062021114025
47;242;30062021114025
48;241;30062021114025
49;237;30062021114025
50;238;30062021114025
51;235;30062021114025
52;230;30062021114025
53;236;30062021114025
54;234;30062021114025
55;236;30062021114025
56;241;30062021114025
57;240;30062021114025
58;248;30062021114025
59;249;30062021114025
60;255;30062021114025
61;256;30062021114025
62;257;30062021114025
63;262;30062021114025
64;265;30062021114025
65;260;30062021114025
66;263;30062021114025
67;261;30062021114025
68;259;30062021114025
69;258;30062021114025
70;254;30062021114025
71;249;30062021114025
72;250;30062021114025
73;241;30062021114025
74;241;30062021114025
75;232;30062021114025
76;229;30062021114025
77;226;30062021114025
78;221;30062021114025
79;218;30062021114025
80;211;30062021114025
81;208;30062021114025
82;207;30062021114025
83;200;30062021114025
84;198;30062021114025
85;198;30062021114025
86;194;30062021114025
87;194;30062021114025
88;193;30062021114025
89;186;30062021114025
90;188;30062021114025
91;185;30062021114025
92;181;30062021114025
93;182;30062021114025
94;178;30062021114025
95;175;30062021114025
96;173;30062021114025
97;172;30062021114025
98;169;30062021114025
99;167;30062021114025
100;164;30062021114025
101;166;30062021114025
102;162;30062021114025
103;159;30062021114025
104;159;30062021114025
105;157;30062021114025
106;159;30062021114025
107;155;30062021114025
108;154;30062021114025
109;154;30062021114025
110;149;30062021114025
111;151;30062021114025
112;151;30062021114025
113;146;30062021114025
114;148;30062021114025
115;147;30062021114025
116;144;30062021114025
117;147;30062021114025
118;145;30062021114025
119;145;30062021114025
120;144;30062021114025
121;141;30062021114025
122;142;30062021114025
123;142;30062021114025
124;139;30062021114025
125;141;30062021114025
126;139;30062021114025
127;139;30062021114025
128;139;30062021114025
129;135;30062021114025
130;136;30062021114025
131;137;30062021114025
132;134;30062021114025
133;138;30062021114025
134;134;30062021114025
135;133;30062021114025
136;135;30062021114025
137;132;30062021114025
138;134;30062021114025
139;133;30062021114025
140;131;30062021114025
141;134;30062021114025
142;130;30062021114025
143;129;30062021114025
144;132;30062021114025
145;127;30062021114025
146;132;30062021114025
147;129;30062021114025
148;129;30062021114025
149;129;30062021114025
150;129;30062021114025
151;129;30062021114025
152;130;30062021114025
153;128;30062021114025
154;129;30062021114025
155;128;30062021114025
156;127;30062021114025
157;127;30062021114025
158;126;30062021114025
159;127;30062021114025
160;128;30062021114025
161;127;30062021114025
162;128;30062021114025
163;128;30062021114025
164;127;30062021114025
165;129;30062021114025
166;127;30062021114025
167;128;30062021114025
168;128;30062021114025
169;124;30062021114025
170;128;30062021114025
171;127;30062021114025
172;126;30062021114025
173;128;30062021114025
174;126;30062021114025
175;125;30062021114025
176;127;30062021114025
177;125;30062021114025
178;126;30062021114025
179;126;30062021114025
180;125;30062021114025
181;126;30062021114025
182;127;30062021114025
183;124;30062021114025
184;126;30062021114025
185;123;30062021114025
186;127;30062021114025
187;126;30062021114025
188;124;30062021114025
189;126;30062021114025
190;124;30062021114025
191;126;30062021114025
192;127;30062021114025
193;125;30062021114025
194;126;30062021114025
195;126;30062021114025
196;125;30062021114025
197;126;30062021114025
198;126;30062021114025
199;125;30062021114025
200;0;30062021114025
0;0;30062021114025
1;147;30062021114025
2;135;30062021114025
3;132;30062021114025
4;134;30062021114025
5;134;30062021114025
6;132;30062021114025
7;134;30062021114025
8;138;30062021114025
9;137;30062021114025
10;141;30062021114025
11;140;30062021114025
12;140;30062021114025
13;148;30062021114025
14;149;30062021114025
15;156;30062021114025
16;166;30062021114025
17;183;30062021114025
18;223;30062021114025
19;305;30062021114025
20;483;30062021114025
21;889;30062021114025
22;1023;30062021114025
23;1023;30062021114025
24;1023;30062021114025
25;1023;30062021114025
26;1023;30062021114025
27;1023;30062021114025
28;1023;30062021114025
29;1023;30062021114025
30;1023;30062021114025
31;1023;30062021114025
32;1023;30062021114025
33;1023;30062021114025
34;1023;30062021114025
35;953;30062021114025
36;726;30062021114025
37;564;30062021114025
38;454;30062021114025
39;375;30062021114025
40;324;30062021114025
41;291;30062021114025
42;271;30062021114025
43;256;30062021114025
44;249;30062021114025
45;248;30062021114025
46;244;30062021114025
47;241;30062021114025
48;242;30062021114025
49;234;30062021114025
50;237;30062021114025
51;233;30062021114025
52;231;30062021114025
53;235;30062021114025
54;235;30062021114025
55;235;30062021114025
56;239;30062021114025
57;242;30062021114025
58;248;30062021114025
59;247;30062021114025
60;253;30062021114025
61;256;30062021114025
62;255;30062021114025
63;263;30062021114025
64;265;30062021114025
65;259;30062021114025
66;263;30062021114025
67;262;30062021114025
68;260;30062021114025
69;260;30062021114025
70;251;30062021114025
71;249;30062021114025
72;247;30062021114025
73;240;30062021114025
74;240;30062021114025
75;231;30062021114025
76;229;30062021114025
77;227;30062021114025
78;220;30062021114025
79;215;30062021114025
80;212;30062021114025
81;207;30062021114025
82;206;30062021114025
83;199;30062021114025
84;198;30062021114025
85;196;30062021114025
86;192;30062021114025
87;193;30062021114025
88;193;30062021114025
89;188;30062021114025
90;188;30062021114025
91;185;30062021114025
92;179;30062021114025
93;181;30062021114025
94;178;30062021114025
95;173;30062021114025
96;174;30062021114025
97;172;30062021114025
98;167;30062021114025
99;166;30062021114025
100;164;30062021114025
101;165;30062021114025
102;161;30062021114025
103;160;30062021114025
104;159;30062021114025
105;156;30062021114025
106;157;30062021114025
107;154;30062021114025
108;155;30062021114025
109;152;30062021114025
110;149;30062021114025
111;148;30062021114025
112;151;30062021114025
113;146;30062021114025
114;147;30062021114025
115;147;30062021114025
116;144;30062021114025
117;147;30062021114025
118;145;30062021114025
119;145;30062021114025
120;142;30062021114025
121;141;30062021114025
122;143;30062021114025
123;140;30062021114025
124;139;30062021114025
125;141;30062021114025
126;138;30062021114025
127;138;30062021114025
128;140;30062021114025
129;136;30062021114025
130;136;30062021114025
131;136;30062021114025
132;134;30062021114025
133;138;30062021114025
134;134;30062021114025
135;133;30062021114025
136;133;30062021114025
137;132;30062021114025
138;133;30062021114025
139;131;30062021114025
140;131;30062021114025
141;133;30062021114025
142;130;30062021114025
143;129;30062021114025
144;132;30062021114025
145;128;30062021114025
146;131;30062021114025
147;130;30062021114025
148;129;30062021114025
149;129;30062021114025
150;128;30062021114025
151;128;30062021114025
152;129;30062021114025
153;127;30062021114025
154;129;30062021114025
155;128;30062021114025
156;127;30062021114025
157;128;30062021114025
158;127;30062021114025
159;127;30062021114025
160;127;30062021114025
161;127;30062021114025
162;128;30062021114025
163;127;30062021114025
164;126;30062021114025
165;128;30062021114025
166;126;30062021114025
167;126;30062021114025
168;128;30062021114025
169;125;30062021114025
170;128;30062021114025
171;125;30062021114025
172;125;30062021114025
173;127;30062021114025
174;126;30062021114025
175;124;30062021114025
176;125;30062021114025
177;124;30062021114025
178;127;30062021114025
179;125;30062021114025
180;124;30062021114025
181;126;30062021114025
182;125;30062021114025
183;125;30062021114025
184;126;30062021114025
185;122;30062021114025
186;127;30062021114025
187;125;30062021114025
188;124;30062021114025
189;126;30062021114025
190;125;30062021114025
191;124;30062021114025
192;128;30062021114025
193;124;30062021114025
194;125;30062021114025
195;126;30062021114025
196;124;30062021114025
197;125;30062021114025
198;125;30062021114025
199;124;30062021114025
200;0;30062021114025
0;0;30062021114026
1;146;30062021114026
2;134;30062021114026
3;131;30062021114026
4;134;30062021114026
5;135;30062021114026
6;134;30062021114026
7;135;30062021114026
8;136;30062021114026
9;136;30062021114026
10;140;30062021114026
11;139;30062021114026
12;141;30062021114026
13;146;30062021114026
14;149;30062021114026
15;155;30062021114026
16;165;30062021114026
17;180;30062021114026
18;225;30062021114026
19;306;30062021114026
20;480;30062021114026
21;884;30062021114026
22;1023;30062021114026
23;1023;30062021114026
24;1023;30062021114026
25;1023;30062021114026
26;1023;30062021114026
27;1023;30062021114026
28;1023;30062021114026
29;1023;30062021114026
30;1023;30062021114026
31;1023;30062021114026
32;1023;30062021114026
33;1023;30062021114026
34;1023;30062021114026
35;960;30062021114026
36;734;30062021114026
37;564;30062021114026
38;453;30062021114026
39;378;30062021114026
40;322;30062021114026
41;290;30062021114026
42;272;30062021114026
43;258;30062021114026
44;249;30062021114026
45;245;30062021114026
46;242;30062021114026
47;243;30062021114026
48;241;30062021114026
49;237;30062021114026
50;238;30062021114026
51;233;30062021114026
52;233;30062021114026
53;234;30062021114026
54;236;30062021114026
55;238;30062021114026
56;238;30062021114026
57;244;30062021114026
58;246;30062021114026
59;249;30062021114026
60;252;30062021114026
61;258;30062021114026
62;260;30062021114026
63;260;30062021114026
64;264;30062021114026
65;263;30062021114026
66;261;30062021114026
67;261;30062021114026
68;258;30062021114026
69;258;30062021114026
70;253;30062021114026
71;248;30062021114026
72;245;30062021114026
73;239;30062021114026
74;237;30062021114026
75;231;30062021114026
76;228;30062021114026
77;227;30062021114026
78;220;30062021114026
79;218;30062021114026
80;212;30062021114026
81;205;30062021114026
82;205;30062021114026
83;200;30062021114026
84;195;30062021114026
85;196;30062021114026
86;193;30062021114026
87;195;30062021114026
88;194;30062021114026
89;188;30062021114026
90;190;30062021114026
91;186;30062021114026
92;180;30062021114026
93;182;30062021114026
94;178;30062021114026
95;173;30062021114026
96;176;30062021114026
97;170;30062021114026
98;171;30062021114026
99;167;30062021114026
100;163;30062021114026
101;165;30062021114026
102;163;30062021114026
103;161;30062021114026
104;160;30062021114026
105;156;30062021114026
106;159;30062021114026
107;155;30062021114026
108;153;30062021114026
109;153;30062021114026
110;150;30062021114026
111;151;30062021114026
112;149;30062021114026
113;146;30062021114026
114;148;30062021114026
115;147;30062021114026
116;145;30062021114026
117;147;30062021114026
118;144;30062021114026
119;144;30062021114026
120;142;30062021114026
121;140;30062021114026
122;141;30062021114026
123;142;30062021114026
124;139;30062021114026
125;140;30062021114026
126;137;30062021114026
127;138;30062021114026
128;139;30062021114026
129;136;30062021114026
130;136;30062021114026
131;137;30062021114026
132;134;30062021114026
133;138;30062021114026
134;133;30062021114026
135;133;30062021114026
136;135;30062021114026
137;132;30062021114026
138;134;30062021114026
139;131;30062021114026
140;129;30062021114026
141;132;30062021114026
142;130;30062021114026
143;130;30062021114026
144;132;30062021114026
145;129;30062021114026
146;131;30062021114026
147;130;30062021114026
148;128;30062021114026
149;128;30062021114026
150;129;30062021114026
151;129;30062021114026
152;129;30062021114026
153;126;30062021114026
154;129;30062021114026
155;128;30062021114026
156;127;30062021114026
157;127;30062021114026
158;126;30062021114026
159;127;30062021114026
160;128;30062021114026
161;126;30062021114026
162;127;30062021114026
163;127;30062021114026
164;127;30062021114026
165;128;30062021114026
166;127;30062021114026
167;127;30062021114026
168;129;30062021114026
169;124;30062021114026
170;128;30062021114026
171;125;30062021114026
172;124;30062021114026
173;127;30062021114026
174;125;30062021114026
175;124;30062021114026
176;126;30062021114026
177;124;30062021114026
178;127;30062021114026
179;126;30062021114026
180;125;30062021114026
181;127;30062021114026
182;127;30062021114026
183;125;30062021114026
184;125;30062021114026
185;123;30062021114026
186;127;30062021114026
187;125;30062021114026
188;123;30062021114026
189;126;30062021114026
190;125;30062021114026
191;126;30062021114026
192;127;30062021114026
193;125;30062021114026
194;125;30062021114026
195;125;30062021114026
196;124;30062021114026
197;124;30062021114026
198;125;30062021114026
199;123;30062021114026
200;0;30062021114026
0;0;30062021114027
1;149;30062021114027
2;136;30062021114027
3;134;30062021114027
4;137;30062021114027
5;138;30062021114027
6;136;30062021114027
7;138;30062021114027
8;140;30062021114027
9;139;30062021114027
10;143;30062021114027
11;141;30062021114027
12;143;30062021114027
13;149;30062021114027
14;149;30062021114027
15;159;30062021114027
16;168;30062021114027
17;187;30062021114027
18;225;30062021114027
19;304;30062021114027
20;476;30062021114027
21;874;30062021114027
22;1023;30062021114027
23;1023;30062021114027
24;1023;30062021114027
25;1023;30062021114027
26;1023;30062021114027
27;1023;30062021114027
28;1023;30062021114027
29;1023;30062021114027
30;1023;30062021114027
31;1023;30062021114027
32;1023;30062021114027
33;1023;30062021114027
34;1023;30062021114027
35;954;30062021114027
36;726;30062021114027
37;561;30062021114027
38;451;30062021114027
39;375;30062021114027
40;326;30062021114027
41;291;30062021114027
42;277;30062021114027
43;257;30062021114027
44;254;30062021114027
45;247;30062021114027
46;244;30062021114027
47;241;30062021114027
48;241;30062021114027
49;238;30062021114027
50;237;30062021114027
51;235;30062021114027
52;235;30062021114027
53;236;30062021114027
54;237;30062021114027
55;236;30062021114027
56;242;30062021114027
57;242;30062021114027
58;249;30062021114027
59;248;30062021114027
60;251;30062021114027
61;256;30062021114027
62;259;30062021114027
63;262;30062021114027
64;268;30062021114027
65;262;30062021114027
66;264;30062021114027
67;262;30062021114027
68;256;30062021114027
69;260;30062021114027
70;253;30062021114027
71;249;30062021114027
72;248;30062021114027
73;242;30062021114027
74;241;30062021114027
75;234;30062021114027
76;230;30062021114027
77;226;30062021114027
78;221;30062021114027
79;219;30062021114027
80;216;30062021114027
81;205;30062021114027
82;208;30062021114027
83;203;30062021114027
84;200;30062021114027
85;198;30062021114027
86;195;30062021114027
87;195;30062021114027
88;194;30062021114027
89;188;30062021114027
90;189;30062021114027
91;186;30062021114027
92;182;30062021114027
93;183;30062021114027
94;180;30062021114027
95;177;30062021114027
96;178;30062021114027
97;175;30062021114027
98;173;30062021114027
99;171;30062021114027
100;165;30062021114027
101;168;30062021114027
102;165;30062021114027
103;162;30062021114027
104;162;30062021114027
105;158;30062021114027
106;160;30062021114027
107;157;30062021114027
108;156;30062021114027
109;156;30062021114027
110;153;30062021114027
111;153;30062021114027
112;153;30062021114027
113;150;30062021114027
114;149;30062021114027
115;151;30062021114027
116;147;30062021114027
117;149;30062021114027
118;147;30062021114027
119;147;30062021114027
120;146;30062021114027
121;143;30062021114027
122;144;30062021114027
123;143;30062021114027
124;143;30062021114027
125;143;30062021114027
126;141;30062021114027
127;140;30062021114027
128;142;30062021114027
129;139;30062021114027
130;140;30062021114027
131;138;30062021114027
132;137;30062021114027
133;141;30062021114027
134;136;30062021114027
135;137;30062021114027
136;137;30062021114027
137;134;30062021114027
138;136;30062021114027
139;135;30062021114027
140;133;30062021114027
141;135;30062021114027
142;133;30062021114027
143;133;30062021114027
144;134;30062021114027
145;131;30062021114027
146;134;30062021114027
147;133;30062021114027
148;132;30062021114027
149;133;30062021114027
150;132;30062021114027
151;132;30062021114027
152;132;30062021114027
153;130;30062021114027
154;132;30062021114027
155;130;30062021114027
156;130;30062021114027
157;130;30062021114027
158;129;30062021114027
159;130;30062021114027
160;131;30062021114027
161;129;30062021114027
162;131;30062021114027
163;130;30062021114027
164;129;30062021114027
165;131;30062021114027
166;128;30062021114027
167;130;30062021114027
168;131;30062021114027
169;128;30062021114027
170;130;30062021114027
171;129;30062021114027
172;129;30062021114027
173;130;30062021114027
174;129;30062021114027
175;129;30062021114027
176;130;30062021114027
177;127;30062021114027
178;129;30062021114027
179;128;30062021114027
180;128;30062021114027
181;130;30062021114027
182;130;30062021114027
183;129;30062021114027
184;130;30062021114027
185;126;30062021114027
186;129;30062021114027
187;128;30062021114027
188;125;30062021114027
189;129;30062021114027
190;126;30062021114027
191;128;30062021114027
192;131;30062021114027
193;128;30062021114027
194;129;30062021114027
195;128;30062021114027
196;127;30062021114027
197;129;30062021114027
198;129;30062021114027
199;126;30062021114027
200;0;30062021114027
0;0;30062021114027
1;150;30062021114027
2;137;30062021114027
3;135;30062021114027
4;136;30062021114027
5;139;30062021114027
6;137;30062021114027
7;139;30062021114027
8;140;30062021114027
9;139;30062021114027
10;142;30062021114027
11;141;30062021114027
12;142;30062021114027
13;148;30062021114027
14;150;30062021114027
15;160;30062021114027
16;169;30062021114027
17;183;30062021114027
18;225;30062021114027
19;306;30062021114027
20;476;30062021114027
21;880;30062021114027
22;1023;30062021114027
23;1023;30062021114027
24;1023;30062021114027
25;1023;30062021114027
26;1023;30062021114027
27;1023;30062021114027
28;1023;30062021114027
29;1023;30062021114027
30;1023;30062021114027
31;1023;30062021114027
32;1023;30062021114027
33;1023;30062021114027
34;1023;30062021114027
35;958;30062021114027
36;731;30062021114027
37;568;30062021114027
38;454;30062021114027
39;379;30062021114027
40;329;30062021114027
41;291;30062021114027
42;274;30062021114027
43;260;30062021114027
44;253;30062021114027
45;247;30062021114027
46;246;30062021114027
47;243;30062021114027
48;244;30062021114027
49;238;30062021114027
50;239;30062021114027
51;233;30062021114027
52;235;30062021114027
53;236;30062021114027
54;239;30062021114027
55;239;30062021114027
56;241;30062021114027
57;244;30062021114027
58;250;30062021114027
59;253;30062021114027
60;254;30062021114027
61;259;30062021114027
62;259;30062021114027
63;262;30062021114027
64;267;30062021114027
65;260;30062021114027
66;267;30062021114027
67;264;30062021114027
68;261;30062021114027
69;260;30062021114027
70;256;30062021114027
71;251;30062021114027
72;249;30062021114027
73;243;30062021114027
74;241;30062021114027
75;234;30062021114027
76;229;30062021114027
77;230;30062021114027
78;221;30062021114027
79;218;30062021114027
80;214;30062021114027
81;207;30062021114027
82;207;30062021114027
83;200;30062021114027
84;202;30062021114027
85;200;30062021114027
86;196;30062021114027
87;194;30062021114027
88;195;30062021114027
89;188;30062021114027
90;192;30062021114027
91;189;30062021114027
92;184;30062021114027
93;183;30062021114027
94;180;30062021114027
95;176;30062021114027
96;177;30062021114027
97;171;30062021114027
98;171;30062021114027
99;170;30062021114027
100;166;30062021114027
101;168;30062021114027
102;165;30062021114027
103;163;30062021114027
104;163;30062021114027
105;157;30062021114027
106;162;30062021114027
107;157;30062021114027
108;156;30062021114027
109;157;30062021114027
110;152;30062021114027
111;153;30062021114027
112;152;30062021114027
113;149;30062021114027
114;150;30062021114027
115;151;30062021114027
116;148;30062021114027
117;149;30062021114027
118;147;30062021114027
119;147;30062021114027
120;144;30062021114027
121;143;30062021114027
122;144;30062021114027
123;144;30062021114027
124;143;30062021114027
125;143;30062021114027
126;141;30062021114027
127;141;30062021114027
128;141;30062021114027
129;139;30062021114027
130;138;30062021114027
131;139;30062021114027
132;137;30062021114027
133;140;30062021114027
134;136;30062021114027
135;136;30062021114027
136;137;30062021114027
137;134;30062021114027
138;136;30062021114027
139;136;30062021114027
140;133;30062021114027
141;135;30062021114027
142;133;30062021114027
143;133;30062021114027
144;135;30062021114027
145;132;30062021114027
146;133;30062021114027
147;132;30062021114027
148;132;30062021114027
149;133;30062021114027
150;132;30062021114027
151;131;30062021114027
152;132;30062021114027
153;129;30062021114027
154;132;30062021114027
155;130;30062021114027
156;130;30062021114027
157;131;30062021114027
158;129;30062021114027
159;130;30062021114027
160;130;30062021114027
161;129;30062021114027
162;131;30062021114027
163;131;30062021114027
164;129;30062021114027
165;131;30062021114027
166;129;30062021114027
167;129;30062021114027
168;131;30062021114027
169;127;30062021114027
170;130;30062021114027
171;128;30062021114027
172;128;30062021114027
173;129;30062021114027
174;128;30062021114027
175;127;30062021114027
176;129;30062021114027
177;127;30062021114027
178;130;30062021114027
179;128;30062021114027
180;128;30062021114027
181;129;30062021114027
182;129;30062021114027
183;127;30062021114027
184;130;30062021114027
185;126;30062021114027
186;130;30062021114027
187;129;30062021114027
188;127;30062021114027
189;128;30062021114027
190;127;30062021114027
191;127;30062021114027
192;131;30062021114027
193;128;30062021114027
194;129;30062021114027
195;128;30062021114027
196;128;30062021114027
197;128;30062021114027
198;128;30062021114027
199;127;30062021114027
200;0;30062021114027
0;0;30062021114028
1;148;30062021114028
2;137;30062021114028
3;135;30062021114028
4;135;30062021114028
5;137;30062021114028
6;135;30062021114028
7;139;30062021114028
8;140;30062021114028
9;138;30062021114028
10;142;30062021114028
11;141;30062021114028
12;141;30062021114028
13;149;30062021114028
14;150;30062021114028
15;158;30062021114028
16;167;30062021114028
17;182;30062021114028
18;223;30062021114028
19;305;30062021114028
20;479;30062021114028
21;883;30062021114028
22;1023;30062021114028
23;1023;30062021114028
24;1023;30062021114028
25;1023;30062021114028
26;1023;30062021114028
27;1023;30062021114028
28;1023;30062021114028
29;1023;30062021114028
30;1023;30062021114028
31;1023;30062021114028
32;1023;30062021114028
33;1023;30062021114028
34;1023;30062021114028
35;962;30062021114028
36;731;30062021114028
37;565;30062021114028
38;454;30062021114028
39;378;30062021114028
40;326;30062021114028
41;291;30062021114028
42;277;30062021114028
43;260;30062021114028
44;250;30062021114028
45;250;30062021114028
46;244;30062021114028
47;245;30062021114028
48;242;30062021114028
49;240;30062021114028
50;238;30062021114028
51;234;30062021114028
52;232;30062021114028
53;236;30062021114028
54;235;30062021114028
55;235;30062021114028
56;240;30062021114028
57;242;30062021114028
58;250;30062021114028
59;249;30062021114028
60;252;30062021114028
61;257;30062021114028
62;260;30062021114028
63;262;30062021114028
64;266;30062021114028
65;264;30062021114028
66;265;30062021114028
67;263;30062021114028
68;260;30062021114028
69;258;30062021114028
70;253;30062021114028
71;252;30062021114028
72;249;30062021114028
73;240;30062021114028
74;240;30062021114028
75;234;30062021114028
76;229;30062021114028
77;229;30062021114028
78;221;30062021114028
79;220;30062021114028
80;214;30062021114028
81;206;30062021114028
82;205;30062021114028
83;202;30062021114028
84;198;30062021114028
85;199;30062021114028
86;196;30062021114028
87;194;30062021114028
88;194;30062021114028
89;189;30062021114028
90;190;30062021114028
91;187;30062021114028
92;181;30062021114028
93;184;30062021114028
94;178;30062021114028
95;176;30062021114028
96;176;30062021114028
97;173;30062021114028
98;170;30062021114028
99;170;30062021114028
100;165;30062021114028
101;166;30062021114028
102;163;30062021114028
103;162;30062021114028
104;161;30062021114028
105;158;30062021114028
106;160;30062021114028
107;156;30062021114028
108;154;30062021114028
109;155;30062021114028
110;150;30062021114028
111;151;30062021114028
112;154;30062021114028
113;147;30062021114028
114;148;30062021114028
115;149;30062021114028
116;147;30062021114028
117;149;30062021114028
118;145;30062021114028
119;145;30062021114028
120;144;30062021114028
121;143;30062021114028
122;143;30062021114028
123;143;30062021114028
124;140;30062021114028
125;143;30062021114028
126;140;30062021114028
127;139;30062021114028
128;141;30062021114028
129;137;30062021114028
130;138;30062021114028
131;139;30062021114028
132;136;30062021114028
133;141;30062021114028
134;135;30062021114028
135;135;30062021114028
136;136;30062021114028
137;133;30062021114028
138;136;30062021114028
139;135;30062021114028
140;132;30062021114028
141;135;30062021114028
142;133;30062021114028
143;131;30062021114028
144;133;30062021114028
145;130;30062021114028
146;132;30062021114028
147;132;30062021114028
148;131;30062021114028
149;131;30062021114028
150;130;30062021114028
151;130;30062021114028
152;130;30062021114028
153;129;30062021114028
154;132;30062021114028
155;130;30062021114028
156;129;30062021114028
157;129;30062021114028
158;128;30062021114028
159;128;30062021114028
160;130;30062021114028
161;128;30062021114028
162;130;30062021114028
163;129;30062021114028
164;128;30062021114028
165;130;30062021114028
166;129;30062021114028
167;129;30062021114028
168;130;30062021114028
169;126;30062021114028
170;129;30062021114028
171;128;30062021114028
172;127;30062021114028
173;129;30062021114028
174;128;30062021114028
175;127;30062021114028
176;128;30062021114028
177;126;30062021114028
178;128;30062021114028
179;127;30062021114028
180;127;30062021114028
181;129;30062021114028
182;128;30062021114028
183;126;30062021114028
184;128;30062021114028
185;124;30062021114028
186;129;30062021114028
187;128;30062021114028
188;126;30062021114028
189;128;30062021114028
190;127;30062021114028
191;126;30062021114028
192;130;30062021114028
193;126;30062021114028
194;127;30062021114028
195;128;30062021114028
196;126;30062021114028
197;129;30062021114028
198;127;30062021114028
199;126;30062021114028
200;0;30062021114028
0;0;30062021114028
1;148;30062021114028
2;136;30062021114028
3;135;30062021114028
4;134;30062021114028
5;136;30062021114028
6;135;30062021114028
7;137;30062021114028
8;138;30062021114028
9;138;30062021114028
10;141;30062021114028
11;140;30062021114028
12;141;30062021114028
13;148;30062021114028
14;149;30062021114028
15;157;30062021114028
16;167;30062021114028
17;184;30062021114028
18;225;30062021114028
19;306;30062021114028
20;477;30062021114028
21;876;30062021114028
22;1023;30062021114028
23;1023;30062021114028
24;1023;30062021114028
25;1023;30062021114028
26;1023;30062021114028
27;1023;30062021114028
28;1023;30062021114028
29;1023;30062021114028
30;1023;30062021114028
31;1023;30062021114028
32;1023;30062021114028
33;1023;30062021114028
34;1023;30062021114028
35;960;30062021114028
36;731;30062021114028
37;562;30062021114028
38;455;30062021114028
39;376;30062021114028
40;326;30062021114028
41;292;30062021114028
42;274;30062021114028
43;256;30062021114028
44;251;30062021114028
45;248;30062021114028
46;245;30062021114028
47;242;30062021114028
48;243;30062021114028
49;236;30062021114028
50;239;30062021114028
51;235;30062021114028
52;231;30062021114028
53;236;30062021114028
54;236;30062021114028
55;237;30062021114028
56;242;30062021114028
57;242;30062021114028
58;248;30062021114028
59;250;30062021114028
60;252;30062021114028
61;258;30062021114028
62;258;30062021114028
63;262;30062021114028
64;263;30062021114028
65;266;30062021114028
66;263;30062021114028
67;263;30062021114028
68;258;30062021114028
69;260;30062021114028
70;253;30062021114028
71;249;30062021114028
72;249;30062021114028
73;241;30062021114028
74;241;30062021114028
75;231;30062021114028
76;232;30062021114028
77;228;30062021114028
78;221;30062021114028
79;216;30062021114028
80;213;30062021114028
81;207;30062021114028
82;207;30062021114028
83;201;30062021114028
84;200;30062021114028
85;196;30062021114028
86;196;30062021114028
87;194;30062021114028
88;194;30062021114028
89;188;30062021114028
90;192;30062021114028
91;187;30062021114028
92;183;30062021114028
93;183;30062021114028
94;179;30062021114028
95;176;30062021114028
96;176;30062021114028
97;172;30062021114028
98;170;30062021114028
99;168;30062021114028
100;165;30062021114028
101;165;30062021114028
102;164;30062021114028
103;161;30062021114028
104;162;30062021114028
105;157;30062021114028
106;161;30062021114028
107;157;30062021114028
108;156;30062021114028
109;155;30062021114028
110;152;30062021114028
111;151;30062021114028
112;153;30062021114028
113;148;30062021114028
114;149;30062021114028
115;148;30062021114028
116;146;30062021114028
117;149;30062021114028
118;145;30062021114028
119;146;30062021114028
120;144;30062021114028
121;143;30062021114028
122;143;30062021114028
123;142;30062021114028
124;141;30062021114028
125;141;30062021114028
126;139;30062021114028
127;139;30062021114028
128;141;30062021114028
129;137;30062021114028
130;137;30062021114028
131;138;30062021114028
132;135;30062021114028
133;140;30062021114028
134;134;30062021114028
135;136;30062021114028
136;136;30062021114028
137;132;30062021114028
138;135;30062021114028
139;135;30062021114028
140;133;30062021114028
141;135;30062021114028
142;131;30062021114028
143;132;30062021114028
144;133;30062021114028
145;130;30062021114028
146;133;30062021114028
147;132;30062021114028
148;131;30062021114028
149;131;30062021114028
150;130;30062021114028
151;131;30062021114028
152;131;30062021114028
153;129;30062021114028
154;131;30062021114028
155;129;30062021114028
156;128;30062021114028
157;129;30062021114028
158;128;30062021114028
159;128;30062021114028
160;129;30062021114028
161;128;30062021114028
162;129;30062021114028
163;129;30062021114028
164;128;30062021114028
165;129;30062021114028
166;128;30062021114028
167;129;30062021114028
168;129;30062021114028
169;124;30062021114028
170;128;30062021114028
171;128;30062021114028
172;127;30062021114028
173;128;30062021114028
174;127;30062021114028
175;126;30062021114028
176;128;30062021114028
177;125;30062021114028
178;128;30062021114028
179;126;30062021114028
180;126;30062021114028
181;128;30062021114028
182;127;30062021114028
183;126;30062021114028
184;128;30062021114028
185;124;30062021114028
186;129;30062021114028
187;128;30062021114028
188;125;30062021114028
189;127;30062021114028
190;125;30062021114028
191;127;30062021114028
192;130;30062021114028
193;127;30062021114028
194;128;30062021114028
195;127;30062021114028
196;126;30062021114028
197;127;30062021114028
198;127;30062021114028
199;125;30062021114028
200;0;30062021114028
