ind;val;datetime
0;0;30062021115507
1;150;30062021115507
2;134;30062021115507
3;132;30062021115507
4;133;30062021115507
5;135;30062021115507
6;133;30062021115507
7;135;30062021115507
8;136;30062021115507
9;135;30062021115507
10;139;30062021115507
11;136;30062021115507
12;138;30062021115507
13;142;30062021115507
14;143;30062021115507
15;150;30062021115507
16;155;30062021115507
17;167;30062021115507
18;196;30062021115507
19;249;30062021115507
20;371;30062021115507
21;683;30062021115507
22;1023;30062021115507
23;1023;30062021115507
24;1023;30062021115507
25;1023;30062021115507
26;1023;30062021115507
27;1023;30062021115507
28;1023;30062021115507
29;1023;30062021115507
30;1023;30062021115507
31;1023;30062021115507
32;1023;30062021115507
33;1023;30062021115507
34;1023;30062021115507
35;901;30062021115507
36;687;30062021115507
37;539;30062021115507
38;438;30062021115507
39;369;30062021115507
40;322;30062021115507
41;289;30062021115507
42;271;30062021115507
43;256;30062021115507
44;248;30062021115507
45;243;30062021115507
46;237;30062021115507
47;236;30062021115507
48;238;30062021115507
49;235;30062021115507
50;239;30062021115507
51;239;30062021115507
52;236;30062021115507
53;241;30062021115507
54;245;30062021115507
55;246;30062021115507
56;249;30062021115507
57;252;30062021115507
58;261;30062021115507
59;261;30062021115507
60;269;30062021115507
61;271;30062021115507
62;277;30062021115507
63;281;30062021115507
64;283;30062021115507
65;281;30062021115507
66;288;30062021115507
67;289;30062021115507
68;282;30062021115507
69;282;30062021115507
70;276;30062021115507
71;272;30062021115507
72;270;30062021115507
73;261;30062021115507
74;261;30062021115507
75;254;30062021115507
76;247;30062021115507
77;247;30062021115507
78;240;30062021115507
79;234;30062021115507
80;230;30062021115507
81;222;30062021115507
82;222;30062021115507
83;216;30062021115507
84;213;30062021115507
85;214;30062021115507
86;211;30062021115507
87;207;30062021115507
88;210;30062021115507
89;203;30062021115507
90;205;30062021115507
91;199;30062021115507
92;196;30062021115507
93;195;30062021115507
94;192;30062021115507
95;188;30062021115507
96;187;30062021115507
97;181;30062021115507
98;180;30062021115507
99;179;30062021115507
100;176;30062021115507
101;175;30062021115507
102;173;30062021115507
103;171;30062021115507
104;171;30062021115507
105;167;30062021115507
106;167;30062021115507
107;164;30062021115507
108;163;30062021115507
109;163;30062021115507
110;159;30062021115507
111;159;30062021115507
112;161;30062021115507
113;156;30062021115507
114;156;30062021115507
115;157;30062021115507
116;154;30062021115507
117;154;30062021115507
118;152;30062021115507
119;151;30062021115507
120;149;30062021115507
121;149;30062021115507
122;147;30062021115507
123;148;30062021115507
124;145;30062021115507
125;148;30062021115507
126;144;30062021115507
127;142;30062021115507
128;145;30062021115507
129;142;30062021115507
130;143;30062021115507
131;141;30062021115507
132;140;30062021115507
133;143;30062021115507
134;139;30062021115507
135;139;30062021115507
136;140;30062021115507
137;136;30062021115507
138;139;30062021115507
139;137;30062021115507
140;135;30062021115507
141;137;30062021115507
142;134;30062021115507
143;135;30062021115507
144;135;30062021115507
145;132;30062021115507
146;136;30062021115507
147;134;30062021115507
148;132;30062021115507
149;132;30062021115507
150;133;30062021115507
151;132;30062021115507
152;133;30062021115507
153;130;30062021115507
154;133;30062021115507
155;130;30062021115507
156;130;30062021115507
157;131;30062021115507
158;129;30062021115507
159;129;30062021115507
160;131;30062021115507
161;130;30062021115507
162;131;30062021115507
163;130;30062021115507
164;129;30062021115507
165;131;30062021115507
166;130;30062021115507
167;130;30062021115507
168;131;30062021115507
169;128;30062021115507
170;131;30062021115507
171;129;30062021115507
172;128;30062021115507
173;130;30062021115507
174;128;30062021115507
175;126;30062021115507
176;129;30062021115507
177;128;30062021115507
178;128;30062021115507
179;128;30062021115507
180;128;30062021115507
181;129;30062021115507
182;129;30062021115507
183;127;30062021115507
184;129;30062021115507
185;126;30062021115507
186;130;30062021115507
187;128;30062021115507
188;126;30062021115507
189;128;30062021115507
190;127;30062021115507
191;128;30062021115507
192;130;30062021115507
193;126;30062021115507
194;129;30062021115507
195;128;30062021115507
196;127;30062021115507
197;128;30062021115507
198;128;30062021115507
199;128;30062021115507
200;0;30062021115507
0;0;30062021115508
1;149;30062021115508
2;133;30062021115508
3;131;30062021115508
4;133;30062021115508
5;133;30062021115508
6;130;30062021115508
7;132;30062021115508
8;135;30062021115508
9;133;30062021115508
10;138;30062021115508
11;136;30062021115508
12;137;30062021115508
13;142;30062021115508
14;143;30062021115508
15;148;30062021115508
16;154;30062021115508
17;164;30062021115508
18;192;30062021115508
19;248;30062021115508
20;372;30062021115508
21;684;30062021115508
22;1023;30062021115508
23;1023;30062021115508
24;1023;30062021115508
25;1023;30062021115508
26;1023;30062021115508
27;1023;30062021115508
28;1023;30062021115508
29;1023;30062021115508
30;1023;30062021115508
31;1023;30062021115508
32;1023;30062021115508
33;1023;30062021115508
34;1023;30062021115508
35;912;30062021115508
36;699;30062021115508
37;548;30062021115508
38;440;30062021115508
39;371;30062021115508
40;324;30062021115508
41;290;30062021115508
42;272;30062021115508
43;256;30062021115508
44;248;30062021115508
45;242;30062021115508
46;238;30062021115508
47;236;30062021115508
48;236;30062021115508
49;234;30062021115508
50;236;30062021115508
51;238;30062021115508
52;238;30062021115508
53;243;30062021115508
54;243;30062021115508
55;245;30062021115508
56;251;30062021115508
57;254;30062021115508
58;263;30062021115508
59;264;30062021115508
60;267;30062021115508
61;274;30062021115508
62;277;30062021115508
63;281;30062021115508
64;284;30062021115508
65;281;30062021115508
66;287;30062021115508
67;285;30062021115508
68;283;30062021115508
69;282;30062021115508
70;277;30062021115508
71;272;30062021115508
72;271;30062021115508
73;261;30062021115508
74;261;30062021115508
75;252;30062021115508
76;249;30062021115508
77;246;30062021115508
78;238;30062021115508
79;233;30062021115508
80;229;30062021115508
81;222;30062021115508
82;222;30062021115508
83;218;30062021115508
84;213;30062021115508
85;211;30062021115508
86;210;30062021115508
87;208;30062021115508
88;208;30062021115508
89;203;30062021115508
90;204;30062021115508
91;201;30062021115508
92;196;30062021115508
93;195;30062021115508
94;190;30062021115508
95;186;30062021115508
96;185;30062021115508
97;182;30062021115508
98;180;30062021115508
99;177;30062021115508
100;175;30062021115508
101;176;30062021115508
102;172;30062021115508
103;170;30062021115508
104;169;30062021115508
105;163;30062021115508
106;168;30062021115508
107;161;30062021115508
108;161;30062021115508
109;162;30062021115508
110;157;30062021115508
111;156;30062021115508
112;159;30062021115508
113;154;30062021115508
114;153;30062021115508
115;155;30062021115508
116;153;30062021115508
117;154;30062021115508
118;150;30062021115508
119;149;30062021115508
120;147;30062021115508
121;145;30062021115508
122;147;30062021115508
123;146;30062021115508
124;144;30062021115508
125;145;30062021115508
126;142;30062021115508
127;143;30062021115508
128;143;30062021115508
129;140;30062021115508
130;139;30062021115508
131;141;30062021115508
132;139;30062021115508
133;141;30062021115508
134;138;30062021115508
135;136;30062021115508
136;138;30062021115508
137;135;30062021115508
138;135;30062021115508
139;135;30062021115508
140;133;30062021115508
141;136;30062021115508
142;133;30062021115508
143;133;30062021115508
144;134;30062021115508
145;130;30062021115508
146;134;30062021115508
147;132;30062021115508
148;131;30062021115508
149;131;30062021115508
150;132;30062021115508
151;130;30062021115508
152;130;30062021115508
153;128;30062021115508
154;130;30062021115508
155;129;30062021115508
156;128;30062021115508
157;129;30062021115508
158;128;30062021115508
159;129;30062021115508
160;130;30062021115508
161;128;30062021115508
162;128;30062021115508
163;129;30062021115508
164;128;30062021115508
165;129;30062021115508
166;127;30062021115508
167;128;30062021115508
168;129;30062021115508
169;126;30062021115508
170;129;30062021115508
171;127;30062021115508
172;127;30062021115508
173;127;30062021115508
174;127;30062021115508
175;126;30062021115508
176;128;30062021115508
177;126;30062021115508
178;128;30062021115508
179;127;30062021115508
180;125;30062021115508
181;127;30062021115508
182;127;30062021115508
183;126;30062021115508
184;128;30062021115508
185;124;30062021115508
186;127;30062021115508
187;126;30062021115508
188;125;30062021115508
189;126;30062021115508
190;125;30062021115508
191;125;30062021115508
192;128;30062021115508
193;125;30062021115508
194;126;30062021115508
195;127;30062021115508
196;126;30062021115508
197;127;30062021115508
198;126;30062021115508
199;125;30062021115508
200;0;30062021115508
0;0;30062021115509
1;148;30062021115509
2;131;30062021115509
3;131;30062021115509
4;133;30062021115509
5;133;30062021115509
6;130;30062021115509
7;133;30062021115509
8;133;30062021115509
9;132;30062021115509
10;135;30062021115509
11;134;30062021115509
12;136;30062021115509
13;141;30062021115509
14;142;30062021115509
15;148;30062021115509
16;155;30062021115509
17;164;30062021115509
18;193;30062021115509
19;247;30062021115509
20;370;30062021115509
21;690;30062021115509
22;1023;30062021115509
23;1023;30062021115509
24;1023;30062021115509
25;1023;30062021115509
26;1023;30062021115509
27;1023;30062021115509
28;1023;30062021115509
29;1023;30062021115509
30;1023;30062021115509
31;1023;30062021115509
32;1023;30062021115509
33;1023;30062021115509
34;1023;30062021115509
35;919;30062021115509
36;704;30062021115509
37;549;30062021115509
38;448;30062021115509
39;374;30062021115509
40;325;30062021115509
41;289;30062021115509
42;274;30062021115509
43;255;30062021115509
44;249;30062021115509
45;243;30062021115509
46;236;30062021115509
47;236;30062021115509
48;237;30062021115509
49;234;30062021115509
50;237;30062021115509
51;237;30062021115509
52;237;30062021115509
53;244;30062021115509
54;241;30062021115509
55;246;30062021115509
56;250;30062021115509
57;253;30062021115509
58;262;30062021115509
59;265;30062021115509
60;271;30062021115509
61;275;30062021115509
62;276;30062021115509
63;280;30062021115509
64;285;30062021115509
65;283;30062021115509
66;289;30062021115509
67;284;30062021115509
68;284;30062021115509
69;282;30062021115509
70;275;30062021115509
71;274;30062021115509
72;272;30062021115509
73;265;30062021115509
74;262;30062021115509
75;254;30062021115509
76;248;30062021115509
77;246;30062021115509
78;239;30062021115509
79;234;30062021115509
80;228;30062021115509
81;222;30062021115509
82;222;30062021115509
83;216;30062021115509
84;213;30062021115509
85;211;30062021115509
86;210;30062021115509
87;207;30062021115509
88;209;30062021115509
89;203;30062021115509
90;203;30062021115509
91;201;30062021115509
92;194;30062021115509
93;194;30062021115509
94;190;30062021115509
95;187;30062021115509
96;187;30062021115509
97;181;30062021115509
98;180;30062021115509
99;177;30062021115509
100;175;30062021115509
101;176;30062021115509
102;171;30062021115509
103;170;30062021115509
104;169;30062021115509
105;165;30062021115509
106;167;30062021115509
107;163;30062021115509
108;159;30062021115509
109;162;30062021115509
110;157;30062021115509
111;157;30062021115509
112;159;30062021115509
113;153;30062021115509
114;154;30062021115509
115;153;30062021115509
116;151;30062021115509
117;153;30062021115509
118;150;30062021115509
119;150;30062021115509
120;148;30062021115509
121;146;30062021115509
122;146;30062021115509
123;145;30062021115509
124;143;30062021115509
125;146;30062021115509
126;142;30062021115509
127;142;30062021115509
128;144;30062021115509
129;139;30062021115509
130;141;30062021115509
131;140;30062021115509
132;137;30062021115509
133;141;30062021115509
134;136;30062021115509
135;136;30062021115509
136;137;30062021115509
137;134;30062021115509
138;136;30062021115509
139;135;30062021115509
140;133;30062021115509
141;135;30062021115509
142;131;30062021115509
143;132;30062021115509
144;133;30062021115509
145;131;30062021115509
146;132;30062021115509
147;131;30062021115509
148;130;30062021115509
149;131;30062021115509
150;130;30062021115509
151;130;30062021115509
152;131;30062021115509
153;129;30062021115509
154;131;30062021115509
155;129;30062021115509
156;128;30062021115509
157;129;30062021115509
158;128;30062021115509
159;128;30062021115509
160;130;30062021115509
161;127;30062021115509
162;129;30062021115509
163;128;30062021115509
164;127;30062021115509
165;129;30062021115509
166;127;30062021115509
167;127;30062021115509
168;128;30062021115509
169;125;30062021115509
170;128;30062021115509
171;127;30062021115509
172;126;30062021115509
173;128;30062021115509
174;126;30062021115509
175;126;30062021115509
176;127;30062021115509
177;125;30062021115509
178;128;30062021115509
179;126;30062021115509
180;125;30062021115509
181;127;30062021115509
182;126;30062021115509
183;125;30062021115509
184;127;30062021115509
185;124;30062021115509
186;126;30062021115509
187;126;30062021115509
188;125;30062021115509
189;127;30062021115509
190;125;30062021115509
191;125;30062021115509
192;128;30062021115509
193;124;30062021115509
194;125;30062021115509
195;126;30062021115509
196;125;30062021115509
197;127;30062021115509
198;125;30062021115509
199;125;30062021115509
200;0;30062021115509
0;0;30062021115509
1;149;30062021115509
2;132;30062021115509
3;131;30062021115509
4;132;30062021115509
5;134;30062021115509
6;130;30062021115509
7;133;30062021115509
8;135;30062021115509
9;133;30062021115509
10;137;30062021115509
11;135;30062021115509
12;136;30062021115509
13;142;30062021115509
14;142;30062021115509
15;148;30062021115509
16;154;30062021115509
17;164;30062021115509
18;194;30062021115509
19;247;30062021115509
20;369;30062021115509
21;684;30062021115509
22;1023;30062021115509
23;1023;30062021115509
24;1023;30062021115509
25;1023;30062021115509
26;1023;30062021115509
27;1023;30062021115509
28;1023;30062021115509
29;1023;30062021115509
30;1023;30062021115509
31;1023;30062021115509
32;1023;30062021115509
33;1023;30062021115509
34;1023;30062021115509
35;919;30062021115509
36;700;30062021115509
37;548;30062021115509
38;448;30062021115509
39;376;30062021115509
40;324;30062021115509
41;292;30062021115509
42;274;30062021115509
43;254;30062021115509
44;247;30062021115509
45;242;30062021115509
46;237;30062021115509
47;235;30062021115509
48;234;30062021115509
49;234;30062021115509
50;237;30062021115509
51;236;30062021115509
52;237;30062021115509
53;243;30062021115509
54;246;30062021115509
55;246;30062021115509
56;250;30062021115509
57;255;30062021115509
58;260;30062021115509
59;264;30062021115509
60;267;30062021115509
61;271;30062021115509
62;276;30062021115509
63;280;30062021115509
64;284;30062021115509
65;281;30062021115509
66;287;30062021115509
67;285;30062021115509
68;281;30062021115509
69;281;30062021115509
70;275;30062021115509
71;272;30062021115509
72;273;30062021115509
73;262;30062021115509
74;262;30062021115509
75;251;30062021115509
76;247;30062021115509
77;246;30062021115509
78;240;30062021115509
79;233;30062021115509
80;229;30062021115509
81;222;30062021115509
82;222;30062021115509
83;215;30062021115509
84;214;30062021115509
85;213;30062021115509
86;210;30062021115509
87;208;30062021115509
88;206;30062021115509
89;202;30062021115509
90;203;30062021115509
91;200;30062021115509
92;195;30062021115509
93;194;30062021115509
94;192;30062021115509
95;186;30062021115509
96;186;30062021115509
97;183;30062021115509
98;180;30062021115509
99;177;30062021115509
100;175;30062021115509
101;176;30062021115509
102;172;30062021115509
103;170;30062021115509
104;168;30062021115509
105;164;30062021115509
106;166;30062021115509
107;162;30062021115509
108;161;30062021115509
109;161;30062021115509
110;158;30062021115509
111;158;30062021115509
112;157;30062021115509
113;154;30062021115509
114;154;30062021115509
115;154;30062021115509
116;151;30062021115509
117;154;30062021115509
118;149;30062021115509
119;150;30062021115509
120;147;30062021115509
121;147;30062021115509
122;146;30062021115509
123;146;30062021115509
124;144;30062021115509
125;145;30062021115509
126;142;30062021115509
127;143;30062021115509
128;143;30062021115509
129;139;30062021115509
130;140;30062021115509
131;140;30062021115509
132;139;30062021115509
133;141;30062021115509
134;137;30062021115509
135;136;30062021115509
136;138;30062021115509
137;135;30062021115509
138;136;30062021115509
139;135;30062021115509
140;133;30062021115509
141;135;30062021115509
142;133;30062021115509
143;133;30062021115509
144;133;30062021115509
145;131;30062021115509
146;134;30062021115509
147;132;30062021115509
148;130;30062021115509
149;130;30062021115509
150;131;30062021115509
151;130;30062021115509
152;130;30062021115509
153;130;30062021115509
154;131;30062021115509
155;130;30062021115509
156;129;30062021115509
157;129;30062021115509
158;128;30062021115509
159;128;30062021115509
160;130;30062021115509
161;128;30062021115509
162;129;30062021115509
163;128;30062021115509
164;127;30062021115509
165;130;30062021115509
166;127;30062021115509
167;128;30062021115509
168;129;30062021115509
169;126;30062021115509
170;129;30062021115509
171;126;30062021115509
172;128;30062021115509
173;128;30062021115509
174;127;30062021115509
175;126;30062021115509
176;127;30062021115509
177;125;30062021115509
178;128;30062021115509
179;127;30062021115509
180;126;30062021115509
181;128;30062021115509
182;127;30062021115509
183;126;30062021115509
184;127;30062021115509
185;124;30062021115509
186;129;30062021115509
187;127;30062021115509
188;124;30062021115509
189;126;30062021115509
190;125;30062021115509
191;125;30062021115509
192;129;30062021115509
193;126;30062021115509
194;126;30062021115509
195;126;30062021115509
196;124;30062021115509
197;127;30062021115509
198;126;30062021115509
199;124;30062021115509
200;0;30062021115509
0;0;30062021115509
1;148;30062021115509
2;132;30062021115509
3;131;30062021115509
4;132;30062021115509
5;133;30062021115509
6;130;30062021115509
7;132;30062021115509
8;134;30062021115509
9;132;30062021115509
10;136;30062021115509
11;134;30062021115509
12;136;30062021115509
13;140;30062021115509
14;142;30062021115509
15;147;30062021115509
16;153;30062021115509
17;162;30062021115509
18;192;30062021115509
19;247;30062021115509
20;370;30062021115509
21;679;30062021115509
22;1023;30062021115509
23;1023;30062021115509
24;1023;30062021115509
25;1023;30062021115509
26;1023;30062021115509
27;1023;30062021115509
28;1023;30062021115509
29;1023;30062021115509
30;1023;30062021115509
31;1023;30062021115509
32;1023;30062021115509
33;1023;30062021115509
34;1023;30062021115509
35;925;30062021115509
36;708;30062021115509
37;555;30062021115509
38;448;30062021115509
39;373;30062021115509
40;325;30062021115509
41;290;30062021115509
42;274;30062021115509
43;258;30062021115509
44;248;30062021115509
45;243;30062021115509
46;238;30062021115509
47;237;30062021115509
48;236;30062021115509
49;233;30062021115509
50;238;30062021115509
51;237;30062021115509
52;237;30062021115509
53;241;30062021115509
54;241;30062021115509
55;245;30062021115509
56;252;30062021115509
57;254;30062021115509
58;260;30062021115509
59;263;30062021115509
60;267;30062021115509
61;274;30062021115509
62;275;30062021115509
63;280;30062021115509
64;284;30062021115509
65;284;30062021115509
66;286;30062021115509
67;284;30062021115509
68;281;30062021115509
69;281;30062021115509
70;275;30062021115509
71;272;30062021115509
72;271;30062021115509
73;262;30062021115509
74;261;30062021115509
75;251;30062021115509
76;249;30062021115509
77;246;30062021115509
78;237;30062021115509
79;233;30062021115509
80;228;30062021115509
81;221;30062021115509
82;221;30062021115509
83;215;30062021115509
84;214;30062021115509
85;213;30062021115509
86;209;30062021115509
87;209;30062021115509
88;208;30062021115509
89;200;30062021115509
90;200;30062021115509
91;201;30062021115509
92;194;30062021115509
93;195;30062021115509
94;190;30062021115509
95;187;30062021115509
96;187;30062021115509
97;182;30062021115509
98;179;30062021115509
99;176;30062021115509
100;174;30062021115509
101;174;30062021115509
102;171;30062021115509
103;169;30062021115509
104;168;30062021115509
105;165;30062021115509
106;167;30062021115509
107;162;30062021115509
108;160;30062021115509
109;161;30062021115509
110;157;30062021115509
111;157;30062021115509
112;158;30062021115509
113;151;30062021115509
114;152;30062021115509
115;154;30062021115509
116;151;30062021115509
117;154;30062021115509
118;149;30062021115509
119;149;30062021115509
120;148;30062021115509
121;147;30062021115509
122;146;30062021115509
123;147;30062021115509
124;142;30062021115509
125;145;30062021115509
126;142;30062021115509
127;142;30062021115509
128;143;30062021115509
129;139;30062021115509
130;141;30062021115509
131;140;30062021115509
132;137;30062021115509
133;141;30062021115509
134;137;30062021115509
135;137;30062021115509
136;138;30062021115509
137;134;30062021115509
138;136;30062021115509
139;136;30062021115509
140;133;30062021115509
141;135;30062021115509
142;133;30062021115509
143;130;30062021115509
144;133;30062021115509
145;131;30062021115509
146;134;30062021115509
147;132;30062021115509
148;130;30062021115509
149;130;30062021115509
150;130;30062021115509
151;129;30062021115509
152;130;30062021115509
153;127;30062021115509
154;130;30062021115509
155;129;30062021115509
156;129;30062021115509
157;129;30062021115509
158;128;30062021115509
159;128;30062021115509
160;129;30062021115509
161;128;30062021115509
162;129;30062021115509
163;128;30062021115509
164;126;30062021115509
165;129;30062021115509
166;127;30062021115509
167;127;30062021115509
168;128;30062021115509
169;126;30062021115509
170;128;30062021115509
171;127;30062021115509
172;126;30062021115509
173;128;30062021115509
174;126;30062021115509
175;125;30062021115509
176;127;30062021115509
177;126;30062021115509
178;128;30062021115509
179;126;30062021115509
180;126;30062021115509
181;128;30062021115509
182;127;30062021115509
183;125;30062021115509
184;127;30062021115509
185;123;30062021115509
186;127;30062021115509
187;126;30062021115509
188;123;30062021115509
189;126;30062021115509
190;125;30062021115509
191;126;30062021115509
192;128;30062021115509
193;125;30062021115509
194;125;30062021115509
195;126;30062021115509
196;125;30062021115509
197;126;30062021115509
198;125;30062021115509
199;124;30062021115509
200;0;30062021115509
0;0;30062021115510
1;148;30062021115510
2;132;30062021115510
3;131;30062021115510
4;132;30062021115510
5;132;30062021115510
6;130;30062021115510
7;131;30062021115510
8;133;30062021115510
9;133;30062021115510
10;137;30062021115510
11;134;30062021115510
12;136;30062021115510
13;140;30062021115510
14;141;30062021115510
15;147;30062021115510
16;153;30062021115510
17;165;30062021115510
18;194;30062021115510
19;247;30062021115510
20;370;30062021115510
21;685;30062021115510
22;1023;30062021115510
23;1023;30062021115510
24;1023;30062021115510
25;1023;30062021115510
26;1023;30062021115510
27;1023;30062021115510
28;1023;30062021115510
29;1023;30062021115510
30;1023;30062021115510
31;1023;30062021115510
32;1023;30062021115510
33;1023;30062021115510
34;1023;30062021115510
35;928;30062021115510
36;707;30062021115510
37;554;30062021115510
38;447;30062021115510
39;372;30062021115510
40;326;30062021115510
41;290;30062021115510
42;271;30062021115510
43;256;30062021115510
44;248;30062021115510
45;243;30062021115510
46;237;30062021115510
47;236;30062021115510
48;238;30062021115510
49;233;30062021115510
50;237;30062021115510
51;238;30062021115510
52;237;30062021115510
53;244;30062021115510
54;245;30062021115510
55;245;30062021115510
56;252;30062021115510
57;254;30062021115510
58;261;30062021115510
59;262;30062021115510
60;269;30062021115510
61;274;30062021115510
62;274;30062021115510
63;284;30062021115510
64;286;30062021115510
65;283;30062021115510
66;286;30062021115510
67;285;30062021115510
68;280;30062021115510
69;281;30062021115510
70;275;30062021115510
71;271;30062021115510
72;272;30062021115510
73;260;30062021115510
74;261;30062021115510
75;255;30062021115510
76;248;30062021115510
77;243;30062021115510
78;239;30062021115510
79;231;30062021115510
80;229;30062021115510
81;221;30062021115510
82;222;30062021115510
83;216;30062021115510
84;213;30062021115510
85;213;30062021115510
86;207;30062021115510
87;208;30062021115510
88;208;30062021115510
89;202;30062021115510
90;203;30062021115510
91;199;30062021115510
92;196;30062021115510
93;193;30062021115510
94;191;30062021115510
95;188;30062021115510
96;187;30062021115510
97;182;30062021115510
98;179;30062021115510
99;177;30062021115510
100;175;30062021115510
101;175;30062021115510
102;172;30062021115510
103;170;30062021115510
104;167;30062021115510
105;165;30062021115510
106;167;30062021115510
107;162;30062021115510
108;161;30062021115510
109;161;30062021115510
110;158;30062021115510
111;156;30062021115510
112;158;30062021115510
113;154;30062021115510
114;154;30062021115510
115;154;30062021115510
116;152;30062021115510
117;154;30062021115510
118;150;30062021115510
119;149;30062021115510
120;148;30062021115510
121;146;30062021115510
122;146;30062021115510
123;146;30062021115510
124;142;30062021115510
125;145;30062021115510
126;142;30062021115510
127;140;30062021115510
128;143;30062021115510
129;140;30062021115510
130;139;30062021115510
131;140;30062021115510
132;138;30062021115510
133;141;30062021115510
134;136;30062021115510
135;136;30062021115510
136;138;30062021115510
137;133;30062021115510
138;136;30062021115510
139;134;30062021115510
140;134;30062021115510
141;135;30062021115510
142;133;30062021115510
143;132;30062021115510
144;133;30062021115510
145;130;30062021115510
146;134;30062021115510
147;132;30062021115510
148;130;30062021115510
149;130;30062021115510
150;129;30062021115510
151;130;30062021115510
152;131;30062021115510
153;129;30062021115510
154;131;30062021115510
155;128;30062021115510
156;128;30062021115510
157;129;30062021115510
158;128;30062021115510
159;128;30062021115510
160;129;30062021115510
161;128;30062021115510
162;129;30062021115510
163;128;30062021115510
164;127;30062021115510
165;130;30062021115510
166;128;30062021115510
167;127;30062021115510
168;127;30062021115510
169;125;30062021115510
170;128;30062021115510
171;128;30062021115510
172;125;30062021115510
173;127;30062021115510
174;127;30062021115510
175;126;30062021115510
176;128;30062021115510
177;125;30062021115510
178;127;30062021115510
179;127;30062021115510
180;125;30062021115510
181;128;30062021115510
182;126;30062021115510
183;126;30062021115510
184;127;30062021115510
185;123;30062021115510
186;126;30062021115510
187;126;30062021115510
188;124;30062021115510
189;126;30062021115510
190;125;30062021115510
191;125;30062021115510
192;128;30062021115510
193;125;30062021115510
194;125;30062021115510
195;125;30062021115510
196;125;30062021115510
197;126;30062021115510
198;126;30062021115510
199;124;30062021115510
200;0;30062021115510
0;0;30062021115511
1;149;30062021115511
2;132;30062021115511
3;132;30062021115511
4;132;30062021115511
5;134;30062021115511
6;131;30062021115511
7;133;30062021115511
8;134;30062021115511
9;133;30062021115511
10;137;30062021115511
11;136;30062021115511
12;135;30062021115511
13;142;30062021115511
14;141;30062021115511
15;146;30062021115511
16;154;30062021115511
17;166;30062021115511
18;193;30062021115511
19;246;30062021115511
20;370;30062021115511
21;682;30062021115511
22;1023;30062021115511
23;1023;30062021115511
24;1023;30062021115511
25;1023;30062021115511
26;1023;30062021115511
27;1023;30062021115511
28;1023;30062021115511
29;1023;30062021115511
30;1023;30062021115511
31;1023;30062021115511
32;1023;30062021115511
33;1023;30062021115511
34;1023;30062021115511
35;924;30062021115511
36;706;30062021115511
37;554;30062021115511
38;449;30062021115511
39;375;30062021115511
40;324;30062021115511
41;292;30062021115511
42;271;30062021115511
43;256;30062021115511
44;249;30062021115511
45;240;30062021115511
46;235;30062021115511
47;234;30062021115511
48;237;30062021115511
49;232;30062021115511
50;238;30062021115511
51;236;30062021115511
52;236;30062021115511
53;242;30062021115511
54;242;30062021115511
55;245;30062021115511
56;251;30062021115511
57;251;30062021115511
58;259;30062021115511
59;263;30062021115511
60;267;30062021115511
61;271;30062021115511
62;273;30062021115511
63;281;30062021115511
64;285;30062021115511
65;284;30062021115511
66;286;30062021115511
67;284;30062021115511
68;282;30062021115511
69;282;30062021115511
70;274;30062021115511
71;275;30062021115511
72;270;30062021115511
73;261;30062021115511
74;259;30062021115511
75;250;30062021115511
76;250;30062021115511
77;246;30062021115511
78;238;30062021115511
79;233;30062021115511
80;230;30062021115511
81;221;30062021115511
82;218;30062021115511
83;216;30062021115511
84;212;30062021115511
85;211;30062021115511
86;208;30062021115511
87;207;30062021115511
88;209;30062021115511
89;201;30062021115511
90;203;30062021115511
91;201;30062021115511
92;195;30062021115511
93;195;30062021115511
94;191;30062021115511
95;186;30062021115511
96;186;30062021115511
97;182;30062021115511
98;179;30062021115511
99;178;30062021115511
100;174;30062021115511
101;175;30062021115511
102;173;30062021115511
103;168;30062021115511
104;169;30062021115511
105;166;30062021115511
106;169;30062021115511
107;161;30062021115511
108;160;30062021115511
109;161;30062021115511
110;158;30062021115511
111;156;30062021115511
112;158;30062021115511
113;153;30062021115511
114;153;30062021115511
115;154;30062021115511
116;152;30062021115511
117;154;30062021115511
118;148;30062021115511
119;150;30062021115511
120;148;30062021115511
121;146;30062021115511
122;148;30062021115511
123;146;30062021115511
124;144;30062021115511
125;145;30062021115511
126;143;30062021115511
127;143;30062021115511
128;144;30062021115511
129;141;30062021115511
130;140;30062021115511
131;140;30062021115511
132;137;30062021115511
133;140;30062021115511
134;136;30062021115511
135;136;30062021115511
136;138;30062021115511
137;134;30062021115511
138;136;30062021115511
139;135;30062021115511
140;133;30062021115511
141;135;30062021115511
142;133;30062021115511
143;132;30062021115511
144;133;30062021115511
145;130;30062021115511
146;134;30062021115511
147;131;30062021115511
148;131;30062021115511
149;131;30062021115511
150;130;30062021115511
151;131;30062021115511
152;131;30062021115511
153;128;30062021115511
154;131;30062021115511
155;129;30062021115511
156;129;30062021115511
157;129;30062021115511
158;128;30062021115511
159;128;30062021115511
160;130;30062021115511
161;128;30062021115511
162;129;30062021115511
163;128;30062021115511
164;127;30062021115511
165;129;30062021115511
166;128;30062021115511
167;127;30062021115511
168;129;30062021115511
169;126;30062021115511
170;128;30062021115511
171;128;30062021115511
172;127;30062021115511
173;128;30062021115511
174;126;30062021115511
175;126;30062021115511
176;128;30062021115511
177;126;30062021115511
178;128;30062021115511
179;127;30062021115511
180;126;30062021115511
181;128;30062021115511
182;127;30062021115511
183;126;30062021115511
184;126;30062021115511
185;125;30062021115511
186;128;30062021115511
187;127;30062021115511
188;124;30062021115511
189;127;30062021115511
190;124;30062021115511
191;125;30062021115511
192;128;30062021115511
193;126;30062021115511
194;126;30062021115511
195;126;30062021115511
196;125;30062021115511
197;127;30062021115511
198;127;30062021115511
199;125;30062021115511
200;0;30062021115511
0;0;30062021115511
1;147;30062021115511
2;131;30062021115511
3;131;30062021115511
4;131;30062021115511
5;133;30062021115511
6;131;30062021115511
7;132;30062021115511
8;133;30062021115511
9;132;30062021115511
10;136;30062021115511
11;135;30062021115511
12;137;30062021115511
13;142;30062021115511
14;143;30062021115511
15;148;30062021115511
16;154;30062021115511
17;163;30062021115511
18;194;30062021115511
19;246;30062021115511
20;369;30062021115511
21;676;30062021115511
22;1023;30062021115511
23;1023;30062021115511
24;1023;30062021115511
25;1023;30062021115511
26;1023;30062021115511
27;1023;30062021115511
28;1023;30062021115511
29;1023;30062021115511
30;1023;30062021115511
31;1023;30062021115511
32;1023;30062021115511
33;1023;30062021115511
34;1023;30062021115511
35;934;30062021115511
36;715;30062021115511
37;560;30062021115511
38;456;30062021115511
39;376;30062021115511
40;328;30062021115511
41;292;30062021115511
42;274;30062021115511
43;257;30062021115511
44;250;30062021115511
45;243;30062021115511
46;235;30062021115511
47;236;30062021115511
48;234;30062021115511
49;236;30062021115511
50;237;30062021115511
51;235;30062021115511
52;237;30062021115511
53;243;30062021115511
54;244;30062021115511
55;245;30062021115511
56;251;30062021115511
57;252;30062021115511
58;260;30062021115511
59;261;30062021115511
60;269;30062021115511
61;274;30062021115511
62;274;30062021115511
63;280;30062021115511
64;285;30062021115511
65;285;30062021115511
66;285;30062021115511
67;284;30062021115511
68;282;30062021115511
69;280;30062021115511
70;277;30062021115511
71;271;30062021115511
72;271;30062021115511
73;262;30062021115511
74;263;30062021115511
75;252;30062021115511
76;248;30062021115511
77;243;30062021115511
78;237;30062021115511
79;233;30062021115511
80;229;30062021115511
81;220;30062021115511
82;221;30062021115511
83;214;30062021115511
84;212;30062021115511
85;211;30062021115511
86;208;30062021115511
87;210;30062021115511
88;210;30062021115511
89;202;30062021115511
90;202;30062021115511
91;201;30062021115511
92;194;30062021115511
93;194;30062021115511
94;189;30062021115511
95;187;30062021115511
96;185;30062021115511
97;180;30062021115511
98;180;30062021115511
99;178;30062021115511
100;174;30062021115511
101;174;30062021115511
102;171;30062021115511
103;171;30062021115511
104;168;30062021115511
105;166;30062021115511
106;168;30062021115511
107;163;30062021115511
108;163;30062021115511
109;162;30062021115511
110;157;30062021115511
111;156;30062021115511
112;158;30062021115511
113;152;30062021115511
114;154;30062021115511
115;154;30062021115511
116;151;30062021115511
117;153;30062021115511
118;150;30062021115511
119;148;30062021115511
120;146;30062021115511
121;145;30062021115511
122;147;30062021115511
123;146;30062021115511
124;143;30062021115511
125;144;30062021115511
126;142;30062021115511
127;141;30062021115511
128;143;30062021115511
129;140;30062021115511
130;141;30062021115511
131;141;30062021115511
132;137;30062021115511
133;140;30062021115511
134;136;30062021115511
135;135;30062021115511
136;137;30062021115511
137;134;30062021115511
138;135;30062021115511
139;135;30062021115511
140;132;30062021115511
141;134;30062021115511
142;133;30062021115511
143;133;30062021115511
144;134;30062021115511
145;130;30062021115511
146;133;30062021115511
147;131;30062021115511
148;130;30062021115511
149;130;30062021115511
150;129;30062021115511
151;129;30062021115511
152;131;30062021115511
153;129;30062021115511
154;130;30062021115511
155;128;30062021115511
156;128;30062021115511
157;129;30062021115511
158;127;30062021115511
159;127;30062021115511
160;128;30062021115511
161;127;30062021115511
162;128;30062021115511
163;128;30062021115511
164;127;30062021115511
165;129;30062021115511
166;128;30062021115511
167;128;30062021115511
168;129;30062021115511
169;126;30062021115511
170;127;30062021115511
171;127;30062021115511
172;127;30062021115511
173;127;30062021115511
174;126;30062021115511
175;126;30062021115511
176;128;30062021115511
177;125;30062021115511
178;128;30062021115511
179;127;30062021115511
180;125;30062021115511
181;128;30062021115511
182;127;30062021115511
183;126;30062021115511
184;126;30062021115511
185;123;30062021115511
186;128;30062021115511
187;126;30062021115511
188;124;30062021115511
189;126;30062021115511
190;125;30062021115511
191;125;30062021115511
192;129;30062021115511
193;126;30062021115511
194;125;30062021115511
195;125;30062021115511
196;124;30062021115511
197;126;30062021115511
198;126;30062021115511
199;125;30062021115511
200;0;30062021115511
0;0;30062021115512
1;149;30062021115512
2;132;30062021115512
3;131;30062021115512
4;132;30062021115512
5;134;30062021115512
6;131;30062021115512
7;133;30062021115512
8;135;30062021115512
9;132;30062021115512
10;135;30062021115512
11;135;30062021115512
12;136;30062021115512
13;141;30062021115512
14;143;30062021115512
15;148;30062021115512
16;154;30062021115512
17;165;30062021115512
18;193;30062021115512
19;247;30062021115512
20;368;30062021115512
21;682;30062021115512
22;1023;30062021115512
23;1023;30062021115512
24;1023;30062021115512
25;1023;30062021115512
26;1023;30062021115512
27;1023;30062021115512
28;1023;30062021115512
29;1023;30062021115512
30;1023;30062021115512
31;1023;30062021115512
32;1023;30062021115512
33;1023;30062021115512
34;1023;30062021115512
35;929;30062021115512
36;708;30062021115512
37;553;30062021115512
38;449;30062021115512
39;372;30062021115512
40;324;30062021115512
41;290;30062021115512
42;273;30062021115512
43;255;30062021115512
44;246;30062021115512
45;242;30062021115512
46;237;30062021115512
47;235;30062021115512
48;237;30062021115512
49;234;30062021115512
50;235;30062021115512
51;235;30062021115512
52;234;30062021115512
53;240;30062021115512
54;243;30062021115512
55;246;30062021115512
56;250;30062021115512
57;254;30062021115512
58;259;30062021115512
59;261;30062021115512
60;269;30062021115512
61;273;30062021115512
62;273;30062021115512
63;282;30062021115512
64;283;30062021115512
65;279;30062021115512
66;284;30062021115512
67;285;30062021115512
68;281;30062021115512
69;280;30062021115512
70;277;30062021115512
71;274;30062021115512
72;268;30062021115512
73;264;30062021115512
74;261;30062021115512
75;250;30062021115512
76;249;30062021115512
77;245;30062021115512
78;238;30062021115512
79;234;30062021115512
80;229;30062021115512
81;221;30062021115512
82;222;30062021115512
83;215;30062021115512
84;213;30062021115512
85;210;30062021115512
86;208;30062021115512
87;205;30062021115512
88;208;30062021115512
89;200;30062021115512
90;202;30062021115512
91;201;30062021115512
92;194;30062021115512
93;194;30062021115512
94;192;30062021115512
95;187;30062021115512
96;187;30062021115512
97;182;30062021115512
98;178;30062021115512
99;177;30062021115512
100;174;30062021115512
101;175;30062021115512
102;171;30062021115512
103;169;30062021115512
104;168;30062021115512
105;166;30062021115512
106;166;30062021115512
107;162;30062021115512
108;163;30062021115512
109;161;30062021115512
110;158;30062021115512
111;157;30062021115512
112;157;30062021115512
113;153;30062021115512
114;155;30062021115512
115;155;30062021115512
116;152;30062021115512
117;153;30062021115512
118;149;30062021115512
119;149;30062021115512
120;146;30062021115512
121;146;30062021115512
122;145;30062021115512
123;145;30062021115512
124;144;30062021115512
125;145;30062021115512
126;143;30062021115512
127;143;30062021115512
128;144;30062021115512
129;139;30062021115512
130;141;30062021115512
131;142;30062021115512
132;138;30062021115512
133;141;30062021115512
134;136;30062021115512
135;136;30062021115512
136;137;30062021115512
137;134;30062021115512
138;136;30062021115512
139;135;30062021115512
140;133;30062021115512
141;135;30062021115512
142;133;30062021115512
143;133;30062021115512
144;134;30062021115512
145;131;30062021115512
146;133;30062021115512
147;132;30062021115512
148;130;30062021115512
149;131;30062021115512
150;130;30062021115512
151;130;30062021115512
152;131;30062021115512
153;129;30062021115512
154;132;30062021115512
155;128;30062021115512
156;129;30062021115512
157;130;30062021115512
158;128;30062021115512
159;128;30062021115512
160;130;30062021115512
161;129;30062021115512
162;130;30062021115512
163;129;30062021115512
164;128;30062021115512
165;129;30062021115512
166;127;30062021115512
167;128;30062021115512
168;129;30062021115512
169;126;30062021115512
170;128;30062021115512
171;127;30062021115512
172;127;30062021115512
173;128;30062021115512
174;127;30062021115512
175;126;30062021115512
176;128;30062021115512
177;126;30062021115512
178;127;30062021115512
179;127;30062021115512
180;126;30062021115512
181;128;30062021115512
182;126;30062021115512
183;125;30062021115512
184;127;30062021115512
185;124;30062021115512
186;128;30062021115512
187;127;30062021115512
188;125;30062021115512
189;125;30062021115512
190;125;30062021115512
191;125;30062021115512
192;128;30062021115512
193;125;30062021115512
194;126;30062021115512
195;126;30062021115512
196;124;30062021115512
197;126;30062021115512
198;126;30062021115512
199;124;30062021115512
200;0;30062021115512
0;0;30062021115512
1;148;30062021115512
2;132;30062021115512
3;131;30062021115512
4;132;30062021115512
5;132;30062021115512
6;131;30062021115512
7;132;30062021115512
8;134;30062021115512
9;133;30062021115512
10;136;30062021115512
11;135;30062021115512
12;136;30062021115512
13;141;30062021115512
14;141;30062021115512
15;147;30062021115512
16;153;30062021115512
17;164;30062021115512
18;193;30062021115512
19;248;30062021115512
20;366;30062021115512
21;675;30062021115512
22;1023;30062021115512
23;1023;30062021115512
24;1023;30062021115512
25;1023;30062021115512
26;1023;30062021115512
27;1023;30062021115512
28;1023;30062021115512
29;1023;30062021115512
30;1023;30062021115512
31;1023;30062021115512
32;1023;30062021115512
33;1023;30062021115512
34;1023;30062021115512
35;933;30062021115512
36;717;30062021115512
37;564;30062021115512
38;452;30062021115512
39;382;30062021115512
40;326;30062021115512
41;292;30062021115512
42;272;30062021115512
43;258;30062021115512
44;249;30062021115512
45;241;30062021115512
46;235;30062021115512
47;234;30062021115512
48;238;30062021115512
49;234;30062021115512
50;235;30062021115512
51;236;30062021115512
52;235;30062021115512
53;241;30062021115512
54;243;30062021115512
55;247;30062021115512
56;250;30062021115512
57;252;30062021115512
58;261;30062021115512
59;262;30062021115512
60;268;30062021115512
61;271;30062021115512
62;272;30062021115512
63;280;30062021115512
64;282;30062021115512
65;278;30062021115512
66;284;30062021115512
67;283;30062021115512
68;282;30062021115512
69;281;30062021115512
70;276;30062021115512
71;275;30062021115512
72;271;30062021115512
73;262;30062021115512
74;262;30062021115512
75;252;30062021115512
76;248;30062021115512
77;244;30062021115512
78;238;30062021115512
79;235;30062021115512
80;230;30062021115512
81;222;30062021115512
82;221;30062021115512
83;214;30062021115512
84;213;30062021115512
85;211;30062021115512
86;209;30062021115512
87;208;30062021115512
88;207;30062021115512
89;202;30062021115512
90;202;30062021115512
91;200;30062021115512
92;195;30062021115512
93;194;30062021115512
94;190;30062021115512
95;186;30062021115512
96;187;30062021115512
97;182;30062021115512
98;178;30062021115512
99;176;30062021115512
100;173;30062021115512
101;175;30062021115512
102;172;30062021115512
103;170;30062021115512
104;169;30062021115512
105;164;30062021115512
106;168;30062021115512
107;162;30062021115512
108;162;30062021115512
109;162;30062021115512
110;156;30062021115512
111;157;30062021115512
112;158;30062021115512
113;152;30062021115512
114;154;30062021115512
115;154;30062021115512
116;151;30062021115512
117;153;30062021115512
118;150;30062021115512
119;149;30062021115512
120;148;30062021115512
121;146;30062021115512
122;148;30062021115512
123;145;30062021115512
124;142;30062021115512
125;146;30062021115512
126;142;30062021115512
127;141;30062021115512
128;143;30062021115512
129;140;30062021115512
130;140;30062021115512
131;141;30062021115512
132;138;30062021115512
133;141;30062021115512
134;137;30062021115512
135;137;30062021115512
136;137;30062021115512
137;133;30062021115512
138;136;30062021115512
139;134;30062021115512
140;133;30062021115512
141;135;30062021115512
142;133;30062021115512
143;132;30062021115512
144;134;30062021115512
145;131;30062021115512
146;134;30062021115512
147;131;30062021115512
148;129;30062021115512
149;131;30062021115512
150;129;30062021115512
151;130;30062021115512
152;131;30062021115512
153;128;30062021115512
154;130;30062021115512
155;129;30062021115512
156;128;30062021115512
157;129;30062021115512
158;128;30062021115512
159;128;30062021115512
160;128;30062021115512
161;127;30062021115512
162;128;30062021115512
163;128;30062021115512
164;127;30062021115512
165;129;30062021115512
166;128;30062021115512
167;127;30062021115512
168;129;30062021115512
169;126;30062021115512
170;127;30062021115512
171;127;30062021115512
172;126;30062021115512
173;127;30062021115512
174;126;30062021115512
175;125;30062021115512
176;127;30062021115512
177;125;30062021115512
178;128;30062021115512
179;126;30062021115512
180;126;30062021115512
181;127;30062021115512
182;126;30062021115512
183;125;30062021115512
184;126;30062021115512
185;124;30062021115512
186;127;30062021115512
187;125;30062021115512
188;125;30062021115512
189;126;30062021115512
190;125;30062021115512
191;125;30062021115512
192;128;30062021115512
193;124;30062021115512
194;125;30062021115512
195;125;30062021115512
196;125;30062021115512
197;126;30062021115512
198;126;30062021115512
199;125;30062021115512
200;0;30062021115512
0;0;30062021115512
1;148;30062021115512
2;132;30062021115512
3;131;30062021115512
4;132;30062021115512
5;133;30062021115512
6;131;30062021115512
7;132;30062021115512
8;134;30062021115512
9;132;30062021115512
10;137;30062021115512
11;135;30062021115512
12;135;30062021115512
13;141;30062021115512
14;142;30062021115512
15;147;30062021115512
16;154;30062021115512
17;164;30062021115512
18;193;30062021115512
19;245;30062021115512
20;366;30062021115512
21;673;30062021115512
22;1023;30062021115512
23;1023;30062021115512
24;1023;30062021115512
25;1023;30062021115512
26;1023;30062021115512
27;1023;30062021115512
28;1023;30062021115512
29;1023;30062021115512
30;1023;30062021115512
31;1023;30062021115512
32;1023;30062021115512
33;1023;30062021115512
34;1023;30062021115512
35;928;30062021115512
36;707;30062021115512
37;556;30062021115512
38;449;30062021115512
39;375;30062021115512
40;327;30062021115512
41;289;30062021115512
42;275;30062021115512
43;255;30062021115512
44;247;30062021115512
45;241;30062021115512
46;239;30062021115512
47;233;30062021115512
48;235;30062021115512
49;233;30062021115512
50;235;30062021115512
51;236;30062021115512
52;234;30062021115512
53;243;30062021115512
54;243;30062021115512
55;244;30062021115512
56;251;30062021115512
57;253;30062021115512
58;260;30062021115512
59;261;30062021115512
60;271;30062021115512
61;272;30062021115512
62;276;30062021115512
63;280;30062021115512
64;283;30062021115512
65;280;30062021115512
66;286;30062021115512
67;282;30062021115512
68;278;30062021115512
69;281;30062021115512
70;274;30062021115512
71;269;30062021115512
72;269;30062021115512
73;259;30062021115512
74;261;30062021115512
75;252;30062021115512
76;249;30062021115512
77;245;30062021115512
78;237;30062021115512
79;230;30062021115512
80;227;30062021115512
81;222;30062021115512
82;220;30062021115512
83;215;30062021115512
84;212;30062021115512
85;211;30062021115512
86;206;30062021115512
87;208;30062021115512
88;207;30062021115512
89;202;30062021115512
90;203;30062021115512
91;199;30062021115512
92;193;30062021115512
93;195;30062021115512
94;190;30062021115512
95;185;30062021115512
96;185;30062021115512
97;181;30062021115512
98;179;30062021115512
99;177;30062021115512
100;175;30062021115512
101;175;30062021115512
102;171;30062021115512
103;170;30062021115512
104;168;30062021115512
105;165;30062021115512
106;167;30062021115512
107;163;30062021115512
108;162;30062021115512
109;161;30062021115512
110;157;30062021115512
111;158;30062021115512
112;158;30062021115512
113;154;30062021115512
114;154;30062021115512
115;154;30062021115512
116;151;30062021115512
117;153;30062021115512
118;150;30062021115512
119;150;30062021115512
120;147;30062021115512
121;146;30062021115512
122;146;30062021115512
123;146;30062021115512
124;144;30062021115512
125;146;30062021115512
126;141;30062021115512
127;142;30062021115512
128;142;30062021115512
129;140;30062021115512
130;141;30062021115512
131;140;30062021115512
132;138;30062021115512
133;141;30062021115512
134;137;30062021115512
135;137;30062021115512
136;138;30062021115512
137;135;30062021115512
138;136;30062021115512
139;136;30062021115512
140;133;30062021115512
141;135;30062021115512
142;132;30062021115512
143;132;30062021115512
144;134;30062021115512
145;130;30062021115512
146;134;30062021115512
147;132;30062021115512
148;130;30062021115512
149;131;30062021115512
150;130;30062021115512
151;130;30062021115512
152;130;30062021115512
153;129;30062021115512
154;130;30062021115512
155;128;30062021115512
156;127;30062021115512
157;129;30062021115512
158;129;30062021115512
159;128;30062021115512
160;129;30062021115512
161;128;30062021115512
162;129;30062021115512
163;129;30062021115512
164;127;30062021115512
165;128;30062021115512
166;127;30062021115512
167;127;30062021115512
168;130;30062021115512
169;125;30062021115512
170;128;30062021115512
171;127;30062021115512
172;127;30062021115512
173;128;30062021115512
174;127;30062021115512
175;126;30062021115512
176;129;30062021115512
177;126;30062021115512
178;127;30062021115512
179;126;30062021115512
180;126;30062021115512
181;127;30062021115512
182;127;30062021115512
183;125;30062021115512
184;127;30062021115512
185;125;30062021115512
186;128;30062021115512
187;127;30062021115512
188;125;30062021115512
189;126;30062021115512
190;124;30062021115512
191;125;30062021115512
192;128;30062021115512
193;125;30062021115512
194;125;30062021115512
195;126;30062021115512
196;125;30062021115512
197;127;30062021115512
198;125;30062021115512
199;125;30062021115512
200;0;30062021115512
0;0;30062021115512
1;148;30062021115512
2;132;30062021115512
3;130;30062021115512
4;131;30062021115512
5;132;30062021115512
6;131;30062021115512
7;132;30062021115512
8;133;30062021115512
9;131;30062021115512
10;136;30062021115512
11;134;30062021115512
12;136;30062021115512
13;140;30062021115512
14;141;30062021115512
15;147;30062021115512
16;152;30062021115512
17;163;30062021115512
18;194;30062021115512
19;247;30062021115512
20;365;30062021115512
21;669;30062021115512
22;1023;30062021115512
23;1023;30062021115512
24;1023;30062021115512
25;1023;30062021115512
26;1023;30062021115512
27;1023;30062021115512
28;1023;30062021115512
29;1023;30062021115512
30;1023;30062021115512
31;1023;30062021115512
32;1023;30062021115512
33;1023;30062021115512
34;1023;30062021115512
35;935;30062021115512
36;715;30062021115512
37;560;30062021115512
38;453;30062021115512
39;377;30062021115512
40;332;30062021115512
41;294;30062021115512
42;274;30062021115512
43;256;30062021115512
44;246;30062021115512
45;240;30062021115512
46;235;30062021115512
47;235;30062021115512
48;235;30062021115512
49;230;30062021115512
50;236;30062021115512
51;235;30062021115512
52;236;30062021115512
53;238;30062021115512
54;242;30062021115512
55;244;30062021115512
56;248;30062021115512
57;252;30062021115512
58;257;30062021115512
59;260;30062021115512
60;267;30062021115512
61;272;30062021115512
62;274;30062021115512
63;280;30062021115512
64;282;30062021115512
65;279;30062021115512
66;284;30062021115512
67;283;30062021115512
68;282;30062021115512
69;279;30062021115512
70;275;30062021115512
71;269;30062021115512
72;268;30062021115512
73;260;30062021115512
74;260;30062021115512
75;253;30062021115512
76;247;30062021115512
77;246;30062021115512
78;238;30062021115512
79;232;30062021115512
80;229;30062021115512
81;221;30062021115512
82;222;30062021115512
83;214;30062021115512
84;212;30062021115512
85;210;30062021115512
86;208;30062021115512
87;207;30062021115512
88;207;30062021115512
89;202;30062021115512
90;202;30062021115512
91;198;30062021115512
92;195;30062021115512
93;195;30062021115512
94;192;30062021115512
95;187;30062021115512
96;185;30062021115512
97;181;30062021115512
98;180;30062021115512
99;177;30062021115512
100;174;30062021115512
101;175;30062021115512
102;171;30062021115512
103;170;30062021115512
104;167;30062021115512
105;165;30062021115512
106;166;30062021115512
107;162;30062021115512
108;162;30062021115512
109;161;30062021115512
110;156;30062021115512
111;156;30062021115512
112;157;30062021115512
113;153;30062021115512
114;155;30062021115512
115;153;30062021115512
116;152;30062021115512
117;153;30062021115512
118;150;30062021115512
119;148;30062021115512
120;147;30062021115512
121;145;30062021115512
122;145;30062021115512
123;145;30062021115512
124;143;30062021115512
125;145;30062021115512
126;142;30062021115512
127;141;30062021115512
128;143;30062021115512
129;140;30062021115512
130;140;30062021115512
131;141;30062021115512
132;137;30062021115512
133;139;30062021115512
134;136;30062021115512
135;136;30062021115512
136;138;30062021115512
137;135;30062021115512
138;136;30062021115512
139;134;30062021115512
140;133;30062021115512
141;135;30062021115512
142;132;30062021115512
143;132;30062021115512
144;133;30062021115512
145;131;30062021115512
146;133;30062021115512
147;131;30062021115512
148;130;30062021115512
149;131;30062021115512
150;129;30062021115512
151;129;30062021115512
152;131;30062021115512
153;128;30062021115512
154;130;30062021115512
155;129;30062021115512
156;127;30062021115512
157;128;30062021115512
158;127;30062021115512
159;127;30062021115512
160;129;30062021115512
161;126;30062021115512
162;128;30062021115512
163;129;30062021115512
164;127;30062021115512
165;129;30062021115512
166;127;30062021115512
167;127;30062021115512
168;128;30062021115512
169;124;30062021115512
170;127;30062021115512
171;127;30062021115512
172;127;30062021115512
173;128;30062021115512
174;126;30062021115512
175;126;30062021115512
176;128;30062021115512
177;126;30062021115512
178;127;30062021115512
179;127;30062021115512
180;126;30062021115512
181;128;30062021115512
182;125;30062021115512
183;125;30062021115512
184;126;30062021115512
185;124;30062021115512
186;127;30062021115512
187;126;30062021115512
188;125;30062021115512
189;125;30062021115512
190;124;30062021115512
191;124;30062021115512
192;128;30062021115512
193;126;30062021115512
194;125;30062021115512
195;125;30062021115512
196;124;30062021115512
197;126;30062021115512
198;126;30062021115512
199;125;30062021115512
200;0;30062021115512
0;0;30062021115513
1;149;30062021115513
2;132;30062021115513
3;131;30062021115513
4;133;30062021115513
5;133;30062021115513
6;132;30062021115513
7;132;30062021115513
8;135;30062021115513
9;132;30062021115513
10;137;30062021115513
11;135;30062021115513
12;135;30062021115513
13;141;30062021115513
14;141;30062021115513
15;146;30062021115513
16;155;30062021115513
17;164;30062021115513
18;191;30062021115513
19;246;30062021115513
20;368;30062021115513
21;673;30062021115513
22;1023;30062021115513
23;1023;30062021115513
24;1023;30062021115513
25;1023;30062021115513
26;1023;30062021115513
27;1023;30062021115513
28;1023;30062021115513
29;1023;30062021115513
30;1023;30062021115513
31;1023;30062021115513
32;1023;30062021115513
33;1023;30062021115513
34;1023;30062021115513
35;934;30062021115513
36;713;30062021115513
37;556;30062021115513
38;450;30062021115513
39;377;30062021115513
40;322;30062021115513
41;295;30062021115513
42;274;30062021115513
43;255;30062021115513
44;246;30062021115513
45;242;30062021115513
46;236;30062021115513
47;235;30062021115513
48;235;30062021115513
49;234;30062021115513
50;237;30062021115513
51;234;30062021115513
52;234;30062021115513
53;240;30062021115513
54;242;30062021115513
55;245;30062021115513
56;250;30062021115513
57;253;30062021115513
58;259;30062021115513
59;262;30062021115513
60;265;30062021115513
61;272;30062021115513
62;273;30062021115513
63;279;30062021115513
64;283;30062021115513
65;282;30062021115513
66;286;30062021115513
67;285;30062021115513
68;283;30062021115513
69;279;30062021115513
70;274;30062021115513
71;271;30062021115513
72;270;30062021115513
73;261;30062021115513
74;260;30062021115513
75;252;30062021115513
76;247;30062021115513
77;243;30062021115513
78;239;30062021115513
79;233;30062021115513
80;229;30062021115513
81;220;30062021115513
82;223;30062021115513
83;216;30062021115513
84;212;30062021115513
85;212;30062021115513
86;208;30062021115513
87;208;30062021115513
88;207;30062021115513
89;203;30062021115513
90;204;30062021115513
91;201;30062021115513
92;194;30062021115513
93;193;30062021115513
94;191;30062021115513
95;186;30062021115513
96;188;30062021115513
97;182;30062021115513
98;179;30062021115513
99;177;30062021115513
100;173;30062021115513
101;176;30062021115513
102;170;30062021115513
103;170;30062021115513
104;169;30062021115513
105;165;30062021115513
106;166;30062021115513
107;163;30062021115513
108;161;30062021115513
109;162;30062021115513
110;157;30062021115513
111;158;30062021115513
112;158;30062021115513
113;152;30062021115513
114;152;30062021115513
115;155;30062021115513
116;150;30062021115513
117;155;30062021115513
118;150;30062021115513
119;150;30062021115513
120;148;30062021115513
121;146;30062021115513
122;146;30062021115513
123;146;30062021115513
124;142;30062021115513
125;145;30062021115513
126;142;30062021115513
127;141;30062021115513
128;144;30062021115513
129;140;30062021115513
130;140;30062021115513
131;140;30062021115513
132;138;30062021115513
133;140;30062021115513
134;136;30062021115513
135;137;30062021115513
136;138;30062021115513
137;134;30062021115513
138;137;30062021115513
139;135;30062021115513
140;133;30062021115513
141;134;30062021115513
142;132;30062021115513
143;132;30062021115513
144;134;30062021115513
145;130;30062021115513
146;133;30062021115513
147;132;30062021115513
148;130;30062021115513
149;130;30062021115513
150;130;30062021115513
151;130;30062021115513
152;131;30062021115513
153;128;30062021115513
154;131;30062021115513
155;128;30062021115513
156;128;30062021115513
157;128;30062021115513
158;128;30062021115513
159;128;30062021115513
160;129;30062021115513
161;126;30062021115513
162;129;30062021115513
163;128;30062021115513
164;127;30062021115513
165;130;30062021115513
166;128;30062021115513
167;127;30062021115513
168;128;30062021115513
169;125;30062021115513
170;128;30062021115513
171;127;30062021115513
172;126;30062021115513
173;128;30062021115513
174;126;30062021115513
175;127;30062021115513
176;127;30062021115513
177;126;30062021115513
178;128;30062021115513
179;127;30062021115513
180;126;30062021115513
181;128;30062021115513
182;127;30062021115513
183;125;30062021115513
184;127;30062021115513
185;124;30062021115513
186;127;30062021115513
187;127;30062021115513
188;124;30062021115513
189;126;30062021115513
190;126;30062021115513
191;125;30062021115513
192;128;30062021115513
193;125;30062021115513
194;125;30062021115513
195;126;30062021115513
196;125;30062021115513
197;126;30062021115513
198;125;30062021115513
199;125;30062021115513
200;0;30062021115513
0;0;30062021115513
1;149;30062021115513
2;132;30062021115513
3;131;30062021115513
4;132;30062021115513
5;133;30062021115513
6;132;30062021115513
7;133;30062021115513
8;135;30062021115513
9;134;30062021115513
10;137;30062021115513
11;136;30062021115513
12;137;30062021115513
13;142;30062021115513
14;143;30062021115513
15;149;30062021115513
16;154;30062021115513
17;166;30062021115513
18;193;30062021115513
19;245;30062021115513
20;366;30062021115513
21;664;30062021115513
22;1023;30062021115513
23;1023;30062021115513
24;1023;30062021115513
25;1023;30062021115513
26;1023;30062021115513
27;1023;30062021115513
28;1023;30062021115513
29;1023;30062021115513
30;1023;30062021115513
31;1023;30062021115513
32;1023;30062021115513
33;1023;30062021115513
34;1023;30062021115513
35;941;30062021115513
36;726;30062021115513
37;562;30062021115513
38;453;30062021115513
39;380;30062021115513
40;327;30062021115513
41;289;30062021115513
42;273;30062021115513
43;256;30062021115513
44;249;30062021115513
45;242;30062021115513
46;233;30062021115513
47;236;30062021115513
48;235;30062021115513
49;232;30062021115513
50;236;30062021115513
51;235;30062021115513
52;236;30062021115513
53;241;30062021115513
54;240;30062021115513
55;243;30062021115513
56;248;30062021115513
57;252;30062021115513
58;259;30062021115513
59;262;30062021115513
60;268;30062021115513
61;272;30062021115513
62;273;30062021115513
63;280;30062021115513
64;284;30062021115513
65;280;30062021115513
66;284;30062021115513
67;281;30062021115513
68;281;30062021115513
69;281;30062021115513
70;271;30062021115513
71;272;30062021115513
72;269;30062021115513
73;260;30062021115513
74;259;30062021115513
75;253;30062021115513
76;247;30062021115513
77;243;30062021115513
78;238;30062021115513
79;233;30062021115513
80;228;30062021115513
81;221;30062021115513
82;219;30062021115513
83;215;30062021115513
84;213;30062021115513
85;212;30062021115513
86;208;30062021115513
87;208;30062021115513
88;209;30062021115513
89;199;30062021115513
90;203;30062021115513
91;199;30062021115513
92;194;30062021115513
93;193;30062021115513
94;190;30062021115513
95;187;30062021115513
96;185;30062021115513
97;181;30062021115513
98;180;30062021115513
99;177;30062021115513
100;175;30062021115513
101;174;30062021115513
102;170;30062021115513
103;170;30062021115513
104;168;30062021115513
105;165;30062021115513
106;166;30062021115513
107;162;30062021115513
108;161;30062021115513
109;161;30062021115513
110;158;30062021115513
111;156;30062021115513
112;158;30062021115513
113;154;30062021115513
114;154;30062021115513
115;154;30062021115513
116;151;30062021115513
117;154;30062021115513
118;149;30062021115513
119;149;30062021115513
120;147;30062021115513
121;145;30062021115513
122;147;30062021115513
123;146;30062021115513
124;143;30062021115513
125;145;30062021115513
126;141;30062021115513
127;142;30062021115513
128;143;30062021115513
129;138;30062021115513
130;139;30062021115513
131;140;30062021115513
132;138;30062021115513
133;141;30062021115513
134;136;30062021115513
135;136;30062021115513
136;138;30062021115513
137;135;30062021115513
138;136;30062021115513
139;133;30062021115513
140;133;30062021115513
141;135;30062021115513
142;133;30062021115513
143;132;30062021115513
144;133;30062021115513
145;130;30062021115513
146;132;30062021115513
147;131;30062021115513
148;130;30062021115513
149;130;30062021115513
150;130;30062021115513
151;130;30062021115513
152;132;30062021115513
153;129;30062021115513
154;130;30062021115513
155;129;30062021115513
156;126;30062021115513
157;129;30062021115513
158;129;30062021115513
159;129;30062021115513
160;131;30062021115513
161;128;30062021115513
162;130;30062021115513
163;128;30062021115513
164;127;30062021115513
165;129;30062021115513
166;127;30062021115513
167;128;30062021115513
168;129;30062021115513
169;126;30062021115513
170;129;30062021115513
171;129;30062021115513
172;127;30062021115513
173;128;30062021115513
174;126;30062021115513
175;126;30062021115513
176;127;30062021115513
177;125;30062021115513
178;127;30062021115513
179;126;30062021115513
180;126;30062021115513
181;128;30062021115513
182;127;30062021115513
183;126;30062021115513
184;127;30062021115513
185;124;30062021115513
186;127;30062021115513
187;126;30062021115513
188;124;30062021115513
189;125;30062021115513
190;125;30062021115513
191;125;30062021115513
192;128;30062021115513
193;125;30062021115513
194;126;30062021115513
195;126;30062021115513
196;125;30062021115513
197;126;30062021115513
198;126;30062021115513
199;125;30062021115513
200;0;30062021115513
0;0;30062021115513
1;148;30062021115513
2;132;30062021115513
3;131;30062021115513
4;133;30062021115513
5;134;30062021115513
6;130;30062021115513
7;134;30062021115513
8;134;30062021115513
9;133;30062021115513
10;136;30062021115513
11;135;30062021115513
12;137;30062021115513
13;142;30062021115513
14;143;30062021115513
15;148;30062021115513
16;154;30062021115513
17;164;30062021115513
18;193;30062021115513
19;244;30062021115513
20;366;30062021115513
21;666;30062021115513
22;1023;30062021115513
23;1023;30062021115513
24;1023;30062021115513
25;1023;30062021115513
26;1023;30062021115513
27;1023;30062021115513
28;1023;30062021115513
29;1023;30062021115513
30;1023;30062021115513
31;1023;30062021115513
32;1023;30062021115513
33;1023;30062021115513
34;1023;30062021115513
35;936;30062021115513
36;720;30062021115513
37;559;30062021115513
38;454;30062021115513
39;378;30062021115513
40;329;30062021115513
41;292;30062021115513
42;273;30062021115513
43;258;30062021115513
44;250;30062021115513
45;241;30062021115513
46;234;30062021115513
47;235;30062021115513
48;236;30062021115513
49;232;30062021115513
50;238;30062021115513
51;237;30062021115513
52;239;30062021115513
53;239;30062021115513
54;241;30062021115513
55;245;30062021115513
56;247;30062021115513
57;251;30062021115513
58;259;30062021115513
59;261;30062021115513
60;265;30062021115513
61;270;30062021115513
62;274;30062021115513
63;280;30062021115513
64;281;30062021115513
65;280;30062021115513
66;286;30062021115513
67;282;30062021115513
68;280;30062021115513
69;282;30062021115513
70;273;30062021115513
71;270;30062021115513
72;269;30062021115513
73;263;30062021115513
74;261;30062021115513
75;252;30062021115513
76;248;30062021115513
77;245;30062021115513
78;237;30062021115513
79;230;30062021115513
80;229;30062021115513
81;219;30062021115513
82;220;30062021115513
83;215;30062021115513
84;212;30062021115513
85;210;30062021115513
86;209;30062021115513
87;207;30062021115513
88;209;30062021115513
89;201;30062021115513
90;203;30062021115513
91;199;30062021115513
92;196;30062021115513
93;192;30062021115513
94;189;30062021115513
95;187;30062021115513
96;186;30062021115513
97;181;30062021115513
98;180;30062021115513
99;177;30062021115513
100;174;30062021115513
101;174;30062021115513
102;171;30062021115513
103;171;30062021115513
104;168;30062021115513
105;164;30062021115513
106;166;30062021115513
107;162;30062021115513
108;162;30062021115513
109;162;30062021115513
110;158;30062021115513
111;157;30062021115513
112;157;30062021115513
113;154;30062021115513
114;154;30062021115513
115;155;30062021115513
116;151;30062021115513
117;153;30062021115513
118;149;30062021115513
119;149;30062021115513
120;148;30062021115513
121;146;30062021115513
122;147;30062021115513
123;147;30062021115513
124;144;30062021115513
125;145;30062021115513
126;142;30062021115513
127;142;30062021115513
128;143;30062021115513
129;140;30062021115513
130;141;30062021115513
131;139;30062021115513
132;138;30062021115513
133;141;30062021115513
134;137;30062021115513
135;137;30062021115513
136;137;30062021115513
137;134;30062021115513
138;137;30062021115513
139;135;30062021115513
140;133;30062021115513
141;135;30062021115513
142;132;30062021115513
143;133;30062021115513
144;134;30062021115513
145;131;30062021115513
146;134;30062021115513
147;132;30062021115513
148;131;30062021115513
149;131;30062021115513
150;131;30062021115513
151;131;30062021115513
152;131;30062021115513
153;128;30062021115513
154;129;30062021115513
155;130;30062021115513
156;129;30062021115513
157;130;30062021115513
158;129;30062021115513
159;128;30062021115513
160;129;30062021115513
161;128;30062021115513
162;130;30062021115513
163;129;30062021115513
164;127;30062021115513
165;130;30062021115513
166;127;30062021115513
167;128;30062021115513
168;129;30062021115513
169;125;30062021115513
170;128;30062021115513
171;127;30062021115513
172;127;30062021115513
173;128;30062021115513
174;128;30062021115513
175;127;30062021115513
176;128;30062021115513
177;126;30062021115513
178;127;30062021115513
179;127;30062021115513
180;126;30062021115513
181;128;30062021115513
182;127;30062021115513
183;126;30062021115513
184;127;30062021115513
185;125;30062021115513
186;128;30062021115513
187;126;30062021115513
188;124;30062021115513
189;126;30062021115513
190;125;30062021115513
191;126;30062021115513
192;129;30062021115513
193;126;30062021115513
194;126;30062021115513
195;127;30062021115513
196;126;30062021115513
197;127;30062021115513
198;126;30062021115513
199;125;30062021115513
200;0;30062021115513
