ind;val;datetime
0;0;29062021121457
1;148;29062021121457
2;137;29062021121457
3;134;29062021121457
4;136;29062021121457
5;138;29062021121457
6;135;29062021121457
7;138;29062021121457
8;139;29062021121457
9;137;29062021121457
10;141;29062021121457
11;140;29062021121457
12;141;29062021121457
13;146;29062021121457
14;146;29062021121457
15;153;29062021121457
16;161;29062021121457
17;174;29062021121457
18;204;29062021121457
19;268;29062021121457
20;405;29062021121457
21;737;29062021121457
22;1023;29062021121457
23;1023;29062021121457
24;1023;29062021121457
25;1023;29062021121457
26;1023;29062021121457
27;1023;29062021121457
28;1023;29062021121457
29;1023;29062021121457
30;1023;29062021121457
31;1023;29062021121457
32;1023;29062021121457
33;1023;29062021121457
34;1012;29062021121457
35;808;29062021121457
36;607;29062021121457
37;475;29062021121457
38;392;29062021121457
39;331;29062021121457
40;294;29062021121457
41;268;29062021121457
42;252;29062021121457
43;241;29062021121457
44;234;29062021121457
45;235;29062021121457
46;233;29062021121457
47;227;29062021121457
48;228;29062021121457
49;224;29062021121457
50;223;29062021121457
51;222;29062021121457
52;222;29062021121457
53;224;29062021121457
54;222;29062021121457
55;222;29062021121457
56;227;29062021121457
57;226;29062021121457
58;231;29062021121457
59;235;29062021121457
60;238;29062021121457
61;241;29062021121457
62;246;29062021121457
63;244;29062021121457
64;248;29062021121457
65;243;29062021121457
66;247;29062021121457
67;243;29062021121457
68;243;29062021121457
69;238;29062021121457
70;237;29062021121457
71;234;29062021121457
72;230;29062021121457
73;223;29062021121457
74;224;29062021121457
75;217;29062021121457
76;213;29062021121457
77;212;29062021121457
78;206;29062021121457
79;203;29062021121457
80;201;29062021121457
81;194;29062021121457
82;195;29062021121457
83;190;29062021121457
84;189;29062021121457
85;188;29062021121457
86;186;29062021121457
87;184;29062021121457
88;184;29062021121457
89;177;29062021121457
90;180;29062021121457
91;177;29062021121457
92;175;29062021121457
93;175;29062021121457
94;172;29062021121457
95;168;29062021121457
96;168;29062021121457
97;165;29062021121457
98;163;29062021121457
99;163;29062021121457
100;159;29062021121457
101;163;29062021121457
102;159;29062021121457
103;159;29062021121457
104;156;29062021121457
105;152;29062021121457
106;154;29062021121457
107;151;29062021121457
108;152;29062021121457
109;152;29062021121457
110;148;29062021121457
111;149;29062021121457
112;151;29062021121457
113;145;29062021121457
114;147;29062021121457
115;146;29062021121457
116;145;29062021121457
117;146;29062021121457
118;144;29062021121457
119;145;29062021121457
120;143;29062021121457
121;141;29062021121457
122;142;29062021121457
123;141;29062021121457
124;140;29062021121457
125;141;29062021121457
126;139;29062021121457
127;140;29062021121457
128;141;29062021121457
129;138;29062021121457
130;139;29062021121457
131;138;29062021121457
132;136;29062021121457
133;140;29062021121457
134;134;29062021121457
135;135;29062021121457
136;137;29062021121457
137;134;29062021121457
138;138;29062021121457
139;134;29062021121457
140;133;29062021121457
141;135;29062021121457
142;134;29062021121457
143;133;29062021121457
144;134;29062021121457
145;132;29062021121457
146;135;29062021121457
147;134;29062021121457
148;131;29062021121457
149;133;29062021121457
150;132;29062021121457
151;132;29062021121457
152;132;29062021121457
153;131;29062021121457
154;133;29062021121457
155;132;29062021121457
156;130;29062021121457
157;130;29062021121457
158;130;29062021121457
159;130;29062021121457
160;131;29062021121457
161;129;29062021121457
162;132;29062021121457
163;131;29062021121457
164;131;29062021121457
165;133;29062021121457
166;130;29062021121457
167;131;29062021121457
168;132;29062021121457
169;128;29062021121457
170;131;29062021121457
171;130;29062021121457
172;130;29062021121457
173;131;29062021121457
174;129;29062021121457
175;128;29062021121457
176;130;29062021121457
177;129;29062021121457
178;131;29062021121457
179;130;29062021121457
180;128;29062021121457
181;131;29062021121457
182;130;29062021121457
183;129;29062021121457
184;130;29062021121457
185;126;29062021121457
186;130;29062021121457
187;130;29062021121457
188;128;29062021121457
189;130;29062021121457
190;128;29062021121457
191;129;29062021121457
192;132;29062021121457
193;128;29062021121457
194;131;29062021121457
195;130;29062021121457
196;128;29062021121457
197;129;29062021121457
198;129;29062021121457
199;128;29062021121457
200;0;29062021121457
0;0;29062021121458
1;149;29062021121458
2;137;29062021121458
3;134;29062021121458
4;136;29062021121458
5;136;29062021121458
6;134;29062021121458
7;137;29062021121458
8;138;29062021121458
9;136;29062021121458
10;141;29062021121458
11;140;29062021121458
12;139;29062021121458
13;145;29062021121458
14;146;29062021121458
15;153;29062021121458
16;159;29062021121458
17;172;29062021121458
18;205;29062021121458
19;267;29062021121458
20;403;29062021121458
21;739;29062021121458
22;1023;29062021121458
23;1023;29062021121458
24;1023;29062021121458
25;1023;29062021121458
26;1023;29062021121458
27;1023;29062021121458
28;1023;29062021121458
29;1023;29062021121458
30;1023;29062021121458
31;1023;29062021121458
32;1023;29062021121458
33;1023;29062021121458
34;1016;29062021121458
35;812;29062021121458
36;616;29062021121458
37;485;29062021121458
38;395;29062021121458
39;336;29062021121458
40;294;29062021121458
41;262;29062021121458
42;252;29062021121458
43;239;29062021121458
44;235;29062021121458
45;235;29062021121458
46;232;29062021121458
47;229;29062021121458
48;227;29062021121458
49;223;29062021121458
50;225;29062021121458
51;222;29062021121458
52;222;29062021121458
53;224;29062021121458
54;223;29062021121458
55;222;29062021121458
56;227;29062021121458
57;227;29062021121458
58;236;29062021121458
59;234;29062021121458
60;235;29062021121458
61;241;29062021121458
62;241;29062021121458
63;242;29062021121458
64;249;29062021121458
65;242;29062021121458
66;245;29062021121458
67;245;29062021121458
68;242;29062021121458
69;241;29062021121458
70;236;29062021121458
71;232;29062021121458
72;230;29062021121458
73;223;29062021121458
74;224;29062021121458
75;219;29062021121458
76;214;29062021121458
77;210;29062021121458
78;207;29062021121458
79;205;29062021121458
80;200;29062021121458
81;193;29062021121458
82;195;29062021121458
83;190;29062021121458
84;187;29062021121458
85;187;29062021121458
86;187;29062021121458
87;184;29062021121458
88;183;29062021121458
89;178;29062021121458
90;181;29062021121458
91;177;29062021121458
92;173;29062021121458
93;174;29062021121458
94;171;29062021121458
95;167;29062021121458
96;169;29062021121458
97;165;29062021121458
98;164;29062021121458
99;163;29062021121458
100;159;29062021121458
101;162;29062021121458
102;158;29062021121458
103;156;29062021121458
104;158;29062021121458
105;154;29062021121458
106;156;29062021121458
107;151;29062021121458
108;151;29062021121458
109;151;29062021121458
110;148;29062021121458
111;148;29062021121458
112;148;29062021121458
113;145;29062021121458
114;146;29062021121458
115;146;29062021121458
116;145;29062021121458
117;147;29062021121458
118;143;29062021121458
119;144;29062021121458
120;143;29062021121458
121;140;29062021121458
122;141;29062021121458
123;140;29062021121458
124;139;29062021121458
125;141;29062021121458
126;139;29062021121458
127;140;29062021121458
128;141;29062021121458
129;137;29062021121458
130;137;29062021121458
131;136;29062021121458
132;134;29062021121458
133;139;29062021121458
134;134;29062021121458
135;134;29062021121458
136;136;29062021121458
137;133;29062021121458
138;135;29062021121458
139;134;29062021121458
140;133;29062021121458
141;134;29062021121458
142;133;29062021121458
143;131;29062021121458
144;135;29062021121458
145;130;29062021121458
146;134;29062021121458
147;133;29062021121458
148;130;29062021121458
149;131;29062021121458
150;131;29062021121458
151;131;29062021121458
152;132;29062021121458
153;130;29062021121458
154;132;29062021121458
155;130;29062021121458
156;130;29062021121458
157;131;29062021121458
158;129;29062021121458
159;130;29062021121458
160;131;29062021121458
161;128;29062021121458
162;130;29062021121458
163;130;29062021121458
164;130;29062021121458
165;131;29062021121458
166;129;29062021121458
167;129;29062021121458
168;130;29062021121458
169;127;29062021121458
170;130;29062021121458
171;129;29062021121458
172;128;29062021121458
173;130;29062021121458
174;129;29062021121458
175;128;29062021121458
176;129;29062021121458
177;127;29062021121458
178;131;29062021121458
179;129;29062021121458
180;128;29062021121458
181;130;29062021121458
182;130;29062021121458
183;128;29062021121458
184;129;29062021121458
185;125;29062021121458
186;130;29062021121458
187;129;29062021121458
188;128;29062021121458
189;129;29062021121458
190;127;29062021121458
191;129;29062021121458
192;132;29062021121458
193;128;29062021121458
194;129;29062021121458
195;128;29062021121458
196;128;29062021121458
197;129;29062021121458
198;129;29062021121458
199;127;29062021121458
200;0;29062021121458
0;0;29062021121459
1;149;29062021121459
2;136;29062021121459
3;135;29062021121459
4;136;29062021121459
5;136;29062021121459
6;134;29062021121459
7;136;29062021121459
8;139;29062021121459
9;136;29062021121459
10;141;29062021121459
11;139;29062021121459
12;140;29062021121459
13;145;29062021121459
14;146;29062021121459
15;152;29062021121459
16;160;29062021121459
17;173;29062021121459
18;203;29062021121459
19;266;29062021121459
20;400;29062021121459
21;735;29062021121459
22;1023;29062021121459
23;1023;29062021121459
24;1023;29062021121459
25;1023;29062021121459
26;1023;29062021121459
27;1023;29062021121459
28;1023;29062021121459
29;1023;29062021121459
30;1023;29062021121459
31;1023;29062021121459
32;1023;29062021121459
33;1023;29062021121459
34;1017;29062021121459
35;812;29062021121459
36;613;29062021121459
37;487;29062021121459
38;395;29062021121459
39;334;29062021121459
40;293;29062021121459
41;265;29062021121459
42;252;29062021121459
43;241;29062021121459
44;237;29062021121459
45;236;29062021121459
46;230;29062021121459
47;228;29062021121459
48;229;29062021121459
49;226;29062021121459
50;227;29062021121459
51;223;29062021121459
52;220;29062021121459
53;224;29062021121459
54;224;29062021121459
55;224;29062021121459
56;227;29062021121459
57;226;29062021121459
58;233;29062021121459
59;237;29062021121459
60;238;29062021121459
61;243;29062021121459
62;241;29062021121459
63;244;29062021121459
64;247;29062021121459
65;243;29062021121459
66;245;29062021121459
67;244;29062021121459
68;239;29062021121459
69;239;29062021121459
70;234;29062021121459
71;233;29062021121459
72;231;29062021121459
73;224;29062021121459
74;223;29062021121459
75;216;29062021121459
76;212;29062021121459
77;210;29062021121459
78;206;29062021121459
79;204;29062021121459
80;200;29062021121459
81;194;29062021121459
82;194;29062021121459
83;189;29062021121459
84;187;29062021121459
85;187;29062021121459
86;185;29062021121459
87;185;29062021121459
88;183;29062021121459
89;179;29062021121459
90;181;29062021121459
91;176;29062021121459
92;172;29062021121459
93;174;29062021121459
94;171;29062021121459
95;167;29062021121459
96;168;29062021121459
97;164;29062021121459
98;163;29062021121459
99;161;29062021121459
100;159;29062021121459
101;161;29062021121459
102;158;29062021121459
103;156;29062021121459
104;155;29062021121459
105;152;29062021121459
106;156;29062021121459
107;154;29062021121459
108;151;29062021121459
109;151;29062021121459
110;146;29062021121459
111;148;29062021121459
112;150;29062021121459
113;147;29062021121459
114;145;29062021121459
115;146;29062021121459
116;146;29062021121459
117;148;29062021121459
118;143;29062021121459
119;144;29062021121459
120;142;29062021121459
121;140;29062021121459
122;140;29062021121459
123;140;29062021121459
124;139;29062021121459
125;141;29062021121459
126;138;29062021121459
127;138;29062021121459
128;140;29062021121459
129;137;29062021121459
130;138;29062021121459
131;138;29062021121459
132;135;29062021121459
133;140;29062021121459
134;135;29062021121459
135;133;29062021121459
136;136;29062021121459
137;132;29062021121459
138;135;29062021121459
139;134;29062021121459
140;132;29062021121459
141;135;29062021121459
142;133;29062021121459
143;131;29062021121459
144;134;29062021121459
145;130;29062021121459
146;134;29062021121459
147;133;29062021121459
148;130;29062021121459
149;131;29062021121459
150;132;29062021121459
151;132;29062021121459
152;131;29062021121459
153;130;29062021121459
154;132;29062021121459
155;131;29062021121459
156;129;29062021121459
157;130;29062021121459
158;129;29062021121459
159;130;29062021121459
160;130;29062021121459
161;129;29062021121459
162;131;29062021121459
163;130;29062021121459
164;128;29062021121459
165;131;29062021121459
166;129;29062021121459
167;130;29062021121459
168;131;29062021121459
169;127;29062021121459
170;129;29062021121459
171;130;29062021121459
172;128;29062021121459
173;131;29062021121459
174;128;29062021121459
175;129;29062021121459
176;130;29062021121459
177;129;29062021121459
178;131;29062021121459
179;129;29062021121459
180;128;29062021121459
181;129;29062021121459
182;129;29062021121459
183;128;29062021121459
184;130;29062021121459
185;126;29062021121459
186;130;29062021121459
187;128;29062021121459
188;127;29062021121459
189;130;29062021121459
190;127;29062021121459
191;128;29062021121459
192;131;29062021121459
193;128;29062021121459
194;129;29062021121459
195;128;29062021121459
196;127;29062021121459
197;129;29062021121459
198;128;29062021121459
199;126;29062021121459
200;0;29062021121459
0;0;29062021121500
1;148;29062021121500
2;136;29062021121500
3;134;29062021121500
4;136;29062021121500
5;136;29062021121500
6;135;29062021121500
7;138;29062021121500
8;138;29062021121500
9;136;29062021121500
10;141;29062021121500
11;140;29062021121500
12;142;29062021121500
13;146;29062021121500
14;146;29062021121500
15;152;29062021121500
16;159;29062021121500
17;173;29062021121500
18;206;29062021121500
19;267;29062021121500
20;404;29062021121500
21;735;29062021121500
22;1023;29062021121500
23;1023;29062021121500
24;1023;29062021121500
25;1023;29062021121500
26;1023;29062021121500
27;1023;29062021121500
28;1023;29062021121500
29;1023;29062021121500
30;1023;29062021121500
31;1023;29062021121500
32;1023;29062021121500
33;1023;29062021121500
34;1019;29062021121500
35;822;29062021121500
36;624;29062021121500
37;489;29062021121500
38;395;29062021121500
39;339;29062021121500
40;294;29062021121500
41;268;29062021121500
42;256;29062021121500
43;242;29062021121500
44;238;29062021121500
45;238;29062021121500
46;235;29062021121500
47;232;29062021121500
48;231;29062021121500
49;227;29062021121500
50;228;29062021121500
51;226;29062021121500
52;221;29062021121500
53;226;29062021121500
54;224;29062021121500
55;225;29062021121500
56;229;29062021121500
57;232;29062021121500
58;235;29062021121500
59;237;29062021121500
60;239;29062021121500
61;242;29062021121500
62;243;29062021121500
63;245;29062021121500
64;249;29062021121500
65;245;29062021121500
66;247;29062021121500
67;244;29062021121500
68;242;29062021121500
69;243;29062021121500
70;238;29062021121500
71;234;29062021121500
72;231;29062021121500
73;225;29062021121500
74;224;29062021121500
75;219;29062021121500
76;214;29062021121500
77;211;29062021121500
78;205;29062021121500
79;205;29062021121500
80;199;29062021121500
81;195;29062021121500
82;194;29062021121500
83;189;29062021121500
84;189;29062021121500
85;187;29062021121500
86;185;29062021121500
87;186;29062021121500
88;183;29062021121500
89;179;29062021121500
90;181;29062021121500
91;177;29062021121500
92;174;29062021121500
93;173;29062021121500
94;172;29062021121500
95;168;29062021121500
96;167;29062021121500
97;165;29062021121500
98;164;29062021121500
99;163;29062021121500
100;159;29062021121500
101;163;29062021121500
102;158;29062021121500
103;157;29062021121500
104;156;29062021121500
105;153;29062021121500
106;155;29062021121500
107;151;29062021121500
108;151;29062021121500
109;151;29062021121500
110;148;29062021121500
111;147;29062021121500
112;148;29062021121500
113;146;29062021121500
114;146;29062021121500
115;146;29062021121500
116;144;29062021121500
117;146;29062021121500
118;143;29062021121500
119;144;29062021121500
120;141;29062021121500
121;141;29062021121500
122;141;29062021121500
123;141;29062021121500
124;139;29062021121500
125;140;29062021121500
126;138;29062021121500
127;138;29062021121500
128;141;29062021121500
129;138;29062021121500
130;137;29062021121500
131;137;29062021121500
132;135;29062021121500
133;140;29062021121500
134;134;29062021121500
135;135;29062021121500
136;136;29062021121500
137;134;29062021121500
138;135;29062021121500
139;133;29062021121500
140;133;29062021121500
141;135;29062021121500
142;131;29062021121500
143;131;29062021121500
144;134;29062021121500
145;131;29062021121500
146;134;29062021121500
147;133;29062021121500
148;131;29062021121500
149;132;29062021121500
150;132;29062021121500
151;131;29062021121500
152;131;29062021121500
153;129;29062021121500
154;132;29062021121500
155;131;29062021121500
156;130;29062021121500
157;131;29062021121500
158;129;29062021121500
159;129;29062021121500
160;129;29062021121500
161;130;29062021121500
162;131;29062021121500
163;132;29062021121500
164;129;29062021121500
165;131;29062021121500
166;130;29062021121500
167;131;29062021121500
168;131;29062021121500
169;127;29062021121500
170;130;29062021121500
171;129;29062021121500
172;128;29062021121500
173;130;29062021121500
174;128;29062021121500
175;128;29062021121500
176;129;29062021121500
177;127;29062021121500
178;129;29062021121500
179;128;29062021121500
180;129;29062021121500
181;131;29062021121500
182;130;29062021121500
183;128;29062021121500
184;130;29062021121500
185;126;29062021121500
186;130;29062021121500
187;128;29062021121500
188;127;29062021121500
189;130;29062021121500
190;127;29062021121500
191;129;29062021121500
192;132;29062021121500
193;129;29062021121500
194;129;29062021121500
195;127;29062021121500
196;127;29062021121500
197;129;29062021121500
198;129;29062021121500
199;128;29062021121500
200;0;29062021121500
0;0;29062021121501
1;148;29062021121501
2;135;29062021121501
3;135;29062021121501
4;135;29062021121501
5;137;29062021121501
6;135;29062021121501
7;137;29062021121501
8;138;29062021121501
9;136;29062021121501
10;141;29062021121501
11;139;29062021121501
12;141;29062021121501
13;146;29062021121501
14;146;29062021121501
15;153;29062021121501
16;159;29062021121501
17;172;29062021121501
18;205;29062021121501
19;266;29062021121501
20;408;29062021121501
21;736;29062021121501
22;1023;29062021121501
23;1023;29062021121501
24;1023;29062021121501
25;1023;29062021121501
26;1023;29062021121501
27;1023;29062021121501
28;1023;29062021121501
29;1023;29062021121501
30;1023;29062021121501
31;1023;29062021121501
32;1023;29062021121501
33;1023;29062021121501
34;1020;29062021121501
35;826;29062021121501
36;625;29062021121501
37;489;29062021121501
38;396;29062021121501
39;340;29062021121501
40;297;29062021121501
41;271;29062021121501
42;257;29062021121501
43;246;29062021121501
44;240;29062021121501
45;237;29062021121501
46;234;29062021121501
47;234;29062021121501
48;233;29062021121501
49;229;29062021121501
50;228;29062021121501
51;224;29062021121501
52;224;29062021121501
53;226;29062021121501
54;228;29062021121501
55;228;29062021121501
56;231;29062021121501
57;229;29062021121501
58;236;29062021121501
59;237;29062021121501
60;239;29062021121501
61;245;29062021121501
62;245;29062021121501
63;247;29062021121501
64;251;29062021121501
65;247;29062021121501
66;248;29062021121501
67;245;29062021121501
68;243;29062021121501
69;243;29062021121501
70;236;29062021121501
71;231;29062021121501
72;231;29062021121501
73;225;29062021121501
74;223;29062021121501
75;218;29062021121501
76;215;29062021121501
77;213;29062021121501
78;208;29062021121501
79;205;29062021121501
80;200;29062021121501
81;193;29062021121501
82;196;29062021121501
83;191;29062021121501
84;189;29062021121501
85;186;29062021121501
86;184;29062021121501
87;185;29062021121501
88;184;29062021121501
89;178;29062021121501
90;179;29062021121501
91;176;29062021121501
92;174;29062021121501
93;173;29062021121501
94;172;29062021121501
95;168;29062021121501
96;169;29062021121501
97;165;29062021121501
98;163;29062021121501
99;162;29062021121501
100;159;29062021121501
101;163;29062021121501
102;157;29062021121501
103;157;29062021121501
104;156;29062021121501
105;153;29062021121501
106;155;29062021121501
107;152;29062021121501
108;151;29062021121501
109;152;29062021121501
110;148;29062021121501
111;148;29062021121501
112;150;29062021121501
113;146;29062021121501
114;145;29062021121501
115;147;29062021121501
116;144;29062021121501
117;147;29062021121501
118;143;29062021121501
119;144;29062021121501
120;142;29062021121501
121;142;29062021121501
122;143;29062021121501
123;140;29062021121501
124;140;29062021121501
125;140;29062021121501
126;138;29062021121501
127;138;29062021121501
128;141;29062021121501
129;137;29062021121501
130;137;29062021121501
131;138;29062021121501
132;135;29062021121501
133;139;29062021121501
134;135;29062021121501
135;136;29062021121501
136;136;29062021121501
137;134;29062021121501
138;136;29062021121501
139;134;29062021121501
140;133;29062021121501
141;136;29062021121501
142;133;29062021121501
143;132;29062021121501
144;135;29062021121501
145;131;29062021121501
146;134;29062021121501
147;133;29062021121501
148;130;29062021121501
149;132;29062021121501
150;130;29062021121501
151;132;29062021121501
152;131;29062021121501
153;130;29062021121501
154;132;29062021121501
155;130;29062021121501
156;129;29062021121501
157;131;29062021121501
158;129;29062021121501
159;130;29062021121501
160;131;29062021121501
161;129;29062021121501
162;131;29062021121501
163;130;29062021121501
164;129;29062021121501
165;131;29062021121501
166;130;29062021121501
167;130;29062021121501
168;131;29062021121501
169;126;29062021121501
170;131;29062021121501
171;129;29062021121501
172;128;29062021121501
173;130;29062021121501
174;129;29062021121501
175;128;29062021121501
176;130;29062021121501
177;128;29062021121501
178;130;29062021121501
179;129;29062021121501
180;129;29062021121501
181;130;29062021121501
182;130;29062021121501
183;128;29062021121501
184;130;29062021121501
185;127;29062021121501
186;129;29062021121501
187;129;29062021121501
188;126;29062021121501
189;130;29062021121501
190;128;29062021121501
191;129;29062021121501
192;132;29062021121501
193;128;29062021121501
194;130;29062021121501
195;129;29062021121501
196;127;29062021121501
197;128;29062021121501
198;129;29062021121501
199;128;29062021121501
200;0;29062021121501
0;0;29062021121501
1;149;29062021121501
2;136;29062021121501
3;133;29062021121501
4;135;29062021121501
5;136;29062021121501
6;133;29062021121501
7;137;29062021121501
8;137;29062021121501
9;137;29062021121501
10;140;29062021121501
11;140;29062021121501
12;140;29062021121501
13;146;29062021121501
14;145;29062021121501
15;152;29062021121501
16;159;29062021121501
17;172;29062021121501
18;202;29062021121501
19;266;29062021121501
20;399;29062021121501
21;731;29062021121501
22;1023;29062021121501
23;1023;29062021121501
24;1023;29062021121501
25;1023;29062021121501
26;1023;29062021121501
27;1023;29062021121501
28;1023;29062021121501
29;1023;29062021121501
30;1023;29062021121501
31;1023;29062021121501
32;1023;29062021121501
33;1023;29062021121501
34;1019;29062021121501
35;826;29062021121501
36;625;29062021121501
37;493;29062021121501
38;399;29062021121501
39;343;29062021121501
40;302;29062021121501
41;272;29062021121501
42;259;29062021121501
43;246;29062021121501
44;241;29062021121501
45;239;29062021121501
46;237;29062021121501
47;235;29062021121501
48;234;29062021121501
49;229;29062021121501
50;228;29062021121501
51;228;29062021121501
52;226;29062021121501
53;227;29062021121501
54;227;29062021121501
55;228;29062021121501
56;230;29062021121501
57;232;29062021121501
58;238;29062021121501
59;240;29062021121501
60;241;29062021121501
61;243;29062021121501
62;244;29062021121501
63;247;29062021121501
64;251;29062021121501
65;245;29062021121501
66;250;29062021121501
67;245;29062021121501
68;244;29062021121501
69;245;29062021121501
70;238;29062021121501
71;235;29062021121501
72;234;29062021121501
73;226;29062021121501
74;222;29062021121501
75;216;29062021121501
76;215;29062021121501
77;212;29062021121501
78;208;29062021121501
79;205;29062021121501
80;203;29062021121501
81;195;29062021121501
82;195;29062021121501
83;190;29062021121501
84;189;29062021121501
85;189;29062021121501
86;185;29062021121501
87;185;29062021121501
88;185;29062021121501
89;178;29062021121501
90;181;29062021121501
91;176;29062021121501
92;173;29062021121501
93;174;29062021121501
94;172;29062021121501
95;168;29062021121501
96;167;29062021121501
97;165;29062021121501
98;164;29062021121501
99;162;29062021121501
100;159;29062021121501
101;161;29062021121501
102;159;29062021121501
103;156;29062021121501
104;155;29062021121501
105;153;29062021121501
106;156;29062021121501
107;151;29062021121501
108;152;29062021121501
109;151;29062021121501
110;147;29062021121501
111;147;29062021121501
112;149;29062021121501
113;145;29062021121501
114;146;29062021121501
115;147;29062021121501
116;144;29062021121501
117;147;29062021121501
118;143;29062021121501
119;143;29062021121501
120;143;29062021121501
121;139;29062021121501
122;142;29062021121501
123;141;29062021121501
124;140;29062021121501
125;140;29062021121501
126;137;29062021121501
127;139;29062021121501
128;141;29062021121501
129;137;29062021121501
130;137;29062021121501
131;138;29062021121501
132;135;29062021121501
133;139;29062021121501
134;135;29062021121501
135;134;29062021121501
136;135;29062021121501
137;133;29062021121501
138;136;29062021121501
139;134;29062021121501
140;132;29062021121501
141;135;29062021121501
142;132;29062021121501
143;131;29062021121501
144;134;29062021121501
145;130;29062021121501
146;134;29062021121501
147;133;29062021121501
148;132;29062021121501
149;131;29062021121501
150;131;29062021121501
151;130;29062021121501
152;131;29062021121501
153;129;29062021121501
154;131;29062021121501
155;130;29062021121501
156;130;29062021121501
157;131;29062021121501
158;129;29062021121501
159;129;29062021121501
160;130;29062021121501
161;128;29062021121501
162;131;29062021121501
163;131;29062021121501
164;130;29062021121501
165;132;29062021121501
166;129;29062021121501
167;130;29062021121501
168;131;29062021121501
169;127;29062021121501
170;130;29062021121501
171;129;29062021121501
172;128;29062021121501
173;130;29062021121501
174;128;29062021121501
175;127;29062021121501
176;130;29062021121501
177;128;29062021121501
178;130;29062021121501
179;128;29062021121501
180;128;29062021121501
181;129;29062021121501
182;129;29062021121501
183;128;29062021121501
184;128;29062021121501
185;127;29062021121501
186;131;29062021121501
187;128;29062021121501
188;127;29062021121501
189;129;29062021121501
190;127;29062021121501
191;129;29062021121501
192;131;29062021121501
193;128;29062021121501
194;129;29062021121501
195;128;29062021121501
196;127;29062021121501
197;128;29062021121501
198;128;29062021121501
199;128;29062021121501
200;0;29062021121501
0;0;29062021121502
1;148;29062021121502
2;136;29062021121502
3;135;29062021121502
4;136;29062021121502
5;137;29062021121502
6;134;29062021121502
7;136;29062021121502
8;138;29062021121502
9;136;29062021121502
10;140;29062021121502
11;140;29062021121502
12;140;29062021121502
13;146;29062021121502
14;148;29062021121502
15;152;29062021121502
16;159;29062021121502
17;172;29062021121502
18;204;29062021121502
19;262;29062021121502
20;402;29062021121502
21;731;29062021121502
22;1023;29062021121502
23;1023;29062021121502
24;1023;29062021121502
25;1023;29062021121502
26;1023;29062021121502
27;1023;29062021121502
28;1023;29062021121502
29;1023;29062021121502
30;1023;29062021121502
31;1023;29062021121502
32;1023;29062021121502
33;1023;29062021121502
34;1022;29062021121502
35;828;29062021121502
36;627;29062021121502
37;489;29062021121502
38;407;29062021121502
39;342;29062021121502
40;300;29062021121502
41;276;29062021121502
42;261;29062021121502
43;247;29062021121502
44;241;29062021121502
45;242;29062021121502
46;238;29062021121502
47;237;29062021121502
48;234;29062021121502
49;231;29062021121502
50;233;29062021121502
51;230;29062021121502
52;226;29062021121502
53;228;29062021121502
54;229;29062021121502
55;229;29062021121502
56;233;29062021121502
57;234;29062021121502
58;238;29062021121502
59;240;29062021121502
60;241;29062021121502
61;245;29062021121502
62;246;29062021121502
63;249;29062021121502
64;251;29062021121502
65;245;29062021121502
66;248;29062021121502
67;246;29062021121502
68;247;29062021121502
69;239;29062021121502
70;237;29062021121502
71;233;29062021121502
72;235;29062021121502
73;224;29062021121502
74;226;29062021121502
75;216;29062021121502
76;214;29062021121502
77;211;29062021121502
78;206;29062021121502
79;205;29062021121502
80;201;29062021121502
81;194;29062021121502
82;197;29062021121502
83;190;29062021121502
84;188;29062021121502
85;187;29062021121502
86;185;29062021121502
87;185;29062021121502
88;184;29062021121502
89;178;29062021121502
90;180;29062021121502
91;178;29062021121502
92;174;29062021121502
93;175;29062021121502
94;170;29062021121502
95;167;29062021121502
96;169;29062021121502
97;164;29062021121502
98;163;29062021121502
99;161;29062021121502
100;159;29062021121502
101;162;29062021121502
102;158;29062021121502
103;156;29062021121502
104;156;29062021121502
105;155;29062021121502
106;154;29062021121502
107;153;29062021121502
108;151;29062021121502
109;152;29062021121502
110;147;29062021121502
111;147;29062021121502
112;148;29062021121502
113;144;29062021121502
114;146;29062021121502
115;145;29062021121502
116;144;29062021121502
117;146;29062021121502
118;143;29062021121502
119;144;29062021121502
120;143;29062021121502
121;139;29062021121502
122;141;29062021121502
123;140;29062021121502
124;138;29062021121502
125;141;29062021121502
126;139;29062021121502
127;138;29062021121502
128;141;29062021121502
129;136;29062021121502
130;137;29062021121502
131;137;29062021121502
132;133;29062021121502
133;141;29062021121502
134;134;29062021121502
135;134;29062021121502
136;136;29062021121502
137;133;29062021121502
138;135;29062021121502
139;133;29062021121502
140;132;29062021121502
141;134;29062021121502
142;133;29062021121502
143;131;29062021121502
144;134;29062021121502
145;130;29062021121502
146;132;29062021121502
147;132;29062021121502
148;131;29062021121502
149;131;29062021121502
150;131;29062021121502
151;132;29062021121502
152;132;29062021121502
153;129;29062021121502
154;130;29062021121502
155;130;29062021121502
156;130;29062021121502
157;130;29062021121502
158;129;29062021121502
159;128;29062021121502
160;131;29062021121502
161;130;29062021121502
162;131;29062021121502
163;130;29062021121502
164;129;29062021121502
165;130;29062021121502
166;129;29062021121502
167;130;29062021121502
168;131;29062021121502
169;128;29062021121502
170;130;29062021121502
171;129;29062021121502
172;128;29062021121502
173;130;29062021121502
174;129;29062021121502
175;127;29062021121502
176;130;29062021121502
177;128;29062021121502
178;131;29062021121502
179;129;29062021121502
180;129;29062021121502
181;129;29062021121502
182;129;29062021121502
183;127;29062021121502
184;130;29062021121502
185;127;29062021121502
186;130;29062021121502
187;128;29062021121502
188;127;29062021121502
189;129;29062021121502
190;127;29062021121502
191;129;29062021121502
192;131;29062021121502
193;126;29062021121502
194;129;29062021121502
195;128;29062021121502
196;128;29062021121502
197;130;29062021121502
198;129;29062021121502
199;127;29062021121502
200;0;29062021121502
0;0;29062021121503
1;148;29062021121503
2;135;29062021121503
3;134;29062021121503
4;135;29062021121503
5;136;29062021121503
6;135;29062021121503
7;138;29062021121503
8;139;29062021121503
9;137;29062021121503
10;141;29062021121503
11;139;29062021121503
12;139;29062021121503
13;145;29062021121503
14;145;29062021121503
15;152;29062021121503
16;160;29062021121503
17;174;29062021121503
18;205;29062021121503
19;268;29062021121503
20;401;29062021121503
21;729;29062021121503
22;1023;29062021121503
23;1023;29062021121503
24;1023;29062021121503
25;1023;29062021121503
26;1023;29062021121503
27;1023;29062021121503
28;1023;29062021121503
29;1023;29062021121503
30;1023;29062021121503
31;1023;29062021121503
32;1023;29062021121503
33;1023;29062021121503
34;1023;29062021121503
35;831;29062021121503
36;628;29062021121503
37;493;29062021121503
38;408;29062021121503
39;347;29062021121503
40;303;29062021121503
41;274;29062021121503
42;262;29062021121503
43;251;29062021121503
44;247;29062021121503
45;244;29062021121503
46;239;29062021121503
47;239;29062021121503
48;236;29062021121503
49;235;29062021121503
50;234;29062021121503
51;232;29062021121503
52;230;29062021121503
53;231;29062021121503
54;230;29062021121503
55;230;29062021121503
56;231;29062021121503
57;234;29062021121503
58;239;29062021121503
59;241;29062021121503
60;245;29062021121503
61;248;29062021121503
62;246;29062021121503
63;251;29062021121503
64;251;29062021121503
65;245;29062021121503
66;248;29062021121503
67;247;29062021121503
68;245;29062021121503
69;243;29062021121503
70;238;29062021121503
71;234;29062021121503
72;234;29062021121503
73;227;29062021121503
74;225;29062021121503
75;218;29062021121503
76;214;29062021121503
77;212;29062021121503
78;208;29062021121503
79;205;29062021121503
80;203;29062021121503
81;196;29062021121503
82;195;29062021121503
83;189;29062021121503
84;188;29062021121503
85;187;29062021121503
86;184;29062021121503
87;185;29062021121503
88;183;29062021121503
89;178;29062021121503
90;182;29062021121503
91;176;29062021121503
92;172;29062021121503
93;173;29062021121503
94;171;29062021121503
95;168;29062021121503
96;168;29062021121503
97;165;29062021121503
98;164;29062021121503
99;161;29062021121503
100;159;29062021121503
101;162;29062021121503
102;159;29062021121503
103;156;29062021121503
104;155;29062021121503
105;153;29062021121503
106;155;29062021121503
107;151;29062021121503
108;151;29062021121503
109;152;29062021121503
110;147;29062021121503
111;147;29062021121503
112;149;29062021121503
113;143;29062021121503
114;146;29062021121503
115;146;29062021121503
116;145;29062021121503
117;146;29062021121503
118;142;29062021121503
119;143;29062021121503
120;142;29062021121503
121;140;29062021121503
122;141;29062021121503
123;141;29062021121503
124;140;29062021121503
125;141;29062021121503
126;138;29062021121503
127;139;29062021121503
128;140;29062021121503
129;137;29062021121503
130;137;29062021121503
131;137;29062021121503
132;137;29062021121503
133;141;29062021121503
134;135;29062021121503
135;135;29062021121503
136;136;29062021121503
137;134;29062021121503
138;136;29062021121503
139;134;29062021121503
140;133;29062021121503
141;134;29062021121503
142;132;29062021121503
143;131;29062021121503
144;134;29062021121503
145;130;29062021121503
146;133;29062021121503
147;132;29062021121503
148;130;29062021121503
149;132;29062021121503
150;132;29062021121503
151;131;29062021121503
152;131;29062021121503
153;129;29062021121503
154;132;29062021121503
155;131;29062021121503
156;129;29062021121503
157;129;29062021121503
158;129;29062021121503
159;128;29062021121503
160;130;29062021121503
161;129;29062021121503
162;130;29062021121503
163;131;29062021121503
164;129;29062021121503
165;131;29062021121503
166;129;29062021121503
167;130;29062021121503
168;131;29062021121503
169;128;29062021121503
170;130;29062021121503
171;129;29062021121503
172;128;29062021121503
173;131;29062021121503
174;128;29062021121503
175;127;29062021121503
176;130;29062021121503
177;127;29062021121503
178;130;29062021121503
179;129;29062021121503
180;127;29062021121503
181;129;29062021121503
182;129;29062021121503
183;127;29062021121503
184;130;29062021121503
185;126;29062021121503
186;131;29062021121503
187;128;29062021121503
188;127;29062021121503
189;129;29062021121503
190;127;29062021121503
191;128;29062021121503
192;131;29062021121503
193;127;29062021121503
194;129;29062021121503
195;128;29062021121503
196;127;29062021121503
197;129;29062021121503
198;129;29062021121503
199;127;29062021121503
200;0;29062021121503
0;0;29062021121504
1;148;29062021121504
2;136;29062021121504
3;134;29062021121504
4;136;29062021121504
5;136;29062021121504
6;135;29062021121504
7;138;29062021121504
8;139;29062021121504
9;136;29062021121504
10;141;29062021121504
11;139;29062021121504
12;141;29062021121504
13;145;29062021121504
14;147;29062021121504
15;153;29062021121504
16;160;29062021121504
17;171;29062021121504
18;206;29062021121504
19;266;29062021121504
20;402;29062021121504
21;727;29062021121504
22;1023;29062021121504
23;1023;29062021121504
24;1023;29062021121504
25;1023;29062021121504
26;1023;29062021121504
27;1023;29062021121504
28;1023;29062021121504
29;1023;29062021121504
30;1023;29062021121504
31;1023;29062021121504
32;1023;29062021121504
33;1023;29062021121504
34;1021;29062021121504
35;829;29062021121504
36;623;29062021121504
37;494;29062021121504
38;403;29062021121504
39;345;29062021121504
40;302;29062021121504
41;275;29062021121504
42;262;29062021121504
43;248;29062021121504
44;245;29062021121504
45;240;29062021121504
46;238;29062021121504
47;235;29062021121504
48;237;29062021121504
49;233;29062021121504
50;233;29062021121504
51;230;29062021121504
52;228;29062021121504
53;231;29062021121504
54;229;29062021121504
55;229;29062021121504
56;232;29062021121504
57;232;29062021121504
58;238;29062021121504
59;240;29062021121504
60;243;29062021121504
61;247;29062021121504
62;246;29062021121504
63;250;29062021121504
64;252;29062021121504
65;247;29062021121504
66;248;29062021121504
67;246;29062021121504
68;243;29062021121504
69;243;29062021121504
70;240;29062021121504
71;231;29062021121504
72;233;29062021121504
73;224;29062021121504
74;224;29062021121504
75;217;29062021121504
76;215;29062021121504
77;210;29062021121504
78;209;29062021121504
79;205;29062021121504
80;200;29062021121504
81;196;29062021121504
82;197;29062021121504
83;189;29062021121504
84;186;29062021121504
85;188;29062021121504
86;186;29062021121504
87;184;29062021121504
88;185;29062021121504
89;179;29062021121504
90;181;29062021121504
91;178;29062021121504
92;173;29062021121504
93;175;29062021121504
94;171;29062021121504
95;167;29062021121504
96;167;29062021121504
97;165;29062021121504
98;163;29062021121504
99;164;29062021121504
100;159;29062021121504
101;162;29062021121504
102;158;29062021121504
103;157;29062021121504
104;156;29062021121504
105;152;29062021121504
106;155;29062021121504
107;152;29062021121504
108;151;29062021121504
109;152;29062021121504
110;147;29062021121504
111;147;29062021121504
112;149;29062021121504
113;145;29062021121504
114;146;29062021121504
115;145;29062021121504
116;144;29062021121504
117;147;29062021121504
118;142;29062021121504
119;144;29062021121504
120;142;29062021121504
121;140;29062021121504
122;142;29062021121504
123;139;29062021121504
124;139;29062021121504
125;141;29062021121504
126;139;29062021121504
127;138;29062021121504
128;140;29062021121504
129;136;29062021121504
130;138;29062021121504
131;138;29062021121504
132;134;29062021121504
133;140;29062021121504
134;135;29062021121504
135;134;29062021121504
136;136;29062021121504
137;133;29062021121504
138;135;29062021121504
139;133;29062021121504
140;132;29062021121504
141;134;29062021121504
142;133;29062021121504
143;132;29062021121504
144;134;29062021121504
145;131;29062021121504
146;133;29062021121504
147;132;29062021121504
148;130;29062021121504
149;132;29062021121504
150;132;29062021121504
151;132;29062021121504
152;131;29062021121504
153;130;29062021121504
154;132;29062021121504
155;132;29062021121504
156;130;29062021121504
157;130;29062021121504
158;128;29062021121504
159;130;29062021121504
160;130;29062021121504
161;130;29062021121504
162;131;29062021121504
163;130;29062021121504
164;129;29062021121504
165;131;29062021121504
166;129;29062021121504
167;130;29062021121504
168;131;29062021121504
169;128;29062021121504
170;131;29062021121504
171;129;29062021121504
172;129;29062021121504
173;130;29062021121504
174;128;29062021121504
175;127;29062021121504
176;129;29062021121504
177;128;29062021121504
178;131;29062021121504
179;130;29062021121504
180;128;29062021121504
181;130;29062021121504
182;129;29062021121504
183;127;29062021121504
184;129;29062021121504
185;126;29062021121504
186;130;29062021121504
187;128;29062021121504
188;127;29062021121504
189;129;29062021121504
190;127;29062021121504
191;128;29062021121504
192;131;29062021121504
193;127;29062021121504
194;129;29062021121504
195;129;29062021121504
196;127;29062021121504
197;129;29062021121504
198;129;29062021121504
199;127;29062021121504
200;0;29062021121504
0;0;29062021121504
1;148;29062021121504
2;136;29062021121504
3;134;29062021121504
4;136;29062021121504
5;137;29062021121504
6;134;29062021121504
7;138;29062021121504
8;138;29062021121504
9;135;29062021121504
10;140;29062021121504
11;139;29062021121504
12;141;29062021121504
13;147;29062021121504
14;146;29062021121504
15;153;29062021121504
16;160;29062021121504
17;170;29062021121504
18;206;29062021121504
19;265;29062021121504
20;401;29062021121504
21;728;29062021121504
22;1023;29062021121504
23;1023;29062021121504
24;1023;29062021121504
25;1023;29062021121504
26;1023;29062021121504
27;1023;29062021121504
28;1023;29062021121504
29;1023;29062021121504
30;1023;29062021121504
31;1023;29062021121504
32;1023;29062021121504
33;1023;29062021121504
34;1022;29062021121504
35;831;29062021121504
36;628;29062021121504
37;497;29062021121504
38;401;29062021121504
39;341;29062021121504
40;302;29062021121504
41;270;29062021121504
42;257;29062021121504
43;246;29062021121504
44;240;29062021121504
45;237;29062021121504
46;237;29062021121504
47;234;29062021121504
48;232;29062021121504
49;229;29062021121504
50;230;29062021121504
51;227;29062021121504
52;225;29062021121504
53;228;29062021121504
54;227;29062021121504
55;227;29062021121504
56;231;29062021121504
57;230;29062021121504
58;236;29062021121504
59;235;29062021121504
60;241;29062021121504
61;246;29062021121504
62;245;29062021121504
63;247;29062021121504
64;249;29062021121504
65;244;29062021121504
66;249;29062021121504
67;243;29062021121504
68;241;29062021121504
69;241;29062021121504
70;234;29062021121504
71;232;29062021121504
72;231;29062021121504
73;226;29062021121504
74;224;29062021121504
75;217;29062021121504
76;215;29062021121504
77;210;29062021121504
78;208;29062021121504
79;205;29062021121504
80;201;29062021121504
81;194;29062021121504
82;192;29062021121504
83;189;29062021121504
84;187;29062021121504
85;187;29062021121504
86;185;29062021121504
87;186;29062021121504
88;184;29062021121504
89;179;29062021121504
90;181;29062021121504
91;178;29062021121504
92;175;29062021121504
93;173;29062021121504
94;173;29062021121504
95;167;29062021121504
96;169;29062021121504
97;164;29062021121504
98;161;29062021121504
99;162;29062021121504
100;158;29062021121504
101;162;29062021121504
102;159;29062021121504
103;156;29062021121504
104;156;29062021121504
105;153;29062021121504
106;154;29062021121504
107;152;29062021121504
108;150;29062021121504
109;151;29062021121504
110;147;29062021121504
111;146;29062021121504
112;148;29062021121504
113;145;29062021121504
114;146;29062021121504
115;147;29062021121504
116;144;29062021121504
117;148;29062021121504
118;142;29062021121504
119;144;29062021121504
120;142;29062021121504
121;140;29062021121504
122;141;29062021121504
123;141;29062021121504
124;140;29062021121504
125;140;29062021121504
126;138;29062021121504
127;139;29062021121504
128;139;29062021121504
129;137;29062021121504
130;137;29062021121504
131;137;29062021121504
132;135;29062021121504
133;140;29062021121504
134;134;29062021121504
135;134;29062021121504
136;135;29062021121504
137;133;29062021121504
138;136;29062021121504
139;133;29062021121504
140;132;29062021121504
141;135;29062021121504
142;133;29062021121504
143;132;29062021121504
144;134;29062021121504
145;130;29062021121504
146;134;29062021121504
147;134;29062021121504
148;131;29062021121504
149;133;29062021121504
150;131;29062021121504
151;132;29062021121504
152;129;29062021121504
153;129;29062021121504
154;131;29062021121504
155;131;29062021121504
156;129;29062021121504
157;130;29062021121504
158;130;29062021121504
159;129;29062021121504
160;131;29062021121504
161;128;29062021121504
162;130;29062021121504
163;129;29062021121504
164;129;29062021121504
165;132;29062021121504
166;129;29062021121504
167;130;29062021121504
168;131;29062021121504
169;127;29062021121504
170;130;29062021121504
171;129;29062021121504
172;128;29062021121504
173;130;29062021121504
174;128;29062021121504
175;128;29062021121504
176;130;29062021121504
177;128;29062021121504
178;130;29062021121504
179;129;29062021121504
180;128;29062021121504
181;129;29062021121504
182;130;29062021121504
183;128;29062021121504
184;129;29062021121504
185;126;29062021121504
186;129;29062021121504
187;128;29062021121504
188;127;29062021121504
189;129;29062021121504
190;128;29062021121504
191;129;29062021121504
192;132;29062021121504
193;128;29062021121504
194;130;29062021121504
195;129;29062021121504
196;127;29062021121504
197;129;29062021121504
198;129;29062021121504
199;127;29062021121504
200;0;29062021121504
