ind;val;datetime
0;0;29062021165035
1;144;29062021165035
2;136;29062021165035
3;135;29062021165035
4;136;29062021165035
5;137;29062021165035
6;135;29062021165035
7;139;29062021165035
8;141;29062021165035
9;139;29062021165035
10;143;29062021165035
11;142;29062021165035
12;144;29062021165035
13;151;29062021165035
14;152;29062021165035
15;163;29062021165035
16;172;29062021165035
17;194;29062021165035
18;243;29062021165035
19;338;29062021165035
20;561;29062021165035
21;1023;29062021165035
22;1023;29062021165035
23;1023;29062021165035
24;1023;29062021165035
25;1023;29062021165035
26;1023;29062021165035
27;1023;29062021165035
28;1023;29062021165035
29;1023;29062021165035
30;1023;29062021165035
31;1023;29062021165035
32;1023;29062021165035
33;1023;29062021165035
34;1023;29062021165035
35;1023;29062021165035
36;1023;29062021165035
37;1023;29062021165035
38;872;29062021165035
39;723;29062021165035
40;612;29062021165035
41;526;29062021165035
42;484;29062021165035
43;443;29062021165035
44;425;29062021165035
45;406;29062021165035
46;398;29062021165035
47;391;29062021165035
48;389;29062021165035
49;390;29062021165035
50;397;29062021165035
51;396;29062021165035
52;399;29062021165035
53;410;29062021165035
54;415;29062021165035
55;420;29062021165035
56;432;29062021165035
57;442;29062021165035
58;459;29062021165035
59;464;29062021165035
60;479;29062021165035
61;493;29062021165035
62;495;29062021165035
63;508;29062021165035
64;514;29062021165035
65;514;29062021165035
66;523;29062021165035
67;519;29062021165035
68;518;29062021165035
69;511;29062021165035
70;501;29062021165035
71;493;29062021165035
72;485;29062021165035
73;467;29062021165035
74;458;29062021165035
75;436;29062021165035
76;426;29062021165035
77;414;29062021165035
78;403;29062021165035
79;389;29062021165035
80;376;29062021165035
81;361;29062021165035
82;355;29062021165035
83;342;29062021165035
84;334;29062021165035
85;331;29062021165035
86;324;29062021165035
87;323;29062021165035
88;318;29062021165035
89;312;29062021165035
90;309;29062021165035
91;303;29062021165035
92;292;29062021165035
93;288;29062021165035
94;278;29062021165035
95;268;29062021165035
96;264;29062021165035
97;256;29062021165035
98;252;29062021165035
99;246;29062021165035
100;240;29062021165035
101;238;29062021165035
102;231;29062021165035
103;227;29062021165035
104;224;29062021165035
105;218;29062021165035
106;217;29062021165035
107;211;29062021165035
108;206;29062021165035
109;203;29062021165035
110;197;29062021165035
111;195;29062021165035
112;195;29062021165035
113;189;29062021165035
114;188;29062021165035
115;187;29062021165035
116;185;29062021165035
117;186;29062021165035
118;180;29062021165035
119;178;29062021165035
120;175;29062021165035
121;172;29062021165035
122;172;29062021165035
123;170;29062021165035
124;167;29062021165035
125;168;29062021165035
126;162;29062021165035
127;161;29062021165035
128;162;29062021165035
129;158;29062021165035
130;158;29062021165035
131;155;29062021165035
132;153;29062021165035
133;156;29062021165035
134;149;29062021165035
135;149;29062021165035
136;149;29062021165035
137;147;29062021165035
138;148;29062021165035
139;144;29062021165035
140;142;29062021165035
141;144;29062021165035
142;141;29062021165035
143;140;29062021165035
144;141;29062021165035
145;138;29062021165035
146;139;29062021165035
147;137;29062021165035
148;136;29062021165035
149;136;29062021165035
150;134;29062021165035
151;135;29062021165035
152;134;29062021165035
153;133;29062021165035
154;134;29062021165035
155;133;29062021165035
156;131;29062021165035
157;132;29062021165035
158;130;29062021165035
159;130;29062021165035
160;131;29062021165035
161;129;29062021165035
162;132;29062021165035
163;131;29062021165035
164;129;29062021165035
165;131;29062021165035
166;129;29062021165035
167;129;29062021165035
168;130;29062021165035
169;126;29062021165035
170;128;29062021165035
171;128;29062021165035
172;126;29062021165035
173;128;29062021165035
174;127;29062021165035
175;125;29062021165035
176;128;29062021165035
177;126;29062021165035
178;128;29062021165035
179;126;29062021165035
180;126;29062021165035
181;127;29062021165035
182;126;29062021165035
183;125;29062021165035
184;126;29062021165035
185;123;29062021165035
186;126;29062021165035
187;125;29062021165035
188;122;29062021165035
189;125;29062021165035
190;123;29062021165035
191;124;29062021165035
192;127;29062021165035
193;124;29062021165035
194;125;29062021165035
195;124;29062021165035
196;124;29062021165035
197;125;29062021165035
198;124;29062021165035
199;123;29062021165035
200;0;29062021165035
0;0;29062021165036
1;144;29062021165036
2;134;29062021165036
3;134;29062021165036
4;136;29062021165036
5;137;29062021165036
6;135;29062021165036
7;138;29062021165036
8;140;29062021165036
9;138;29062021165036
10;143;29062021165036
11;142;29062021165036
12;145;29062021165036
13;150;29062021165036
14;153;29062021165036
15;163;29062021165036
16;174;29062021165036
17;194;29062021165036
18;243;29062021165036
19;338;29062021165036
20;568;29062021165036
21;1023;29062021165036
22;1023;29062021165036
23;1023;29062021165036
24;1023;29062021165036
25;1023;29062021165036
26;1023;29062021165036
27;1023;29062021165036
28;1023;29062021165036
29;1023;29062021165036
30;1023;29062021165036
31;1023;29062021165036
32;1023;29062021165036
33;1023;29062021165036
34;1023;29062021165036
35;1023;29062021165036
36;1023;29062021165036
37;1023;29062021165036
38;879;29062021165036
39;729;29062021165036
40;614;29062021165036
41;538;29062021165036
42;488;29062021165036
43;445;29062021165036
44;429;29062021165036
45;411;29062021165036
46;399;29062021165036
47;394;29062021165036
48;392;29062021165036
49;395;29062021165036
50;394;29062021165036
51;397;29062021165036
52;399;29062021165036
53;411;29062021165036
54;417;29062021165036
55;422;29062021165036
56;436;29062021165036
57;443;29062021165036
58;462;29062021165036
59;467;29062021165036
60;483;29062021165036
61;492;29062021165036
62;500;29062021165036
63;511;29062021165036
64;517;29062021165036
65;521;29062021165036
66;525;29062021165036
67;522;29062021165036
68;520;29062021165036
69;511;29062021165036
70;500;29062021165036
71;495;29062021165036
72;488;29062021165036
73;464;29062021165036
74;457;29062021165036
75;438;29062021165036
76;426;29062021165036
77;415;29062021165036
78;406;29062021165036
79;389;29062021165036
80;378;29062021165036
81;362;29062021165036
82;353;29062021165036
83;342;29062021165036
84;338;29062021165036
85;331;29062021165036
86;324;29062021165036
87;323;29062021165036
88;318;29062021165036
89;313;29062021165036
90;308;29062021165036
91;301;29062021165036
92;291;29062021165036
93;287;29062021165036
94;275;29062021165036
95;267;29062021165036
96;264;29062021165036
97;257;29062021165036
98;251;29062021165036
99;247;29062021165036
100;242;29062021165036
101;239;29062021165036
102;229;29062021165036
103;226;29062021165036
104;224;29062021165036
105;216;29062021165036
106;216;29062021165036
107;211;29062021165036
108;206;29062021165036
109;205;29062021165036
110;200;29062021165036
111;196;29062021165036
112;194;29062021165036
113;188;29062021165036
114;187;29062021165036
115;185;29062021165036
116;183;29062021165036
117;184;29062021165036
118;180;29062021165036
119;179;29062021165036
120;175;29062021165036
121;171;29062021165036
122;170;29062021165036
123;167;29062021165036
124;166;29062021165036
125;166;29062021165036
126;160;29062021165036
127;160;29062021165036
128;160;29062021165036
129;158;29062021165036
130;157;29062021165036
131;155;29062021165036
132;152;29062021165036
133;154;29062021165036
134;148;29062021165036
135;148;29062021165036
136;149;29062021165036
137;145;29062021165036
138;147;29062021165036
139;145;29062021165036
140;142;29062021165036
141;143;29062021165036
142;141;29062021165036
143;140;29062021165036
144;139;29062021165036
145;136;29062021165036
146;139;29062021165036
147;137;29062021165036
148;134;29062021165036
149;135;29062021165036
150;134;29062021165036
151;135;29062021165036
152;133;29062021165036
153;132;29062021165036
154;133;29062021165036
155;131;29062021165036
156;131;29062021165036
157;131;29062021165036
158;130;29062021165036
159;129;29062021165036
160;132;29062021165036
161;129;29062021165036
162;131;29062021165036
163;129;29062021165036
164;129;29062021165036
165;130;29062021165036
166;129;29062021165036
167;128;29062021165036
168;128;29062021165036
169;126;29062021165036
170;128;29062021165036
171;127;29062021165036
172;126;29062021165036
173;126;29062021165036
174;127;29062021165036
175;125;29062021165036
176;126;29062021165036
177;125;29062021165036
178;127;29062021165036
179;125;29062021165036
180;125;29062021165036
181;127;29062021165036
182;125;29062021165036
183;124;29062021165036
184;124;29062021165036
185;123;29062021165036
186;126;29062021165036
187;124;29062021165036
188;123;29062021165036
189;126;29062021165036
190;123;29062021165036
191;123;29062021165036
192;127;29062021165036
193;123;29062021165036
194;123;29062021165036
195;124;29062021165036
196;122;29062021165036
197;124;29062021165036
198;123;29062021165036
199;123;29062021165036
200;0;29062021165036
0;0;29062021165037
1;145;29062021165037
2;135;29062021165037
3;134;29062021165037
4;135;29062021165037
5;137;29062021165037
6;135;29062021165037
7;138;29062021165037
8;139;29062021165037
9;139;29062021165037
10;143;29062021165037
11;143;29062021165037
12;144;29062021165037
13;151;29062021165037
14;154;29062021165037
15;162;29062021165037
16;175;29062021165037
17;193;29062021165037
18;242;29062021165037
19;339;29062021165037
20;563;29062021165037
21;1021;29062021165037
22;1023;29062021165037
23;1023;29062021165037
24;1023;29062021165037
25;1023;29062021165037
26;1023;29062021165037
27;1023;29062021165037
28;1023;29062021165037
29;1023;29062021165037
30;1023;29062021165037
31;1023;29062021165037
32;1023;29062021165037
33;1023;29062021165037
34;1023;29062021165037
35;1023;29062021165037
36;1023;29062021165037
37;1023;29062021165037
38;876;29062021165037
39;726;29062021165037
40;612;29062021165037
41;532;29062021165037
42;487;29062021165037
43;444;29062021165037
44;424;29062021165037
45;409;29062021165037
46;401;29062021165037
47;392;29062021165037
48;392;29062021165037
49;391;29062021165037
50;392;29062021165037
51;396;29062021165037
52;399;29062021165037
53;409;29062021165037
54;415;29062021165037
55;423;29062021165037
56;430;29062021165037
57;446;29062021165037
58;457;29062021165037
59;469;29062021165037
60;477;29062021165037
61;490;29062021165037
62;498;29062021165037
63;509;29062021165037
64;516;29062021165037
65;519;29062021165037
66;523;29062021165037
67;522;29062021165037
68;520;29062021165037
69;514;29062021165037
70;499;29062021165037
71;494;29062021165037
72;482;29062021165037
73;466;29062021165037
74;456;29062021165037
75;438;29062021165037
76;429;29062021165037
77;417;29062021165037
78;402;29062021165037
79;388;29062021165037
80;374;29062021165037
81;359;29062021165037
82;355;29062021165037
83;344;29062021165037
84;337;29062021165037
85;330;29062021165037
86;324;29062021165037
87;323;29062021165037
88;322;29062021165037
89;312;29062021165037
90;308;29062021165037
91;299;29062021165037
92;291;29062021165037
93;286;29062021165037
94;277;29062021165037
95;269;29062021165037
96;265;29062021165037
97;256;29062021165037
98;250;29062021165037
99;246;29062021165037
100;240;29062021165037
101;239;29062021165037
102;232;29062021165037
103;224;29062021165037
104;222;29062021165037
105;218;29062021165037
106;217;29062021165037
107;210;29062021165037
108;206;29062021165037
109;204;29062021165037
110;199;29062021165037
111;195;29062021165037
112;195;29062021165037
113;191;29062021165037
114;188;29062021165037
115;189;29062021165037
116;183;29062021165037
117;185;29062021165037
118;177;29062021165037
119;177;29062021165037
120;176;29062021165037
121;172;29062021165037
122;169;29062021165037
123;170;29062021165037
124;165;29062021165037
125;165;29062021165037
126;163;29062021165037
127;162;29062021165037
128;161;29062021165037
129;156;29062021165037
130;157;29062021165037
131;156;29062021165037
132;153;29062021165037
133;155;29062021165037
134;149;29062021165037
135;147;29062021165037
136;149;29062021165037
137;145;29062021165037
138;145;29062021165037
139;144;29062021165037
140;142;29062021165037
141;143;29062021165037
142;141;29062021165037
143;139;29062021165037
144;140;29062021165037
145;137;29062021165037
146;139;29062021165037
147;138;29062021165037
148;135;29062021165037
149;135;29062021165037
150;135;29062021165037
151;134;29062021165037
152;134;29062021165037
153;132;29062021165037
154;134;29062021165037
155;132;29062021165037
156;130;29062021165037
157;131;29062021165037
158;131;29062021165037
159;130;29062021165037
160;131;29062021165037
161;128;29062021165037
162;131;29062021165037
163;131;29062021165037
164;129;29062021165037
165;129;29062021165037
166;128;29062021165037
167;128;29062021165037
168;129;29062021165037
169;125;29062021165037
170;128;29062021165037
171;127;29062021165037
172;127;29062021165037
173;127;29062021165037
174;125;29062021165037
175;125;29062021165037
176;127;29062021165037
177;125;29062021165037
178;127;29062021165037
179;126;29062021165037
180;124;29062021165037
181;127;29062021165037
182;125;29062021165037
183;124;29062021165037
184;125;29062021165037
185;122;29062021165037
186;126;29062021165037
187;125;29062021165037
188;123;29062021165037
189;125;29062021165037
190;124;29062021165037
191;124;29062021165037
192;127;29062021165037
193;123;29062021165037
194;124;29062021165037
195;124;29062021165037
196;123;29062021165037
197;125;29062021165037
198;124;29062021165037
199;122;29062021165037
200;0;29062021165037
0;0;29062021165037
1;144;29062021165037
2;134;29062021165037
3;133;29062021165037
4;136;29062021165037
5;137;29062021165037
6;134;29062021165037
7;137;29062021165037
8;139;29062021165037
9;138;29062021165037
10;142;29062021165037
11;142;29062021165037
12;144;29062021165037
13;150;29062021165037
14;153;29062021165037
15;162;29062021165037
16;172;29062021165037
17;193;29062021165037
18;241;29062021165037
19;339;29062021165037
20;557;29062021165037
21;1015;29062021165037
22;1023;29062021165037
23;1023;29062021165037
24;1023;29062021165037
25;1023;29062021165037
26;1023;29062021165037
27;1023;29062021165037
28;1023;29062021165037
29;1023;29062021165037
30;1023;29062021165037
31;1023;29062021165037
32;1023;29062021165037
33;1023;29062021165037
34;1023;29062021165037
35;1023;29062021165037
36;1023;29062021165037
37;1023;29062021165037
38;895;29062021165037
39;738;29062021165037
40;621;29062021165037
41;539;29062021165037
42;489;29062021165037
43;447;29062021165037
44;422;29062021165037
45;409;29062021165037
46;397;29062021165037
47;391;29062021165037
48;393;29062021165037
49;388;29062021165037
50;394;29062021165037
51;395;29062021165037
52;398;29062021165037
53;408;29062021165037
54;415;29062021165037
55;423;29062021165037
56;433;29062021165037
57;441;29062021165037
58;453;29062021165037
59;466;29062021165037
60;479;29062021165037
61;492;29062021165037
62;495;29062021165037
63;512;29062021165037
64;511;29062021165037
65;519;29062021165037
66;521;29062021165037
67;518;29062021165037
68;516;29062021165037
69;512;29062021165037
70;500;29062021165037
71;493;29062021165037
72;486;29062021165037
73;468;29062021165037
74;461;29062021165037
75;440;29062021165037
76;427;29062021165037
77;419;29062021165037
78;405;29062021165037
79;390;29062021165037
80;375;29062021165037
81;361;29062021165037
82;351;29062021165037
83;338;29062021165037
84;336;29062021165037
85;330;29062021165037
86;325;29062021165037
87;319;29062021165037
88;321;29062021165037
89;310;29062021165037
90;307;29062021165037
91;299;29062021165037
92;291;29062021165037
93;286;29062021165037
94;278;29062021165037
95;272;29062021165037
96;264;29062021165037
97;256;29062021165037
98;251;29062021165037
99;243;29062021165037
100;238;29062021165037
101;236;29062021165037
102;232;29062021165037
103;226;29062021165037
104;222;29062021165037
105;217;29062021165037
106;216;29062021165037
107;210;29062021165037
108;205;29062021165037
109;204;29062021165037
110;200;29062021165037
111;195;29062021165037
112;195;29062021165037
113;187;29062021165037
114;187;29062021165037
115;185;29062021165037
116;182;29062021165037
117;184;29062021165037
118;177;29062021165037
119;175;29062021165037
120;174;29062021165037
121;171;29062021165037
122;171;29062021165037
123;169;29062021165037
124;167;29062021165037
125;166;29062021165037
126;161;29062021165037
127;160;29062021165037
128;161;29062021165037
129;157;29062021165037
130;156;29062021165037
131;156;29062021165037
132;151;29062021165037
133;153;29062021165037
134;150;29062021165037
135;148;29062021165037
136;147;29062021165037
137;146;29062021165037
138;148;29062021165037
139;145;29062021165037
140;141;29062021165037
141;143;29062021165037
142;140;29062021165037
143;139;29062021165037
144;141;29062021165037
145;136;29062021165037
146;139;29062021165037
147;138;29062021165037
148;136;29062021165037
149;135;29062021165037
150;134;29062021165037
151;134;29062021165037
152;134;29062021165037
153;131;29062021165037
154;134;29062021165037
155;131;29062021165037
156;130;29062021165037
157;132;29062021165037
158;130;29062021165037
159;131;29062021165037
160;130;29062021165037
161;129;29062021165037
162;130;29062021165037
163;129;29062021165037
164;128;29062021165037
165;131;29062021165037
166;128;29062021165037
167;128;29062021165037
168;129;29062021165037
169;126;29062021165037
170;129;29062021165037
171;127;29062021165037
172;127;29062021165037
173;127;29062021165037
174;126;29062021165037
175;124;29062021165037
176;127;29062021165037
177;123;29062021165037
178;127;29062021165037
179;125;29062021165037
180;124;29062021165037
181;126;29062021165037
182;125;29062021165037
183;124;29062021165037
184;125;29062021165037
185;123;29062021165037
186;126;29062021165037
187;124;29062021165037
188;122;29062021165037
189;125;29062021165037
190;123;29062021165037
191;123;29062021165037
192;126;29062021165037
193;122;29062021165037
194;124;29062021165037
195;124;29062021165037
196;123;29062021165037
197;123;29062021165037
198;124;29062021165037
199;122;29062021165037
200;0;29062021165037
0;0;29062021165038
1;145;29062021165038
2;135;29062021165038
3;134;29062021165038
4;136;29062021165038
5;136;29062021165038
6;135;29062021165038
7;138;29062021165038
8;140;29062021165038
9;139;29062021165038
10;143;29062021165038
11;143;29062021165038
12;144;29062021165038
13;150;29062021165038
14;155;29062021165038
15;162;29062021165038
16;175;29062021165038
17;194;29062021165038
18;242;29062021165038
19;339;29062021165038
20;556;29062021165038
21;1021;29062021165038
22;1023;29062021165038
23;1023;29062021165038
24;1023;29062021165038
25;1023;29062021165038
26;1023;29062021165038
27;1023;29062021165038
28;1023;29062021165038
29;1023;29062021165038
30;1023;29062021165038
31;1023;29062021165038
32;1023;29062021165038
33;1023;29062021165038
34;1023;29062021165038
35;1023;29062021165038
36;1023;29062021165038
37;1023;29062021165038
38;884;29062021165038
39;733;29062021165038
40;618;29062021165038
41;534;29062021165038
42;483;29062021165038
43;444;29062021165038
44;421;29062021165038
45;408;29062021165038
46;400;29062021165038
47;392;29062021165038
48;394;29062021165038
49;389;29062021165038
50;394;29062021165038
51;395;29062021165038
52;399;29062021165038
53;411;29062021165038
54;411;29062021165038
55;424;29062021165038
56;435;29062021165038
57;440;29062021165038
58;455;29062021165038
59;467;29062021165038
60;479;29062021165038
61;490;29062021165038
62;496;29062021165038
63;510;29062021165038
64;515;29062021165038
65;517;29062021165038
66;522;29062021165038
67;519;29062021165038
68;516;29062021165038
69;507;29062021165038
70;500;29062021165038
71;493;29062021165038
72;487;29062021165038
73;464;29062021165038
74;458;29062021165038
75;442;29062021165038
76;429;29062021165038
77;415;29062021165038
78;399;29062021165038
79;390;29062021165038
80;373;29062021165038
81;358;29062021165038
82;354;29062021165038
83;343;29062021165038
84;333;29062021165038
85;333;29062021165038
86;323;29062021165038
87;323;29062021165038
88;317;29062021165038
89;311;29062021165038
90;307;29062021165038
91;300;29062021165038
92;292;29062021165038
93;285;29062021165038
94;279;29062021165038
95;268;29062021165038
96;266;29062021165038
97;257;29062021165038
98;253;29062021165038
99;245;29062021165038
100;240;29062021165038
101;239;29062021165038
102;234;29062021165038
103;226;29062021165038
104;225;29062021165038
105;218;29062021165038
106;216;29062021165038
107;212;29062021165038
108;207;29062021165038
109;205;29062021165038
110;199;29062021165038
111;196;29062021165038
112;194;29062021165038
113;188;29062021165038
114;187;29062021165038
115;185;29062021165038
116;183;29062021165038
117;186;29062021165038
118;179;29062021165038
119;178;29062021165038
120;175;29062021165038
121;171;29062021165038
122;171;29062021165038
123;170;29062021165038
124;167;29062021165038
125;166;29062021165038
126;162;29062021165038
127;160;29062021165038
128;160;29062021165038
129;157;29062021165038
130;156;29062021165038
131;155;29062021165038
132;152;29062021165038
133;155;29062021165038
134;149;29062021165038
135;148;29062021165038
136;151;29062021165038
137;146;29062021165038
138;147;29062021165038
139;144;29062021165038
140;141;29062021165038
141;143;29062021165038
142;141;29062021165038
143;139;29062021165038
144;140;29062021165038
145;137;29062021165038
146;138;29062021165038
147;138;29062021165038
148;136;29062021165038
149;137;29062021165038
150;134;29062021165038
151;135;29062021165038
152;135;29062021165038
153;132;29062021165038
154;133;29062021165038
155;133;29062021165038
156;132;29062021165038
157;133;29062021165038
158;130;29062021165038
159;129;29062021165038
160;131;29062021165038
161;129;29062021165038
162;131;29062021165038
163;130;29062021165038
164;130;29062021165038
165;131;29062021165038
166;129;29062021165038
167;128;29062021165038
168;129;29062021165038
169;126;29062021165038
170;128;29062021165038
171;127;29062021165038
172;127;29062021165038
173;127;29062021165038
174;125;29062021165038
175;124;29062021165038
176;127;29062021165038
177;125;29062021165038
178;127;29062021165038
179;125;29062021165038
180;125;29062021165038
181;127;29062021165038
182;125;29062021165038
183;125;29062021165038
184;126;29062021165038
185;123;29062021165038
186;126;29062021165038
187;125;29062021165038
188;123;29062021165038
189;125;29062021165038
190;124;29062021165038
191;124;29062021165038
192;126;29062021165038
193;124;29062021165038
194;124;29062021165038
195;124;29062021165038
196;123;29062021165038
197;124;29062021165038
198;125;29062021165038
199;123;29062021165038
200;0;29062021165038
0;0;29062021165038
1;144;29062021165038
2;135;29062021165038
3;133;29062021165038
4;135;29062021165038
5;136;29062021165038
6;133;29062021165038
7;136;29062021165038
8;139;29062021165038
9;138;29062021165038
10;143;29062021165038
11;142;29062021165038
12;145;29062021165038
13;150;29062021165038
14;153;29062021165038
15;162;29062021165038
16;173;29062021165038
17;194;29062021165038
18;240;29062021165038
19;338;29062021165038
20;561;29062021165038
21;1015;29062021165038
22;1023;29062021165038
23;1023;29062021165038
24;1023;29062021165038
25;1023;29062021165038
26;1023;29062021165038
27;1023;29062021165038
28;1023;29062021165038
29;1023;29062021165038
30;1023;29062021165038
31;1023;29062021165038
32;1023;29062021165038
33;1023;29062021165038
34;1023;29062021165038
35;1023;29062021165038
36;1023;29062021165038
37;1023;29062021165038
38;892;29062021165038
39;746;29062021165038
40;621;29062021165038
41;537;29062021165038
42;486;29062021165038
43;451;29062021165038
44;426;29062021165038
45;411;29062021165038
46;397;29062021165038
47;390;29062021165038
48;392;29062021165038
49;388;29062021165038
50;393;29062021165038
51;398;29062021165038
52;397;29062021165038
53;407;29062021165038
54;412;29062021165038
55;420;29062021165038
56;435;29062021165038
57;443;29062021165038
58;454;29062021165038
59;467;29062021165038
60;478;29062021165038
61;491;29062021165038
62;495;29062021165038
63;511;29062021165038
64;514;29062021165038
65;517;29062021165038
66;524;29062021165038
67;520;29062021165038
68;517;29062021165038
69;510;29062021165038
70;501;29062021165038
71;492;29062021165038
72;485;29062021165038
73;470;29062021165038
74;460;29062021165038
75;441;29062021165038
76;428;29062021165038
77;416;29062021165038
78;400;29062021165038
79;388;29062021165038
80;373;29062021165038
81;358;29062021165038
82;353;29062021165038
83;345;29062021165038
84;337;29062021165038
85;328;29062021165038
86;325;29062021165038
87;322;29062021165038
88;318;29062021165038
89;310;29062021165038
90;309;29062021165038
91;300;29062021165038
92;291;29062021165038
93;287;29062021165038
94;276;29062021165038
95;267;29062021165038
96;267;29062021165038
97;257;29062021165038
98;250;29062021165038
99;246;29062021165038
100;240;29062021165038
101;238;29062021165038
102;230;29062021165038
103;225;29062021165038
104;225;29062021165038
105;217;29062021165038
106;218;29062021165038
107;210;29062021165038
108;208;29062021165038
109;204;29062021165038
110;198;29062021165038
111;196;29062021165038
112;195;29062021165038
113;189;29062021165038
114;190;29062021165038
115;186;29062021165038
116;184;29062021165038
117;186;29062021165038
118;180;29062021165038
119;176;29062021165038
120;174;29062021165038
121;171;29062021165038
122;171;29062021165038
123;167;29062021165038
124;167;29062021165038
125;165;29062021165038
126;162;29062021165038
127;161;29062021165038
128;161;29062021165038
129;156;29062021165038
130;156;29062021165038
131;155;29062021165038
132;150;29062021165038
133;154;29062021165038
134;148;29062021165038
135;148;29062021165038
136;148;29062021165038
137;145;29062021165038
138;145;29062021165038
139;144;29062021165038
140;140;29062021165038
141;143;29062021165038
142;140;29062021165038
143;138;29062021165038
144;141;29062021165038
145;137;29062021165038
146;140;29062021165038
147;138;29062021165038
148;135;29062021165038
149;135;29062021165038
150;134;29062021165038
151;135;29062021165038
152;133;29062021165038
153;132;29062021165038
154;134;29062021165038
155;132;29062021165038
156;131;29062021165038
157;131;29062021165038
158;130;29062021165038
159;130;29062021165038
160;130;29062021165038
161;128;29062021165038
162;129;29062021165038
163;129;29062021165038
164;129;29062021165038
165;130;29062021165038
166;128;29062021165038
167;128;29062021165038
168;129;29062021165038
169;125;29062021165038
170;129;29062021165038
171;127;29062021165038
172;127;29062021165038
173;127;29062021165038
174;125;29062021165038
175;124;29062021165038
176;127;29062021165038
177;124;29062021165038
178;127;29062021165038
179;125;29062021165038
180;125;29062021165038
181;126;29062021165038
182;125;29062021165038
183;123;29062021165038
184;124;29062021165038
185;122;29062021165038
186;125;29062021165038
187;124;29062021165038
188;122;29062021165038
189;125;29062021165038
190;123;29062021165038
191;123;29062021165038
192;127;29062021165038
193;122;29062021165038
194;123;29062021165038
195;124;29062021165038
196;122;29062021165038
197;124;29062021165038
198;123;29062021165038
199;122;29062021165038
200;0;29062021165038
0;0;29062021165039
1;143;29062021165039
2;135;29062021165039
3;135;29062021165039
4;135;29062021165039
5;136;29062021165039
6;134;29062021165039
7;137;29062021165039
8;139;29062021165039
9;138;29062021165039
10;143;29062021165039
11;141;29062021165039
12;144;29062021165039
13;150;29062021165039
14;153;29062021165039
15;162;29062021165039
16;173;29062021165039
17;193;29062021165039
18;240;29062021165039
19;341;29062021165039
20;558;29062021165039
21;1017;29062021165039
22;1023;29062021165039
23;1023;29062021165039
24;1023;29062021165039
25;1023;29062021165039
26;1023;29062021165039
27;1023;29062021165039
28;1023;29062021165039
29;1023;29062021165039
30;1023;29062021165039
31;1023;29062021165039
32;1023;29062021165039
33;1023;29062021165039
34;1023;29062021165039
35;1023;29062021165039
36;1023;29062021165039
37;1023;29062021165039
38;888;29062021165039
39;739;29062021165039
40;622;29062021165039
41;541;29062021165039
42;488;29062021165039
43;447;29062021165039
44;423;29062021165039
45;409;29062021165039
46;397;29062021165039
47;394;29062021165039
48;392;29062021165039
49;387;29062021165039
50;396;29062021165039
51;397;29062021165039
52;400;29062021165039
53;407;29062021165039
54;414;29062021165039
55;425;29062021165039
56;433;29062021165039
57;445;29062021165039
58;457;29062021165039
59;466;29062021165039
60;479;29062021165039
61;490;29062021165039
62;498;29062021165039
63;512;29062021165039
64;517;29062021165039
65;517;29062021165039
66;523;29062021165039
67;521;29062021165039
68;513;29062021165039
69;514;29062021165039
70;502;29062021165039
71;492;29062021165039
72;486;29062021165039
73;467;29062021165039
74;455;29062021165039
75;441;29062021165039
76;431;29062021165039
77;418;29062021165039
78;399;29062021165039
79;389;29062021165039
80;376;29062021165039
81;358;29062021165039
82;352;29062021165039
83;342;29062021165039
84;336;29062021165039
85;329;29062021165039
86;326;29062021165039
87;322;29062021165039
88;317;29062021165039
89;308;29062021165039
90;309;29062021165039
91;302;29062021165039
92;289;29062021165039
93;286;29062021165039
94;278;29062021165039
95;271;29062021165039
96;266;29062021165039
97;259;29062021165039
98;251;29062021165039
99;248;29062021165039
100;241;29062021165039
101;239;29062021165039
102;232;29062021165039
103;226;29062021165039
104;223;29062021165039
105;216;29062021165039
106;217;29062021165039
107;211;29062021165039
108;209;29062021165039
109;206;29062021165039
110;200;29062021165039
111;197;29062021165039
112;195;29062021165039
113;187;29062021165039
114;189;29062021165039
115;187;29062021165039
116;185;29062021165039
117;185;29062021165039
118;179;29062021165039
119;177;29062021165039
120;175;29062021165039
121;172;29062021165039
122;172;29062021165039
123;169;29062021165039
124;167;29062021165039
125;166;29062021165039
126;161;29062021165039
127;160;29062021165039
128;163;29062021165039
129;157;29062021165039
130;155;29062021165039
131;156;29062021165039
132;151;29062021165039
133;154;29062021165039
134;149;29062021165039
135;148;29062021165039
136;149;29062021165039
137;144;29062021165039
138;145;29062021165039
139;143;29062021165039
140;141;29062021165039
141;144;29062021165039
142;141;29062021165039
143;140;29062021165039
144;140;29062021165039
145;137;29062021165039
146;139;29062021165039
147;138;29062021165039
148;135;29062021165039
149;136;29062021165039
150;134;29062021165039
151;136;29062021165039
152;133;29062021165039
153;132;29062021165039
154;134;29062021165039
155;132;29062021165039
156;131;29062021165039
157;131;29062021165039
158;130;29062021165039
159;130;29062021165039
160;131;29062021165039
161;129;29062021165039
162;130;29062021165039
163;131;29062021165039
164;129;29062021165039
165;131;29062021165039
166;128;29062021165039
167;128;29062021165039
168;129;29062021165039
169;125;29062021165039
170;128;29062021165039
171;126;29062021165039
172;126;29062021165039
173;127;29062021165039
174;126;29062021165039
175;125;29062021165039
176;126;29062021165039
177;124;29062021165039
178;127;29062021165039
179;125;29062021165039
180;125;29062021165039
181;126;29062021165039
182;125;29062021165039
183;124;29062021165039
184;124;29062021165039
185;122;29062021165039
186;125;29062021165039
187;124;29062021165039
188;122;29062021165039
189;124;29062021165039
190;123;29062021165039
191;123;29062021165039
192;127;29062021165039
193;123;29062021165039
194;124;29062021165039
195;123;29062021165039
196;122;29062021165039
197;124;29062021165039
198;123;29062021165039
199;122;29062021165039
200;0;29062021165039
0;0;29062021165040
1;144;29062021165040
2;136;29062021165040
3;133;29062021165040
4;134;29062021165040
5;136;29062021165040
6;135;29062021165040
7;138;29062021165040
8;139;29062021165040
9;137;29062021165040
10;141;29062021165040
11;142;29062021165040
12;143;29062021165040
13;151;29062021165040
14;153;29062021165040
15;163;29062021165040
16;174;29062021165040
17;194;29062021165040
18;242;29062021165040
19;341;29062021165040
20;561;29062021165040
21;1020;29062021165040
22;1023;29062021165040
23;1023;29062021165040
24;1023;29062021165040
25;1023;29062021165040
26;1023;29062021165040
27;1023;29062021165040
28;1023;29062021165040
29;1023;29062021165040
30;1023;29062021165040
31;1023;29062021165040
32;1023;29062021165040
33;1023;29062021165040
34;1023;29062021165040
35;1023;29062021165040
36;1023;29062021165040
37;1023;29062021165040
38;890;29062021165040
39;740;29062021165040
40;621;29062021165040
41;537;29062021165040
42;492;29062021165040
43;447;29062021165040
44;424;29062021165040
45;405;29062021165040
46;396;29062021165040
47;393;29062021165040
48;394;29062021165040
49;389;29062021165040
50;393;29062021165040
51;401;29062021165040
52;396;29062021165040
53;407;29062021165040
54;418;29062021165040
55;422;29062021165040
56;432;29062021165040
57;443;29062021165040
58;459;29062021165040
59;465;29062021165040
60;482;29062021165040
61;490;29062021165040
62;497;29062021165040
63;511;29062021165040
64;519;29062021165040
65;519;29062021165040
66;525;29062021165040
67;520;29062021165040
68;518;29062021165040
69;513;29062021165040
70;505;29062021165040
71;493;29062021165040
72;489;29062021165040
73;470;29062021165040
74;459;29062021165040
75;438;29062021165040
76;432;29062021165040
77;419;29062021165040
78;402;29062021165040
79;387;29062021165040
80;372;29062021165040
81;361;29062021165040
82;355;29062021165040
83;344;29062021165040
84;336;29062021165040
85;333;29062021165040
86;325;29062021165040
87;320;29062021165040
88;321;29062021165040
89;307;29062021165040
90;308;29062021165040
91;304;29062021165040
92;291;29062021165040
93;286;29062021165040
94;277;29062021165040
95;267;29062021165040
96;265;29062021165040
97;254;29062021165040
98;252;29062021165040
99;246;29062021165040
100;239;29062021165040
101;239;29062021165040
102;231;29062021165040
103;226;29062021165040
104;224;29062021165040
105;216;29062021165040
106;217;29062021165040
107;209;29062021165040
108;206;29062021165040
109;205;29062021165040
110;200;29062021165040
111;195;29062021165040
112;195;29062021165040
113;190;29062021165040
114;187;29062021165040
115;186;29062021165040
116;184;29062021165040
117;185;29062021165040
118;179;29062021165040
119;177;29062021165040
120;175;29062021165040
121;170;29062021165040
122;174;29062021165040
123;168;29062021165040
124;165;29062021165040
125;166;29062021165040
126;162;29062021165040
127;160;29062021165040
128;161;29062021165040
129;157;29062021165040
130;156;29062021165040
131;155;29062021165040
132;151;29062021165040
133;153;29062021165040
134;151;29062021165040
135;149;29062021165040
136;148;29062021165040
137;145;29062021165040
138;146;29062021165040
139;144;29062021165040
140;141;29062021165040
141;143;29062021165040
142;141;29062021165040
143;139;29062021165040
144;140;29062021165040
145;138;29062021165040
146;140;29062021165040
147;138;29062021165040
148;135;29062021165040
149;135;29062021165040
150;134;29062021165040
151;134;29062021165040
152;134;29062021165040
153;132;29062021165040
154;134;29062021165040
155;131;29062021165040
156;131;29062021165040
157;131;29062021165040
158;129;29062021165040
159;129;29062021165040
160;131;29062021165040
161;129;29062021165040
162;130;29062021165040
163;129;29062021165040
164;129;29062021165040
165;130;29062021165040
166;129;29062021165040
167;128;29062021165040
168;128;29062021165040
169;126;29062021165040
170;128;29062021165040
171;127;29062021165040
172;126;29062021165040
173;127;29062021165040
174;126;29062021165040
175;125;29062021165040
176;126;29062021165040
177;124;29062021165040
178;126;29062021165040
179;126;29062021165040
180;124;29062021165040
181;126;29062021165040
182;125;29062021165040
183;123;29062021165040
184;125;29062021165040
185;122;29062021165040
186;126;29062021165040
187;124;29062021165040
188;122;29062021165040
189;123;29062021165040
190;124;29062021165040
191;123;29062021165040
192;126;29062021165040
193;123;29062021165040
194;124;29062021165040
195;123;29062021165040
196;122;29062021165040
197;124;29062021165040
198;125;29062021165040
199;122;29062021165040
200;0;29062021165040
0;0;29062021165041
1;145;29062021165041
2;136;29062021165041
3;134;29062021165041
4;135;29062021165041
5;136;29062021165041
6;135;29062021165041
7;137;29062021165041
8;139;29062021165041
9;139;29062021165041
10;143;29062021165041
11;143;29062021165041
12;144;29062021165041
13;151;29062021165041
14;152;29062021165041
15;163;29062021165041
16;174;29062021165041
17;194;29062021165041
18;240;29062021165041
19;342;29062021165041
20;561;29062021165041
21;1018;29062021165041
22;1023;29062021165041
23;1023;29062021165041
24;1023;29062021165041
25;1023;29062021165041
26;1023;29062021165041
27;1023;29062021165041
28;1023;29062021165041
29;1023;29062021165041
30;1023;29062021165041
31;1023;29062021165041
32;1023;29062021165041
33;1023;29062021165041
34;1023;29062021165041
35;1023;29062021165041
36;1023;29062021165041
37;1023;29062021165041
38;884;29062021165041
39;734;29062021165041
40;618;29062021165041
41;538;29062021165041
42;490;29062021165041
43;448;29062021165041
44;425;29062021165041
45;404;29062021165041
46;397;29062021165041
47;392;29062021165041
48;392;29062021165041
49;392;29062021165041
50;395;29062021165041
51;396;29062021165041
52;396;29062021165041
53;410;29062021165041
54;412;29062021165041
55;421;29062021165041
56;432;29062021165041
57;442;29062021165041
58;457;29062021165041
59;464;29062021165041
60;475;29062021165041
61;488;29062021165041
62;498;29062021165041
63;508;29062021165041
64;516;29062021165041
65;515;29062021165041
66;520;29062021165041
67;520;29062021165041
68;515;29062021165041
69;510;29062021165041
70;498;29062021165041
71;493;29062021165041
72;484;29062021165041
73;468;29062021165041
74;456;29062021165041
75;441;29062021165041
76;430;29062021165041
77;420;29062021165041
78;403;29062021165041
79;389;29062021165041
80;376;29062021165041
81;361;29062021165041
82;354;29062021165041
83;342;29062021165041
84;334;29062021165041
85;331;29062021165041
86;325;29062021165041
87;324;29062021165041
88;319;29062021165041
89;309;29062021165041
90;306;29062021165041
91;300;29062021165041
92;294;29062021165041
93;286;29062021165041
94;276;29062021165041
95;268;29062021165041
96;264;29062021165041
97;255;29062021165041
98;250;29062021165041
99;244;29062021165041
100;239;29062021165041
101;237;29062021165041
102;229;29062021165041
103;225;29062021165041
104;224;29062021165041
105;217;29062021165041
106;217;29062021165041
107;211;29062021165041
108;205;29062021165041
109;204;29062021165041
110;198;29062021165041
111;196;29062021165041
112;194;29062021165041
113;187;29062021165041
114;189;29062021165041
115;186;29062021165041
116;183;29062021165041
117;184;29062021165041
118;178;29062021165041
119;179;29062021165041
120;174;29062021165041
121;172;29062021165041
122;171;29062021165041
123;169;29062021165041
124;166;29062021165041
125;166;29062021165041
126;162;29062021165041
127;161;29062021165041
128;162;29062021165041
129;156;29062021165041
130;156;29062021165041
131;156;29062021165041
132;151;29062021165041
133;155;29062021165041
134;149;29062021165041
135;148;29062021165041
136;149;29062021165041
137;146;29062021165041
138;146;29062021165041
139;144;29062021165041
140;143;29062021165041
141;144;29062021165041
142;140;29062021165041
143;140;29062021165041
144;141;29062021165041
145;136;29062021165041
146;139;29062021165041
147;138;29062021165041
148;135;29062021165041
149;135;29062021165041
150;134;29062021165041
151;134;29062021165041
152;134;29062021165041
153;131;29062021165041
154;134;29062021165041
155;131;29062021165041
156;130;29062021165041
157;131;29062021165041
158;131;29062021165041
159;130;29062021165041
160;130;29062021165041
161;129;29062021165041
162;131;29062021165041
163;131;29062021165041
164;128;29062021165041
165;130;29062021165041
166;128;29062021165041
167;128;29062021165041
168;129;29062021165041
169;127;29062021165041
170;129;29062021165041
171;128;29062021165041
172;127;29062021165041
173;127;29062021165041
174;126;29062021165041
175;125;29062021165041
176;127;29062021165041
177;124;29062021165041
178;127;29062021165041
179;126;29062021165041
180;124;29062021165041
181;126;29062021165041
182;125;29062021165041
183;124;29062021165041
184;125;29062021165041
185;123;29062021165041
186;125;29062021165041
187;125;29062021165041
188;122;29062021165041
189;124;29062021165041
190;123;29062021165041
191;124;29062021165041
192;127;29062021165041
193;123;29062021165041
194;124;29062021165041
195;124;29062021165041
196;123;29062021165041
197;124;29062021165041
198;123;29062021165041
199;122;29062021165041
200;0;29062021165041
0;0;29062021165041
1;144;29062021165041
2;136;29062021165041
3;134;29062021165041
4;136;29062021165041
5;136;29062021165041
6;135;29062021165041
7;136;29062021165041
8;139;29062021165041
9;138;29062021165041
10;143;29062021165041
11;143;29062021165041
12;143;29062021165041
13;150;29062021165041
14;152;29062021165041
15;162;29062021165041
16;173;29062021165041
17;193;29062021165041
18;242;29062021165041
19;341;29062021165041
20;559;29062021165041
21;1019;29062021165041
22;1023;29062021165041
23;1023;29062021165041
24;1023;29062021165041
25;1023;29062021165041
26;1023;29062021165041
27;1023;29062021165041
28;1023;29062021165041
29;1023;29062021165041
30;1023;29062021165041
31;1023;29062021165041
32;1023;29062021165041
33;1023;29062021165041
34;1023;29062021165041
35;1023;29062021165041
36;1023;29062021165041
37;1023;29062021165041
38;889;29062021165041
39;737;29062021165041
40;624;29062021165041
41;538;29062021165041
42;495;29062021165041
43;454;29062021165041
44;426;29062021165041
45;410;29062021165041
46;401;29062021165041
47;391;29062021165041
48;394;29062021165041
49;392;29062021165041
50;392;29062021165041
51;398;29062021165041
52;398;29062021165041
53;411;29062021165041
54;416;29062021165041
55;424;29062021165041
56;428;29062021165041
57;444;29062021165041
58;458;29062021165041
59;466;29062021165041
60;477;29062021165041
61;494;29062021165041
62;498;29062021165041
63;507;29062021165041
64;518;29062021165041
65;518;29062021165041
66;526;29062021165041
67;524;29062021165041
68;515;29062021165041
69;509;29062021165041
70;501;29062021165041
71;494;29062021165041
72;486;29062021165041
73;466;29062021165041
74;462;29062021165041
75;444;29062021165041
76;429;29062021165041
77;418;29062021165041
78;401;29062021165041
79;387;29062021165041
80;379;29062021165041
81;363;29062021165041
82;355;29062021165041
83;341;29062021165041
84;338;29062021165041
85;330;29062021165041
86;329;29062021165041
87;324;29062021165041
88;320;29062021165041
89;311;29062021165041
90;307;29062021165041
91;304;29062021165041
92;293;29062021165041
93;287;29062021165041
94;278;29062021165041
95;271;29062021165041
96;265;29062021165041
97;256;29062021165041
98;250;29062021165041
99;248;29062021165041
100;240;29062021165041
101;237;29062021165041
102;232;29062021165041
103;226;29062021165041
104;223;29062021165041
105;219;29062021165041
106;218;29062021165041
107;211;29062021165041
108;207;29062021165041
109;203;29062021165041
110;197;29062021165041
111;197;29062021165041
112;194;29062021165041
113;188;29062021165041
114;190;29062021165041
115;186;29062021165041
116;183;29062021165041
117;184;29062021165041
118;179;29062021165041
119;179;29062021165041
120;172;29062021165041
121;171;29062021165041
122;170;29062021165041
123;169;29062021165041
124;165;29062021165041
125;166;29062021165041
126;162;29062021165041
127;161;29062021165041
128;162;29062021165041
129;158;29062021165041
130;156;29062021165041
131;157;29062021165041
132;151;29062021165041
133;153;29062021165041
134;149;29062021165041
135;149;29062021165041
136;149;29062021165041
137;146;29062021165041
138;145;29062021165041
139;145;29062021165041
140;143;29062021165041
141;144;29062021165041
142;141;29062021165041
143;139;29062021165041
144;141;29062021165041
145;135;29062021165041
146;140;29062021165041
147;137;29062021165041
148;136;29062021165041
149;135;29062021165041
150;134;29062021165041
151;134;29062021165041
152;134;29062021165041
153;131;29062021165041
154;134;29062021165041
155;132;29062021165041
156;131;29062021165041
157;131;29062021165041
158;130;29062021165041
159;130;29062021165041
160;131;29062021165041
161;128;29062021165041
162;130;29062021165041
163;129;29062021165041
164;129;29062021165041
165;130;29062021165041
166;128;29062021165041
167;128;29062021165041
168;129;29062021165041
169;125;29062021165041
170;129;29062021165041
171;127;29062021165041
172;126;29062021165041
173;126;29062021165041
174;125;29062021165041
175;125;29062021165041
176;126;29062021165041
177;124;29062021165041
178;126;29062021165041
179;125;29062021165041
180;126;29062021165041
181;126;29062021165041
182;124;29062021165041
183;124;29062021165041
184;125;29062021165041
185;122;29062021165041
186;126;29062021165041
187;124;29062021165041
188;123;29062021165041
189;123;29062021165041
190;123;29062021165041
191;124;29062021165041
192;127;29062021165041
193;123;29062021165041
194;123;29062021165041
195;124;29062021165041
196;122;29062021165041
197;123;29062021165041
198;123;29062021165041
199;122;29062021165041
200;0;29062021165041
0;0;29062021165042
1;145;29062021165042
2;135;29062021165042
3;134;29062021165042
4;135;29062021165042
5;136;29062021165042
6;135;29062021165042
7;138;29062021165042
8;139;29062021165042
9;139;29062021165042
10;143;29062021165042
11;142;29062021165042
12;144;29062021165042
13;151;29062021165042
14;153;29062021165042
15;161;29062021165042
16;173;29062021165042
17;192;29062021165042
18;241;29062021165042
19;339;29062021165042
20;558;29062021165042
21;1018;29062021165042
22;1023;29062021165042
23;1023;29062021165042
24;1023;29062021165042
25;1023;29062021165042
26;1023;29062021165042
27;1023;29062021165042
28;1023;29062021165042
29;1023;29062021165042
30;1023;29062021165042
31;1023;29062021165042
32;1023;29062021165042
33;1023;29062021165042
34;1023;29062021165042
35;1023;29062021165042
36;1023;29062021165042
37;1023;29062021165042
38;890;29062021165042
39;734;29062021165042
40;619;29062021165042
41;533;29062021165042
42;488;29062021165042
43;449;29062021165042
44;425;29062021165042
45;406;29062021165042
46;399;29062021165042
47;394;29062021165042
48;391;29062021165042
49;389;29062021165042
50;393;29062021165042
51;398;29062021165042
52;398;29062021165042
53;411;29062021165042
54;416;29062021165042
55;420;29062021165042
56;433;29062021165042
57;441;29062021165042
58;458;29062021165042
59;465;29062021165042
60;479;29062021165042
61;490;29062021165042
62;497;29062021165042
63;511;29062021165042
64;515;29062021165042
65;514;29062021165042
66;522;29062021165042
67;523;29062021165042
68;515;29062021165042
69;512;29062021165042
70;501;29062021165042
71;494;29062021165042
72;483;29062021165042
73;465;29062021165042
74;457;29062021165042
75;438;29062021165042
76;428;29062021165042
77;415;29062021165042
78;399;29062021165042
79;386;29062021165042
80;372;29062021165042
81;360;29062021165042
82;353;29062021165042
83;341;29062021165042
84;334;29062021165042
85;330;29062021165042
86;321;29062021165042
87;322;29062021165042
88;319;29062021165042
89;309;29062021165042
90;308;29062021165042
91;299;29062021165042
92;291;29062021165042
93;285;29062021165042
94;280;29062021165042
95;269;29062021165042
96;265;29062021165042
97;258;29062021165042
98;250;29062021165042
99;246;29062021165042
100;241;29062021165042
101;236;29062021165042
102;233;29062021165042
103;226;29062021165042
104;222;29062021165042
105;218;29062021165042
106;214;29062021165042
107;210;29062021165042
108;206;29062021165042
109;203;29062021165042
110;199;29062021165042
111;196;29062021165042
112;195;29062021165042
113;187;29062021165042
114;187;29062021165042
115;185;29062021165042
116;184;29062021165042
117;184;29062021165042
118;179;29062021165042
119;177;29062021165042
120;174;29062021165042
121;171;29062021165042
122;170;29062021165042
123;169;29062021165042
124;166;29062021165042
125;166;29062021165042
126;162;29062021165042
127;161;29062021165042
128;162;29062021165042
129;156;29062021165042
130;156;29062021165042
131;155;29062021165042
132;152;29062021165042
133;154;29062021165042
134;150;29062021165042
135;147;29062021165042
136;149;29062021165042
137;145;29062021165042
138;146;29062021165042
139;143;29062021165042
140;140;29062021165042
141;144;29062021165042
142;140;29062021165042
143;139;29062021165042
144;140;29062021165042
145;136;29062021165042
146;139;29062021165042
147;137;29062021165042
148;136;29062021165042
149;135;29062021165042
150;134;29062021165042
151;134;29062021165042
152;135;29062021165042
153;132;29062021165042
154;133;29062021165042
155;132;29062021165042
156;131;29062021165042
157;130;29062021165042
158;130;29062021165042
159;129;29062021165042
160;131;29062021165042
161;129;29062021165042
162;131;29062021165042
163;129;29062021165042
164;128;29062021165042
165;130;29062021165042
166;129;29062021165042
167;129;29062021165042
168;130;29062021165042
169;126;29062021165042
170;128;29062021165042
171;127;29062021165042
172;126;29062021165042
173;128;29062021165042
174;126;29062021165042
175;124;29062021165042
176;126;29062021165042
177;125;29062021165042
178;127;29062021165042
179;126;29062021165042
180;125;29062021165042
181;127;29062021165042
182;125;29062021165042
183;123;29062021165042
184;125;29062021165042
185;123;29062021165042
186;125;29062021165042
187;124;29062021165042
188;123;29062021165042
189;125;29062021165042
190;124;29062021165042
191;124;29062021165042
192;126;29062021165042
193;124;29062021165042
194;123;29062021165042
195;123;29062021165042
196;123;29062021165042
197;124;29062021165042
198;123;29062021165042
199;122;29062021165042
200;0;29062021165042
0;0;29062021165043
1;144;29062021165043
2;136;29062021165043
3;134;29062021165043
4;135;29062021165043
5;136;29062021165043
6;134;29062021165043
7;137;29062021165043
8;138;29062021165043
9;136;29062021165043
10;142;29062021165043
11;143;29062021165043
12;145;29062021165043
13;150;29062021165043
14;153;29062021165043
15;161;29062021165043
16;173;29062021165043
17;195;29062021165043
18;241;29062021165043
19;342;29062021165043
20;559;29062021165043
21;1018;29062021165043
22;1023;29062021165043
23;1023;29062021165043
24;1023;29062021165043
25;1023;29062021165043
26;1023;29062021165043
27;1023;29062021165043
28;1023;29062021165043
29;1023;29062021165043
30;1023;29062021165043
31;1023;29062021165043
32;1023;29062021165043
33;1023;29062021165043
34;1023;29062021165043
35;1023;29062021165043
36;1023;29062021165043
37;1023;29062021165043
38;888;29062021165043
39;736;29062021165043
40;614;29062021165043
41;540;29062021165043
42;487;29062021165043
43;447;29062021165043
44;425;29062021165043
45;407;29062021165043
46;396;29062021165043
47;394;29062021165043
48;396;29062021165043
49;388;29062021165043
50;393;29062021165043
51;393;29062021165043
52;396;29062021165043
53;406;29062021165043
54;413;29062021165043
55;421;29062021165043
56;434;29062021165043
57;444;29062021165043
58;455;29062021165043
59;463;29062021165043
60;478;29062021165043
61;491;29062021165043
62;496;29062021165043
63;506;29062021165043
64;512;29062021165043
65;513;29062021165043
66;523;29062021165043
67;519;29062021165043
68;516;29062021165043
69;513;29062021165043
70;503;29062021165043
71;488;29062021165043
72;486;29062021165043
73;465;29062021165043
74;458;29062021165043
75;438;29062021165043
76;426;29062021165043
77;415;29062021165043
78;405;29062021165043
79;388;29062021165043
80;375;29062021165043
81;360;29062021165043
82;355;29062021165043
83;341;29062021165043
84;336;29062021165043
85;330;29062021165043
86;326;29062021165043
87;321;29062021165043
88;319;29062021165043
89;309;29062021165043
90;309;29062021165043
91;299;29062021165043
92;289;29062021165043
93;287;29062021165043
94;278;29062021165043
95;269;29062021165043
96;265;29062021165043
97;258;29062021165043
98;250;29062021165043
99;246;29062021165043
100;241;29062021165043
101;237;29062021165043
102;230;29062021165043
103;227;29062021165043
104;223;29062021165043
105;216;29062021165043
106;218;29062021165043
107;212;29062021165043
108;208;29062021165043
109;205;29062021165043
110;199;29062021165043
111;197;29062021165043
112;196;29062021165043
113;187;29062021165043
114;188;29062021165043
115;186;29062021165043
116;183;29062021165043
117;184;29062021165043
118;181;29062021165043
119;177;29062021165043
120;173;29062021165043
121;171;29062021165043
122;173;29062021165043
123;169;29062021165043
124;167;29062021165043
125;167;29062021165043
126;162;29062021165043
127;162;29062021165043
128;162;29062021165043
129;158;29062021165043
130;156;29062021165043
131;156;29062021165043
132;152;29062021165043
133;156;29062021165043
134;149;29062021165043
135;149;29062021165043
136;149;29062021165043
137;146;29062021165043
138;146;29062021165043
139;143;29062021165043
140;143;29062021165043
141;143;29062021165043
142;141;29062021165043
143;140;29062021165043
144;139;29062021165043
145;137;29062021165043
146;138;29062021165043
147;138;29062021165043
148;135;29062021165043
149;136;29062021165043
150;134;29062021165043
151;135;29062021165043
152;133;29062021165043
153;133;29062021165043
154;134;29062021165043
155;133;29062021165043
156;130;29062021165043
157;131;29062021165043
158;130;29062021165043
159;130;29062021165043
160;131;29062021165043
161;130;29062021165043
162;131;29062021165043
163;130;29062021165043
164;128;29062021165043
165;130;29062021165043
166;129;29062021165043
167;128;29062021165043
168;128;29062021165043
169;126;29062021165043
170;128;29062021165043
171;126;29062021165043
172;127;29062021165043
173;127;29062021165043
174;126;29062021165043
175;125;29062021165043
176;127;29062021165043
177;125;29062021165043
178;127;29062021165043
179;125;29062021165043
180;125;29062021165043
181;126;29062021165043
182;125;29062021165043
183;124;29062021165043
184;125;29062021165043
185;123;29062021165043
186;127;29062021165043
187;124;29062021165043
188;123;29062021165043
189;125;29062021165043
190;123;29062021165043
191;124;29062021165043
192;127;29062021165043
193;124;29062021165043
194;124;29062021165043
195;124;29062021165043
196;123;29062021165043
197;125;29062021165043
198;124;29062021165043
199;123;29062021165043
200;0;29062021165043
