ind;val;datetime
0;0;29062021162648
1;140;29062021162648
2;119;29062021162648
3;118;29062021162648
4;117;29062021162648
5;119;29062021162648
6;117;29062021162648
7;119;29062021162648
8;120;29062021162648
9;118;29062021162648
10;121;29062021162648
11;118;29062021162648
12;118;29062021162648
13;121;29062021162648
14;121;29062021162648
15;123;29062021162648
16;125;29062021162648
17;125;29062021162648
18;134;29062021162648
19;146;29062021162648
20;177;29062021162648
21;249;29062021162648
22;443;29062021162648
23;868;29062021162648
24;1019;29062021162648
25;1017;29062021162648
26;1022;29062021162648
27;1023;29062021162648
28;1020;29062021162648
29;1023;29062021162648
30;1021;29062021162648
31;818;29062021162648
32;570;29062021162648
33;425;29062021162648
34;332;29062021162648
35;269;29062021162648
36;223;29062021162648
37;194;29062021162648
38;174;29062021162648
39;162;29062021162648
40;155;29062021162648
41;147;29062021162648
42;148;29062021162648
43;144;29062021162648
44;144;29062021162648
45;143;29062021162648
46;141;29062021162648
47;142;29062021162648
48;143;29062021162648
49;141;29062021162648
50;143;29062021162648
51;141;29062021162648
52;138;29062021162648
53;142;29062021162648
54;141;29062021162648
55;141;29062021162648
56;143;29062021162648
57;142;29062021162648
58;145;29062021162648
59;145;29062021162648
60;145;29062021162648
61;147;29062021162648
62;147;29062021162648
63;148;29062021162648
64;149;29062021162648
65;146;29062021162648
66;148;29062021162648
67;147;29062021162648
68;146;29062021162648
69;148;29062021162648
70;143;29062021162648
71;142;29062021162648
72;144;29062021162648
73;139;29062021162648
74;143;29062021162648
75;138;29062021162648
76;138;29062021162648
77;139;29062021162648
78;135;29062021162648
79;136;29062021162648
80;136;29062021162648
81;133;29062021162648
82;134;29062021162648
83;131;29062021162648
84;131;29062021162648
85;132;29062021162648
86;130;29062021162648
87;130;29062021162648
88;131;29062021162648
89;128;29062021162648
90;131;29062021162648
91;130;29062021162648
92;127;29062021162648
93;128;29062021162648
94;127;29062021162648
95;126;29062021162648
96;128;29062021162648
97;126;29062021162648
98;127;29062021162648
99;125;29062021162648
100;124;29062021162648
101;125;29062021162648
102;124;29062021162648
103;123;29062021162648
104;124;29062021162648
105;121;29062021162648
106;125;29062021162648
107;122;29062021162648
108;121;29062021162648
109;123;29062021162648
110;120;29062021162648
111;121;29062021162648
112;122;29062021162648
113;119;29062021162648
114;121;29062021162648
115;122;29062021162648
116;120;29062021162648
117;121;29062021162648
118;120;29062021162648
119;120;29062021162648
120;119;29062021162648
121;119;29062021162648
122;120;29062021162648
123;120;29062021162648
124;119;29062021162648
125;120;29062021162648
126;119;29062021162648
127;119;29062021162648
128;121;29062021162648
129;118;29062021162648
130;119;29062021162648
131;120;29062021162648
132;117;29062021162648
133;122;29062021162648
134;117;29062021162648
135;119;29062021162648
136;120;29062021162648
137;117;29062021162648
138;119;29062021162648
139;119;29062021162648
140;117;29062021162648
141;120;29062021162648
142;117;29062021162648
143;117;29062021162648
144;120;29062021162648
145;117;29062021162648
146;120;29062021162648
147;118;29062021162648
148;117;29062021162648
149;117;29062021162648
150;117;29062021162648
151;118;29062021162648
152;118;29062021162648
153;116;29062021162648
154;118;29062021162648
155;116;29062021162648
156;116;29062021162648
157;117;29062021162648
158;117;29062021162648
159;118;29062021162648
160;118;29062021162648
161;117;29062021162648
162;119;29062021162648
163;118;29062021162648
164;117;29062021162648
165;119;29062021162648
166;117;29062021162648
167;117;29062021162648
168;118;29062021162648
169;116;29062021162648
170;118;29062021162648
171;118;29062021162648
172;117;29062021162648
173;118;29062021162648
174;117;29062021162648
175;116;29062021162648
176;118;29062021162648
177;116;29062021162648
178;118;29062021162648
179;116;29062021162648
180;116;29062021162648
181;118;29062021162648
182;118;29062021162648
183;117;29062021162648
184;118;29062021162648
185;116;29062021162648
186;118;29062021162648
187;118;29062021162648
188;115;29062021162648
189;118;29062021162648
190;117;29062021162648
191;116;29062021162648
192;119;29062021162648
193;116;29062021162648
194;117;29062021162648
195;118;29062021162648
196;116;29062021162648
197;118;29062021162648
198;117;29062021162648
199;116;29062021162648
200;0;29062021162648
0;0;29062021162649
1;140;29062021162649
2;119;29062021162649
3;118;29062021162649
4;118;29062021162649
5;120;29062021162649
6;117;29062021162649
7;119;29062021162649
8;121;29062021162649
9;118;29062021162649
10;121;29062021162649
11;118;29062021162649
12;118;29062021162649
13;121;29062021162649
14;120;29062021162649
15;123;29062021162649
16;125;29062021162649
17;124;29062021162649
18;135;29062021162649
19;146;29062021162649
20;174;29062021162649
21;248;29062021162649
22;443;29062021162649
23;868;29062021162649
24;1020;29062021162649
25;1019;29062021162649
26;1023;29062021162649
27;1023;29062021162649
28;1022;29062021162649
29;1023;29062021162649
30;1023;29062021162649
31;811;29062021162649
32;575;29062021162649
33;428;29062021162649
34;331;29062021162649
35;269;29062021162649
36;222;29062021162649
37;198;29062021162649
38;175;29062021162649
39;163;29062021162649
40;152;29062021162649
41;147;29062021162649
42;149;29062021162649
43;143;29062021162649
44;141;29062021162649
45;143;29062021162649
46;141;29062021162649
47;142;29062021162649
48;142;29062021162649
49;141;29062021162649
50;143;29062021162649
51;140;29062021162649
52;141;29062021162649
53;143;29062021162649
54;140;29062021162649
55;140;29062021162649
56;142;29062021162649
57;142;29062021162649
58;146;29062021162649
59;144;29062021162649
60;146;29062021162649
61;147;29062021162649
62;147;29062021162649
63;148;29062021162649
64;149;29062021162649
65;144;29062021162649
66;149;29062021162649
67;146;29062021162649
68;145;29062021162649
69;146;29062021162649
70;144;29062021162649
71;144;29062021162649
72;145;29062021162649
73;141;29062021162649
74;142;29062021162649
75;139;29062021162649
76;138;29062021162649
77;139;29062021162649
78;136;29062021162649
79;136;29062021162649
80;136;29062021162649
81;132;29062021162649
82;136;29062021162649
83;132;29062021162649
84;132;29062021162649
85;132;29062021162649
86;130;29062021162649
87;131;29062021162649
88;132;29062021162649
89;128;29062021162649
90;131;29062021162649
91;129;29062021162649
92;127;29062021162649
93;129;29062021162649
94;128;29062021162649
95;126;29062021162649
96;128;29062021162649
97;127;29062021162649
98;126;29062021162649
99;125;29062021162649
100;124;29062021162649
101;126;29062021162649
102;123;29062021162649
103;125;29062021162649
104;124;29062021162649
105;122;29062021162649
106;125;29062021162649
107;121;29062021162649
108;120;29062021162649
109;123;29062021162649
110;121;29062021162649
111;122;29062021162649
112;123;29062021162649
113;120;29062021162649
114;121;29062021162649
115;122;29062021162649
116;120;29062021162649
117;124;29062021162649
118;121;29062021162649
119;121;29062021162649
120;121;29062021162649
121;119;29062021162649
122;120;29062021162649
123;120;29062021162649
124;118;29062021162649
125;121;29062021162649
126;118;29062021162649
127;119;29062021162649
128;121;29062021162649
129;119;29062021162649
130;120;29062021162649
131;120;29062021162649
132;118;29062021162649
133;122;29062021162649
134;118;29062021162649
135;118;29062021162649
136;120;29062021162649
137;116;29062021162649
138;119;29062021162649
139;120;29062021162649
140;117;29062021162649
141;120;29062021162649
142;118;29062021162649
143;118;29062021162649
144;118;29062021162649
145;116;29062021162649
146;119;29062021162649
147;119;29062021162649
148;117;29062021162649
149;118;29062021162649
150;117;29062021162649
151;119;29062021162649
152;118;29062021162649
153;116;29062021162649
154;118;29062021162649
155;118;29062021162649
156;117;29062021162649
157;118;29062021162649
158;116;29062021162649
159;118;29062021162649
160;118;29062021162649
161;117;29062021162649
162;118;29062021162649
163;117;29062021162649
164;116;29062021162649
165;119;29062021162649
166;118;29062021162649
167;119;29062021162649
168;119;29062021162649
169;116;29062021162649
170;118;29062021162649
171;118;29062021162649
172;117;29062021162649
173;118;29062021162649
174;117;29062021162649
175;117;29062021162649
176;118;29062021162649
177;115;29062021162649
178;118;29062021162649
179;118;29062021162649
180;117;29062021162649
181;119;29062021162649
182;118;29062021162649
183;116;29062021162649
184;118;29062021162649
185;116;29062021162649
186;119;29062021162649
187;118;29062021162649
188;116;29062021162649
189;117;29062021162649
190;117;29062021162649
191;116;29062021162649
192;120;29062021162649
193;117;29062021162649
194;116;29062021162649
195;117;29062021162649
196;116;29062021162649
197;118;29062021162649
198;118;29062021162649
199;117;29062021162649
200;0;29062021162649
0;0;29062021162649
1;139;29062021162649
2;119;29062021162649
3;118;29062021162649
4;118;29062021162649
5;119;29062021162649
6;116;29062021162649
7;118;29062021162649
8;119;29062021162649
9;117;29062021162649
10;121;29062021162649
11;119;29062021162649
12;117;29062021162649
13;121;29062021162649
14;120;29062021162649
15;123;29062021162649
16;124;29062021162649
17;125;29062021162649
18;135;29062021162649
19;145;29062021162649
20;175;29062021162649
21;245;29062021162649
22;439;29062021162649
23;849;29062021162649
24;1018;29062021162649
25;1017;29062021162649
26;1022;29062021162649
27;1023;29062021162649
28;1020;29062021162649
29;1022;29062021162649
30;1021;29062021162649
31;823;29062021162649
32;589;29062021162649
33;433;29062021162649
34;338;29062021162649
35;272;29062021162649
36;225;29062021162649
37;197;29062021162649
38;176;29062021162649
39;164;29062021162649
40;155;29062021162649
41;148;29062021162649
42;147;29062021162649
43;143;29062021162649
44;143;29062021162649
45;143;29062021162649
46;140;29062021162649
47;140;29062021162649
48;143;29062021162649
49;140;29062021162649
50;142;29062021162649
51;139;29062021162649
52;139;29062021162649
53;142;29062021162649
54;141;29062021162649
55;140;29062021162649
56;142;29062021162649
57;142;29062021162649
58;145;29062021162649
59;145;29062021162649
60;146;29062021162649
61;147;29062021162649
62;144;29062021162649
63;147;29062021162649
64;149;29062021162649
65;145;29062021162649
66;149;29062021162649
67;146;29062021162649
68;145;29062021162649
69;145;29062021162649
70;144;29062021162649
71;142;29062021162649
72;144;29062021162649
73;140;29062021162649
74;141;29062021162649
75;138;29062021162649
76;137;29062021162649
77;138;29062021162649
78;135;29062021162649
79;136;29062021162649
80;135;29062021162649
81;132;29062021162649
82;135;29062021162649
83;131;29062021162649
84;131;29062021162649
85;133;29062021162649
86;129;29062021162649
87;131;29062021162649
88;131;29062021162649
89;127;29062021162649
90;130;29062021162649
91;129;29062021162649
92;126;29062021162649
93;129;29062021162649
94;128;29062021162649
95;126;29062021162649
96;127;29062021162649
97;125;29062021162649
98;125;29062021162649
99;126;29062021162649
100;122;29062021162649
101;125;29062021162649
102;123;29062021162649
103;123;29062021162649
104;124;29062021162649
105;121;29062021162649
106;124;29062021162649
107;122;29062021162649
108;121;29062021162649
109;123;29062021162649
110;120;29062021162649
111;121;29062021162649
112;123;29062021162649
113;119;29062021162649
114;121;29062021162649
115;122;29062021162649
116;121;29062021162649
117;123;29062021162649
118;119;29062021162649
119;120;29062021162649
120;119;29062021162649
121;118;29062021162649
122;119;29062021162649
123;120;29062021162649
124;118;29062021162649
125;120;29062021162649
126;120;29062021162649
127;118;29062021162649
128;121;29062021162649
129;118;29062021162649
130;119;29062021162649
131;119;29062021162649
132;118;29062021162649
133;121;29062021162649
134;118;29062021162649
135;117;29062021162649
136;120;29062021162649
137;117;29062021162649
138;119;29062021162649
139;118;29062021162649
140;116;29062021162649
141;119;29062021162649
142;117;29062021162649
143;117;29062021162649
144;118;29062021162649
145;116;29062021162649
146;119;29062021162649
147;117;29062021162649
148;117;29062021162649
149;117;29062021162649
150;117;29062021162649
151;118;29062021162649
152;117;29062021162649
153;116;29062021162649
154;119;29062021162649
155;116;29062021162649
156;116;29062021162649
157;117;29062021162649
158;117;29062021162649
159;117;29062021162649
160;118;29062021162649
161;116;29062021162649
162;119;29062021162649
163;117;29062021162649
164;117;29062021162649
165;119;29062021162649
166;116;29062021162649
167;117;29062021162649
168;118;29062021162649
169;114;29062021162649
170;118;29062021162649
171;117;29062021162649
172;116;29062021162649
173;117;29062021162649
174;117;29062021162649
175;116;29062021162649
176;118;29062021162649
177;115;29062021162649
178;118;29062021162649
179;116;29062021162649
180;117;29062021162649
181;118;29062021162649
182;118;29062021162649
183;117;29062021162649
184;117;29062021162649
185;115;29062021162649
186;118;29062021162649
187;118;29062021162649
188;116;29062021162649
189;118;29062021162649
190;117;29062021162649
191;117;29062021162649
192;119;29062021162649
193;115;29062021162649
194;116;29062021162649
195;117;29062021162649
196;117;29062021162649
197;118;29062021162649
198;116;29062021162649
199;116;29062021162649
200;0;29062021162649
0;0;29062021162651
1;139;29062021162651
2;118;29062021162651
3;119;29062021162651
4;118;29062021162651
5;118;29062021162651
6;116;29062021162651
7;119;29062021162651
8;119;29062021162651
9;116;29062021162651
10;120;29062021162651
11;118;29062021162651
12;118;29062021162651
13;120;29062021162651
14;119;29062021162651
15;123;29062021162651
16;124;29062021162651
17;125;29062021162651
18;134;29062021162651
19;146;29062021162651
20;174;29062021162651
21;247;29062021162651
22;440;29062021162651
23;866;29062021162651
24;1018;29062021162651
25;1017;29062021162651
26;1022;29062021162651
27;1023;29062021162651
28;1020;29062021162651
29;1022;29062021162651
30;1021;29062021162651
31;819;29062021162651
32;582;29062021162651
33;428;29062021162651
34;335;29062021162651
35;270;29062021162651
36;223;29062021162651
37;194;29062021162651
38;175;29062021162651
39;163;29062021162651
40;155;29062021162651
41;147;29062021162651
42;146;29062021162651
43;143;29062021162651
44;142;29062021162651
45;143;29062021162651
46;140;29062021162651
47;140;29062021162651
48;142;29062021162651
49;139;29062021162651
50;143;29062021162651
51;140;29062021162651
52;141;29062021162651
53;142;29062021162651
54;141;29062021162651
55;140;29062021162651
56;141;29062021162651
57;141;29062021162651
58;144;29062021162651
59;144;29062021162651
60;145;29062021162651
61;147;29062021162651
62;145;29062021162651
63;147;29062021162651
64;147;29062021162651
65;145;29062021162651
66;148;29062021162651
67;146;29062021162651
68;146;29062021162651
69;147;29062021162651
70;143;29062021162651
71;144;29062021162651
72;145;29062021162651
73;140;29062021162651
74;142;29062021162651
75;139;29062021162651
76;137;29062021162651
77;139;29062021162651
78;135;29062021162651
79;136;29062021162651
80;136;29062021162651
81;132;29062021162651
82;134;29062021162651
83;132;29062021162651
84;131;29062021162651
85;132;29062021162651
86;129;29062021162651
87;131;29062021162651
88;131;29062021162651
89;128;29062021162651
90;131;29062021162651
91;129;29062021162651
92;127;29062021162651
93;128;29062021162651
94;127;29062021162651
95;127;29062021162651
96;127;29062021162651
97;125;29062021162651
98;126;29062021162651
99;125;29062021162651
100;124;29062021162651
101;125;29062021162651
102;122;29062021162651
103;123;29062021162651
104;124;29062021162651
105;121;29062021162651
106;124;29062021162651
107;121;29062021162651
108;122;29062021162651
109;123;29062021162651
110;121;29062021162651
111;121;29062021162651
112;122;29062021162651
113;119;29062021162651
114;121;29062021162651
115;121;29062021162651
116;119;29062021162651
117;123;29062021162651
118;120;29062021162651
119;120;29062021162651
120;119;29062021162651
121;117;29062021162651
122;119;29062021162651
123;120;29062021162651
124;118;29062021162651
125;121;29062021162651
126;118;29062021162651
127;119;29062021162651
128;120;29062021162651
129;117;29062021162651
130;119;29062021162651
131;120;29062021162651
132;117;29062021162651
133;121;29062021162651
134;118;29062021162651
135;119;29062021162651
136;120;29062021162651
137;117;29062021162651
138;119;29062021162651
139;119;29062021162651
140;116;29062021162651
141;118;29062021162651
142;117;29062021162651
143;116;29062021162651
144;118;29062021162651
145;115;29062021162651
146;119;29062021162651
147;119;29062021162651
148;116;29062021162651
149;117;29062021162651
150;116;29062021162651
151;117;29062021162651
152;118;29062021162651
153;116;29062021162651
154;119;29062021162651
155;116;29062021162651
156;116;29062021162651
157;116;29062021162651
158;117;29062021162651
159;116;29062021162651
160;118;29062021162651
161;116;29062021162651
162;118;29062021162651
163;117;29062021162651
164;117;29062021162651
165;118;29062021162651
166;117;29062021162651
167;117;29062021162651
168;118;29062021162651
169;114;29062021162651
170;118;29062021162651
171;117;29062021162651
172;116;29062021162651
173;119;29062021162651
174;117;29062021162651
175;116;29062021162651
176;118;29062021162651
177;115;29062021162651
178;118;29062021162651
179;117;29062021162651
180;116;29062021162651
181;118;29062021162651
182;117;29062021162651
183;117;29062021162651
184;117;29062021162651
185;115;29062021162651
186;118;29062021162651
187;116;29062021162651
188;115;29062021162651
189;118;29062021162651
190;116;29062021162651
191;117;29062021162651
192;120;29062021162651
193;116;29062021162651
194;117;29062021162651
195;116;29062021162651
196;115;29062021162651
197;116;29062021162651
198;117;29062021162651
199;115;29062021162651
200;0;29062021162651
0;0;29062021162651
1;140;29062021162651
2;119;29062021162651
3;117;29062021162651
4;118;29062021162651
5;119;29062021162651
6;117;29062021162651
7;119;29062021162651
8;119;29062021162651
9;118;29062021162651
10;121;29062021162651
11;119;29062021162651
12;119;29062021162651
13;122;29062021162651
14;121;29062021162651
15;124;29062021162651
16;124;29062021162651
17;126;29062021162651
18;134;29062021162651
19;145;29062021162651
20;175;29062021162651
21;248;29062021162651
22;440;29062021162651
23;857;29062021162651
24;1019;29062021162651
25;1019;29062021162651
26;1023;29062021162651
27;1023;29062021162651
28;1022;29062021162651
29;1023;29062021162651
30;1022;29062021162651
31;818;29062021162651
32;581;29062021162651
33;432;29062021162651
34;335;29062021162651
35;270;29062021162651
36;224;29062021162651
37;196;29062021162651
38;176;29062021162651
39;165;29062021162651
40;155;29062021162651
41;148;29062021162651
42;146;29062021162651
43;144;29062021162651
44;143;29062021162651
45;143;29062021162651
46;141;29062021162651
47;140;29062021162651
48;143;29062021162651
49;141;29062021162651
50;142;29062021162651
51;141;29062021162651
52;140;29062021162651
53;143;29062021162651
54;141;29062021162651
55;141;29062021162651
56;142;29062021162651
57;142;29062021162651
58;144;29062021162651
59;144;29062021162651
60;145;29062021162651
61;147;29062021162651
62;146;29062021162651
63;147;29062021162651
64;148;29062021162651
65;145;29062021162651
66;149;29062021162651
67;147;29062021162651
68;145;29062021162651
69;148;29062021162651
70;143;29062021162651
71;142;29062021162651
72;145;29062021162651
73;141;29062021162651
74;143;29062021162651
75;139;29062021162651
76;138;29062021162651
77;139;29062021162651
78;136;29062021162651
79;136;29062021162651
80;137;29062021162651
81;132;29062021162651
82;135;29062021162651
83;132;29062021162651
84;132;29062021162651
85;132;29062021162651
86;130;29062021162651
87;130;29062021162651
88;132;29062021162651
89;127;29062021162651
90;131;29062021162651
91;130;29062021162651
92;127;29062021162651
93;129;29062021162651
94;128;29062021162651
95;125;29062021162651
96;127;29062021162651
97;127;29062021162651
98;125;29062021162651
99;125;29062021162651
100;123;29062021162651
101;126;29062021162651
102;123;29062021162651
103;124;29062021162651
104;125;29062021162651
105;121;29062021162651
106;125;29062021162651
107;123;29062021162651
108;121;29062021162651
109;123;29062021162651
110;121;29062021162651
111;121;29062021162651
112;124;29062021162651
113;121;29062021162651
114;121;29062021162651
115;122;29062021162651
116;121;29062021162651
117;123;29062021162651
118;120;29062021162651
119;121;29062021162651
120;119;29062021162651
121;119;29062021162651
122;120;29062021162651
123;120;29062021162651
124;119;29062021162651
125;122;29062021162651
126;118;29062021162651
127;119;29062021162651
128;121;29062021162651
129;118;29062021162651
130;118;29062021162651
131;120;29062021162651
132;118;29062021162651
133;121;29062021162651
134;118;29062021162651
135;118;29062021162651
136;120;29062021162651
137;117;29062021162651
138;119;29062021162651
139;118;29062021162651
140;117;29062021162651
141;120;29062021162651
142;117;29062021162651
143;118;29062021162651
144;119;29062021162651
145;116;29062021162651
146;120;29062021162651
147;119;29062021162651
148;118;29062021162651
149;118;29062021162651
150;116;29062021162651
151;118;29062021162651
152;119;29062021162651
153;117;29062021162651
154;120;29062021162651
155;116;29062021162651
156;117;29062021162651
157;118;29062021162651
158;117;29062021162651
159;117;29062021162651
160;118;29062021162651
161;117;29062021162651
162;119;29062021162651
163;118;29062021162651
164;117;29062021162651
165;119;29062021162651
166;118;29062021162651
167;117;29062021162651
168;118;29062021162651
169;116;29062021162651
170;119;29062021162651
171;118;29062021162651
172;117;29062021162651
173;118;29062021162651
174;117;29062021162651
175;116;29062021162651
176;118;29062021162651
177;116;29062021162651
178;119;29062021162651
179;117;29062021162651
180;117;29062021162651
181;118;29062021162651
182;118;29062021162651
183;117;29062021162651
184;118;29062021162651
185;116;29062021162651
186;118;29062021162651
187;118;29062021162651
188;115;29062021162651
189;119;29062021162651
190;116;29062021162651
191;116;29062021162651
192;120;29062021162651
193;117;29062021162651
194;117;29062021162651
195;118;29062021162651
196;116;29062021162651
197;118;29062021162651
198;118;29062021162651
199;116;29062021162651
200;0;29062021162651
0;0;29062021162652
1;139;29062021162652
2;119;29062021162652
3;117;29062021162652
4;118;29062021162652
5;119;29062021162652
6;117;29062021162652
7;119;29062021162652
8;119;29062021162652
9;117;29062021162652
10;120;29062021162652
11;118;29062021162652
12;118;29062021162652
13;121;29062021162652
14;121;29062021162652
15;123;29062021162652
16;123;29062021162652
17;125;29062021162652
18;135;29062021162652
19;146;29062021162652
20;175;29062021162652
21;245;29062021162652
22;429;29062021162652
23;843;29062021162652
24;1017;29062021162652
25;1016;29062021162652
26;1022;29062021162652
27;1023;29062021162652
28;1020;29062021162652
29;1022;29062021162652
30;1021;29062021162652
31;823;29062021162652
32;587;29062021162652
33;434;29062021162652
34;334;29062021162652
35;271;29062021162652
36;224;29062021162652
37;197;29062021162652
38;177;29062021162652
39;163;29062021162652
40;155;29062021162652
41;146;29062021162652
42;147;29062021162652
43;144;29062021162652
44;142;29062021162652
45;143;29062021162652
46;141;29062021162652
47;141;29062021162652
48;142;29062021162652
49;139;29062021162652
50;141;29062021162652
51;140;29062021162652
52;138;29062021162652
53;142;29062021162652
54;140;29062021162652
55;141;29062021162652
56;143;29062021162652
57;142;29062021162652
58;146;29062021162652
59;143;29062021162652
60;144;29062021162652
61;146;29062021162652
62;145;29062021162652
63;147;29062021162652
64;148;29062021162652
65;145;29062021162652
66;147;29062021162652
67;146;29062021162652
68;146;29062021162652
69;146;29062021162652
70;143;29062021162652
71;144;29062021162652
72;144;29062021162652
73;139;29062021162652
74;142;29062021162652
75;138;29062021162652
76;139;29062021162652
77;139;29062021162652
78;136;29062021162652
79;135;29062021162652
80;136;29062021162652
81;133;29062021162652
82;135;29062021162652
83;132;29062021162652
84;131;29062021162652
85;133;29062021162652
86;129;29062021162652
87;131;29062021162652
88;131;29062021162652
89;128;29062021162652
90;131;29062021162652
91;129;29062021162652
92;126;29062021162652
93;128;29062021162652
94;127;29062021162652
95;126;29062021162652
96;128;29062021162652
97;126;29062021162652
98;125;29062021162652
99;125;29062021162652
100;123;29062021162652
101;126;29062021162652
102;123;29062021162652
103;123;29062021162652
104;123;29062021162652
105;121;29062021162652
106;125;29062021162652
107;122;29062021162652
108;121;29062021162652
109;123;29062021162652
110;120;29062021162652
111;120;29062021162652
112;124;29062021162652
113;120;29062021162652
114;121;29062021162652
115;121;29062021162652
116;120;29062021162652
117;123;29062021162652
118;120;29062021162652
119;121;29062021162652
120;120;29062021162652
121;119;29062021162652
122;120;29062021162652
123;119;29062021162652
124;118;29062021162652
125;121;29062021162652
126;119;29062021162652
127;119;29062021162652
128;120;29062021162652
129;118;29062021162652
130;120;29062021162652
131;121;29062021162652
132;118;29062021162652
133;122;29062021162652
134;118;29062021162652
135;118;29062021162652
136;119;29062021162652
137;117;29062021162652
138;119;29062021162652
139;118;29062021162652
140;117;29062021162652
141;119;29062021162652
142;118;29062021162652
143;117;29062021162652
144;119;29062021162652
145;115;29062021162652
146;119;29062021162652
147;118;29062021162652
148;116;29062021162652
149;117;29062021162652
150;117;29062021162652
151;117;29062021162652
152;118;29062021162652
153;115;29062021162652
154;118;29062021162652
155;117;29062021162652
156;116;29062021162652
157;117;29062021162652
158;117;29062021162652
159;116;29062021162652
160;118;29062021162652
161;117;29062021162652
162;118;29062021162652
163;117;29062021162652
164;117;29062021162652
165;118;29062021162652
166;117;29062021162652
167;117;29062021162652
168;119;29062021162652
169;115;29062021162652
170;119;29062021162652
171;117;29062021162652
172;116;29062021162652
173;118;29062021162652
174;116;29062021162652
175;116;29062021162652
176;118;29062021162652
177;116;29062021162652
178;118;29062021162652
179;117;29062021162652
180;117;29062021162652
181;119;29062021162652
182;118;29062021162652
183;117;29062021162652
184;117;29062021162652
185;115;29062021162652
186;118;29062021162652
187;118;29062021162652
188;116;29062021162652
189;117;29062021162652
190;116;29062021162652
191;117;29062021162652
192;120;29062021162652
193;117;29062021162652
194;116;29062021162652
195;117;29062021162652
196;115;29062021162652
197;117;29062021162652
198;117;29062021162652
199;116;29062021162652
200;0;29062021162652
0;0;29062021162652
1;140;29062021162652
2;119;29062021162652
3;117;29062021162652
4;117;29062021162652
5;119;29062021162652
6;117;29062021162652
7;119;29062021162652
8;120;29062021162652
9;117;29062021162652
10;120;29062021162652
11;118;29062021162652
12;119;29062021162652
13;122;29062021162652
14;120;29062021162652
15;122;29062021162652
16;124;29062021162652
17;124;29062021162652
18;135;29062021162652
19;145;29062021162652
20;174;29062021162652
21;245;29062021162652
22;430;29062021162652
23;843;29062021162652
24;1020;29062021162652
25;1018;29062021162652
26;1023;29062021162652
27;1023;29062021162652
28;1022;29062021162652
29;1023;29062021162652
30;1023;29062021162652
31;824;29062021162652
32;589;29062021162652
33;432;29062021162652
34;337;29062021162652
35;269;29062021162652
36;224;29062021162652
37;196;29062021162652
38;175;29062021162652
39;163;29062021162652
40;157;29062021162652
41;146;29062021162652
42;147;29062021162652
43;144;29062021162652
44;141;29062021162652
45;142;29062021162652
46;140;29062021162652
47;141;29062021162652
48;143;29062021162652
49;139;29062021162652
50;143;29062021162652
51;139;29062021162652
52;138;29062021162652
53;141;29062021162652
54;140;29062021162652
55;141;29062021162652
56;142;29062021162652
57;141;29062021162652
58;145;29062021162652
59;143;29062021162652
60;146;29062021162652
61;146;29062021162652
62;146;29062021162652
63;146;29062021162652
64;150;29062021162652
65;145;29062021162652
66;149;29062021162652
67;147;29062021162652
68;146;29062021162652
69;147;29062021162652
70;142;29062021162652
71;143;29062021162652
72;144;29062021162652
73;140;29062021162652
74;142;29062021162652
75;138;29062021162652
76;137;29062021162652
77;139;29062021162652
78;135;29062021162652
79;135;29062021162652
80;135;29062021162652
81;132;29062021162652
82;135;29062021162652
83;132;29062021162652
84;133;29062021162652
85;133;29062021162652
86;129;29062021162652
87;130;29062021162652
88;131;29062021162652
89;128;29062021162652
90;130;29062021162652
91;129;29062021162652
92;126;29062021162652
93;128;29062021162652
94;127;29062021162652
95;126;29062021162652
96;128;29062021162652
97;126;29062021162652
98;125;29062021162652
99;124;29062021162652
100;123;29062021162652
101;126;29062021162652
102;123;29062021162652
103;124;29062021162652
104;124;29062021162652
105;121;29062021162652
106;125;29062021162652
107;122;29062021162652
108;121;29062021162652
109;123;29062021162652
110;120;29062021162652
111;121;29062021162652
112;123;29062021162652
113;120;29062021162652
114;121;29062021162652
115;122;29062021162652
116;120;29062021162652
117;123;29062021162652
118;121;29062021162652
119;120;29062021162652
120;120;29062021162652
121;118;29062021162652
122;120;29062021162652
123;120;29062021162652
124;118;29062021162652
125;121;29062021162652
126;118;29062021162652
127;118;29062021162652
128;121;29062021162652
129;118;29062021162652
130;119;29062021162652
131;120;29062021162652
132;118;29062021162652
133;121;29062021162652
134;117;29062021162652
135;119;29062021162652
136;120;29062021162652
137;117;29062021162652
138;119;29062021162652
139;118;29062021162652
140;117;29062021162652
141;119;29062021162652
142;117;29062021162652
143;117;29062021162652
144;119;29062021162652
145;116;29062021162652
146;120;29062021162652
147;119;29062021162652
148;117;29062021162652
149;117;29062021162652
150;117;29062021162652
151;118;29062021162652
152;119;29062021162652
153;117;29062021162652
154;118;29062021162652
155;116;29062021162652
156;115;29062021162652
157;117;29062021162652
158;117;29062021162652
159;117;29062021162652
160;118;29062021162652
161;117;29062021162652
162;118;29062021162652
163;119;29062021162652
164;117;29062021162652
165;118;29062021162652
166;117;29062021162652
167;116;29062021162652
168;118;29062021162652
169;115;29062021162652
170;119;29062021162652
171;117;29062021162652
172;117;29062021162652
173;118;29062021162652
174;116;29062021162652
175;116;29062021162652
176;118;29062021162652
177;117;29062021162652
178;118;29062021162652
179;117;29062021162652
180;116;29062021162652
181;119;29062021162652
182;118;29062021162652
183;116;29062021162652
184;118;29062021162652
185;115;29062021162652
186;118;29062021162652
187;118;29062021162652
188;115;29062021162652
189;117;29062021162652
190;116;29062021162652
191;117;29062021162652
192;119;29062021162652
193;117;29062021162652
194;117;29062021162652
195;117;29062021162652
196;116;29062021162652
197;117;29062021162652
198;116;29062021162652
199;116;29062021162652
200;0;29062021162652
0;0;29062021162652
1;139;29062021162652
2;117;29062021162652
3;117;29062021162652
4;117;29062021162652
5;119;29062021162652
6;116;29062021162652
7;118;29062021162652
8;120;29062021162652
9;117;29062021162652
10;120;29062021162652
11;117;29062021162652
12;118;29062021162652
13;120;29062021162652
14;120;29062021162652
15;122;29062021162652
16;124;29062021162652
17;124;29062021162652
18;134;29062021162652
19;146;29062021162652
20;173;29062021162652
21;247;29062021162652
22;427;29062021162652
23;835;29062021162652
24;1017;29062021162652
25;1016;29062021162652
26;1021;29062021162652
27;1023;29062021162652
28;1020;29062021162652
29;1021;29062021162652
30;1021;29062021162652
31;838;29062021162652
32;597;29062021162652
33;436;29062021162652
34;341;29062021162652
35;276;29062021162652
36;225;29062021162652
37;198;29062021162652
38;176;29062021162652
39;164;29062021162652
40;155;29062021162652
41;148;29062021162652
42;146;29062021162652
43;145;29062021162652
44;142;29062021162652
45;143;29062021162652
46;140;29062021162652
47;140;29062021162652
48;141;29062021162652
49;139;29062021162652
50;143;29062021162652
51;139;29062021162652
52;139;29062021162652
53;142;29062021162652
54;141;29062021162652
55;140;29062021162652
56;143;29062021162652
57;141;29062021162652
58;144;29062021162652
59;145;29062021162652
60;145;29062021162652
61;145;29062021162652
62;144;29062021162652
63;147;29062021162652
64;149;29062021162652
65;145;29062021162652
66;147;29062021162652
67;146;29062021162652
68;144;29062021162652
69;147;29062021162652
70;144;29062021162652
71;143;29062021162652
72;145;29062021162652
73;140;29062021162652
74;142;29062021162652
75;138;29062021162652
76;138;29062021162652
77;138;29062021162652
78;136;29062021162652
79;136;29062021162652
80;136;29062021162652
81;133;29062021162652
82;135;29062021162652
83;132;29062021162652
84;130;29062021162652
85;132;29062021162652
86;129;29062021162652
87;131;29062021162652
88;132;29062021162652
89;128;29062021162652
90;131;29062021162652
91;128;29062021162652
92;126;29062021162652
93;129;29062021162652
94;126;29062021162652
95;126;29062021162652
96;128;29062021162652
97;126;29062021162652
98;126;29062021162652
99;124;29062021162652
100;124;29062021162652
101;125;29062021162652
102;123;29062021162652
103;123;29062021162652
104;124;29062021162652
105;121;29062021162652
106;124;29062021162652
107;122;29062021162652
108;121;29062021162652
109;123;29062021162652
110;120;29062021162652
111;120;29062021162652
112;123;29062021162652
113;119;29062021162652
114;120;29062021162652
115;121;29062021162652
116;119;29062021162652
117;124;29062021162652
118;121;29062021162652
119;121;29062021162652
120;119;29062021162652
121;118;29062021162652
122;119;29062021162652
123;119;29062021162652
124;118;29062021162652
125;120;29062021162652
126;117;29062021162652
127;119;29062021162652
128;120;29062021162652
129;118;29062021162652
130;119;29062021162652
131;119;29062021162652
132;117;29062021162652
133;121;29062021162652
134;117;29062021162652
135;118;29062021162652
136;120;29062021162652
137;117;29062021162652
138;119;29062021162652
139;118;29062021162652
140;116;29062021162652
141;118;29062021162652
142;117;29062021162652
143;117;29062021162652
144;119;29062021162652
145;115;29062021162652
146;120;29062021162652
147;118;29062021162652
148;117;29062021162652
149;117;29062021162652
150;116;29062021162652
151;116;29062021162652
152;118;29062021162652
153;115;29062021162652
154;118;29062021162652
155;117;29062021162652
156;116;29062021162652
157;117;29062021162652
158;116;29062021162652
159;116;29062021162652
160;118;29062021162652
161;117;29062021162652
162;117;29062021162652
163;117;29062021162652
164;116;29062021162652
165;119;29062021162652
166;117;29062021162652
167;117;29062021162652
168;118;29062021162652
169;115;29062021162652
170;118;29062021162652
171;117;29062021162652
172;117;29062021162652
173;118;29062021162652
174;117;29062021162652
175;117;29062021162652
176;117;29062021162652
177;115;29062021162652
178;117;29062021162652
179;117;29062021162652
180;116;29062021162652
181;118;29062021162652
182;117;29062021162652
183;116;29062021162652
184;117;29062021162652
185;115;29062021162652
186;118;29062021162652
187;118;29062021162652
188;114;29062021162652
189;116;29062021162652
190;116;29062021162652
191;116;29062021162652
192;120;29062021162652
193;116;29062021162652
194;116;29062021162652
195;116;29062021162652
196;116;29062021162652
197;117;29062021162652
198;117;29062021162652
199;116;29062021162652
200;0;29062021162652
0;0;29062021162653
1;140;29062021162653
2;119;29062021162653
3;117;29062021162653
4;118;29062021162653
5;119;29062021162653
6;117;29062021162653
7;119;29062021162653
8;120;29062021162653
9;117;29062021162653
10;121;29062021162653
11;117;29062021162653
12;118;29062021162653
13;121;29062021162653
14;120;29062021162653
15;123;29062021162653
16;124;29062021162653
17;125;29062021162653
18;133;29062021162653
19;145;29062021162653
20;175;29062021162653
21;246;29062021162653
22;424;29062021162653
23;839;29062021162653
24;1018;29062021162653
25;1018;29062021162653
26;1023;29062021162653
27;1023;29062021162653
28;1022;29062021162653
29;1023;29062021162653
30;1023;29062021162653
31;826;29062021162653
32;587;29062021162653
33;439;29062021162653
34;340;29062021162653
35;272;29062021162653
36;223;29062021162653
37;197;29062021162653
38;175;29062021162653
39;163;29062021162653
40;156;29062021162653
41;148;29062021162653
42;148;29062021162653
43;142;29062021162653
44;143;29062021162653
45;143;29062021162653
46;141;29062021162653
47;142;29062021162653
48;141;29062021162653
49;141;29062021162653
50;142;29062021162653
51;140;29062021162653
52;140;29062021162653
53;141;29062021162653
54;140;29062021162653
55;139;29062021162653
56;142;29062021162653
57;142;29062021162653
58;146;29062021162653
59;144;29062021162653
60;145;29062021162653
61;146;29062021162653
62;145;29062021162653
63;147;29062021162653
64;147;29062021162653
65;146;29062021162653
66;148;29062021162653
67;145;29062021162653
68;145;29062021162653
69;148;29062021162653
70;143;29062021162653
71;145;29062021162653
72;145;29062021162653
73;139;29062021162653
74;141;29062021162653
75;139;29062021162653
76;138;29062021162653
77;139;29062021162653
78;136;29062021162653
79;137;29062021162653
80;135;29062021162653
81;133;29062021162653
82;135;29062021162653
83;133;29062021162653
84;131;29062021162653
85;132;29062021162653
86;130;29062021162653
87;130;29062021162653
88;132;29062021162653
89;128;29062021162653
90;130;29062021162653
91;130;29062021162653
92;126;29062021162653
93;129;29062021162653
94;127;29062021162653
95;125;29062021162653
96;128;29062021162653
97;125;29062021162653
98;125;29062021162653
99;126;29062021162653
100;124;29062021162653
101;126;29062021162653
102;124;29062021162653
103;123;29062021162653
104;123;29062021162653
105;122;29062021162653
106;124;29062021162653
107;122;29062021162653
108;123;29062021162653
109;123;29062021162653
110;120;29062021162653
111;122;29062021162653
112;123;29062021162653
113;120;29062021162653
114;122;29062021162653
115;122;29062021162653
116;121;29062021162653
117;124;29062021162653
118;119;29062021162653
119;121;29062021162653
120;119;29062021162653
121;119;29062021162653
122;120;29062021162653
123;120;29062021162653
124;119;29062021162653
125;120;29062021162653
126;119;29062021162653
127;119;29062021162653
128;121;29062021162653
129;118;29062021162653
130;119;29062021162653
131;119;29062021162653
132;117;29062021162653
133;121;29062021162653
134;118;29062021162653
135;119;29062021162653
136;120;29062021162653
137;118;29062021162653
138;119;29062021162653
139;119;29062021162653
140;117;29062021162653
141;119;29062021162653
142;117;29062021162653
143;117;29062021162653
144;119;29062021162653
145;116;29062021162653
146;119;29062021162653
147;119;29062021162653
148;116;29062021162653
149;118;29062021162653
150;117;29062021162653
151;118;29062021162653
152;118;29062021162653
153;116;29062021162653
154;118;29062021162653
155;117;29062021162653
156;116;29062021162653
157;118;29062021162653
158;118;29062021162653
159;117;29062021162653
160;118;29062021162653
161;116;29062021162653
162;118;29062021162653
163;118;29062021162653
164;117;29062021162653
165;119;29062021162653
166;118;29062021162653
167;117;29062021162653
168;119;29062021162653
169;116;29062021162653
170;119;29062021162653
171;118;29062021162653
172;116;29062021162653
173;118;29062021162653
174;118;29062021162653
175;117;29062021162653
176;117;29062021162653
177;116;29062021162653
178;119;29062021162653
179;117;29062021162653
180;117;29062021162653
181;118;29062021162653
182;118;29062021162653
183;117;29062021162653
184;118;29062021162653
185;116;29062021162653
186;118;29062021162653
187;117;29062021162653
188;115;29062021162653
189;117;29062021162653
190;116;29062021162653
191;116;29062021162653
192;119;29062021162653
193;117;29062021162653
194;117;29062021162653
195;116;29062021162653
196;116;29062021162653
197;118;29062021162653
198;116;29062021162653
199;115;29062021162653
200;0;29062021162653
0;0;29062021162653
1;139;29062021162653
2;119;29062021162653
3;117;29062021162653
4;117;29062021162653
5;119;29062021162653
6;117;29062021162653
7;119;29062021162653
8;118;29062021162653
9;118;29062021162653
10;121;29062021162653
11;117;29062021162653
12;117;29062021162653
13;121;29062021162653
14;120;29062021162653
15;122;29062021162653
16;123;29062021162653
17;124;29062021162653
18;134;29062021162653
19;145;29062021162653
20;175;29062021162653
21;244;29062021162653
22;424;29062021162653
23;827;29062021162653
24;1017;29062021162653
25;1016;29062021162653
26;1021;29062021162653
27;1023;29062021162653
28;1020;29062021162653
29;1022;29062021162653
30;1021;29062021162653
31;840;29062021162653
32;595;29062021162653
33;440;29062021162653
34;339;29062021162653
35;275;29062021162653
36;227;29062021162653
37;199;29062021162653
38;175;29062021162653
39;164;29062021162653
40;156;29062021162653
41;147;29062021162653
42;146;29062021162653
43;143;29062021162653
44;141;29062021162653
45;142;29062021162653
46;140;29062021162653
47;140;29062021162653
48;142;29062021162653
49;139;29062021162653
50;142;29062021162653
51;140;29062021162653
52;140;29062021162653
53;141;29062021162653
54;140;29062021162653
55;141;29062021162653
56;143;29062021162653
57;140;29062021162653
58;143;29062021162653
59;142;29062021162653
60;144;29062021162653
61;146;29062021162653
62;143;29062021162653
63;148;29062021162653
64;148;29062021162653
65;145;29062021162653
66;146;29062021162653
67;146;29062021162653
68;145;29062021162653
69;146;29062021162653
70;144;29062021162653
71;142;29062021162653
72;144;29062021162653
73;139;29062021162653
74;142;29062021162653
75;140;29062021162653
76;137;29062021162653
77;138;29062021162653
78;135;29062021162653
79;135;29062021162653
80;136;29062021162653
81;132;29062021162653
82;135;29062021162653
83;131;29062021162653
84;130;29062021162653
85;131;29062021162653
86;129;29062021162653
87;129;29062021162653
88;131;29062021162653
89;127;29062021162653
90;130;29062021162653
91;128;29062021162653
92;126;29062021162653
93;128;29062021162653
94;128;29062021162653
95;125;29062021162653
96;127;29062021162653
97;125;29062021162653
98;125;29062021162653
99;125;29062021162653
100;123;29062021162653
101;125;29062021162653
102;122;29062021162653
103;124;29062021162653
104;123;29062021162653
105;121;29062021162653
106;126;29062021162653
107;121;29062021162653
108;121;29062021162653
109;122;29062021162653
110;121;29062021162653
111;122;29062021162653
112;122;29062021162653
113;120;29062021162653
114;119;29062021162653
115;122;29062021162653
116;120;29062021162653
117;123;29062021162653
118;120;29062021162653
119;120;29062021162653
120;119;29062021162653
121;118;29062021162653
122;120;29062021162653
123;120;29062021162653
124;117;29062021162653
125;120;29062021162653
126;118;29062021162653
127;120;29062021162653
128;120;29062021162653
129;118;29062021162653
130;118;29062021162653
131;118;29062021162653
132;117;29062021162653
133;121;29062021162653
134;118;29062021162653
135;118;29062021162653
136;120;29062021162653
137;117;29062021162653
138;118;29062021162653
139;118;29062021162653
140;116;29062021162653
141;118;29062021162653
142;117;29062021162653
143;117;29062021162653
144;118;29062021162653
145;116;29062021162653
146;119;29062021162653
147;117;29062021162653
148;117;29062021162653
149;117;29062021162653
150;117;29062021162653
151;116;29062021162653
152;117;29062021162653
153;115;29062021162653
154;119;29062021162653
155;117;29062021162653
156;116;29062021162653
157;117;29062021162653
158;117;29062021162653
159;116;29062021162653
160;117;29062021162653
161;115;29062021162653
162;117;29062021162653
163;117;29062021162653
164;117;29062021162653
165;118;29062021162653
166;117;29062021162653
167;118;29062021162653
168;117;29062021162653
169;115;29062021162653
170;117;29062021162653
171;117;29062021162653
172;117;29062021162653
173;118;29062021162653
174;115;29062021162653
175;116;29062021162653
176;118;29062021162653
177;116;29062021162653
178;118;29062021162653
179;116;29062021162653
180;116;29062021162653
181;119;29062021162653
182;117;29062021162653
183;116;29062021162653
184;117;29062021162653
185;115;29062021162653
186;117;29062021162653
187;116;29062021162653
188;114;29062021162653
189;117;29062021162653
190;116;29062021162653
191;116;29062021162653
192;119;29062021162653
193;115;29062021162653
194;117;29062021162653
195;118;29062021162653
196;116;29062021162653
197;118;29062021162653
198;116;29062021162653
199;116;29062021162653
200;0;29062021162653
0;0;29062021162653
1;139;29062021162653
2;118;29062021162653
3;118;29062021162653
4;118;29062021162653
5;119;29062021162653
6;117;29062021162653
7;119;29062021162653
8;118;29062021162653
9;117;29062021162653
10;120;29062021162653
11;117;29062021162653
12;118;29062021162653
13;121;29062021162653
14;120;29062021162653
15;121;29062021162653
16;124;29062021162653
17;124;29062021162653
18;133;29062021162653
19;146;29062021162653
20;173;29062021162653
21;246;29062021162653
22;431;29062021162653
23;839;29062021162653
24;1018;29062021162653
25;1017;29062021162653
26;1023;29062021162653
27;1023;29062021162653
28;1020;29062021162653
29;1022;29062021162653
30;1021;29062021162653
31;835;29062021162653
32;590;29062021162653
33;441;29062021162653
34;339;29062021162653
35;274;29062021162653
36;227;29062021162653
37;198;29062021162653
38;175;29062021162653
39;161;29062021162653
40;156;29062021162653
41;148;29062021162653
42;146;29062021162653
43;144;29062021162653
44;143;29062021162653
45;144;29062021162653
46;140;29062021162653
47;141;29062021162653
48;142;29062021162653
49;140;29062021162653
50;142;29062021162653
51;140;29062021162653
52;140;29062021162653
53;141;29062021162653
54;141;29062021162653
55;139;29062021162653
56;142;29062021162653
57;139;29062021162653
58;144;29062021162653
59;144;29062021162653
60;144;29062021162653
61;146;29062021162653
62;145;29062021162653
63;146;29062021162653
64;149;29062021162653
65;145;29062021162653
66;148;29062021162653
67;145;29062021162653
68;145;29062021162653
69;147;29062021162653
70;144;29062021162653
71;143;29062021162653
72;143;29062021162653
73;141;29062021162653
74;142;29062021162653
75;139;29062021162653
76;138;29062021162653
77;139;29062021162653
78;136;29062021162653
79;136;29062021162653
80;135;29062021162653
81;131;29062021162653
82;135;29062021162653
83;133;29062021162653
84;132;29062021162653
85;132;29062021162653
86;130;29062021162653
87;130;29062021162653
88;131;29062021162653
89;128;29062021162653
90;129;29062021162653
91;130;29062021162653
92;127;29062021162653
93;129;29062021162653
94;127;29062021162653
95;126;29062021162653
96;127;29062021162653
97;125;29062021162653
98;126;29062021162653
99;125;29062021162653
100;124;29062021162653
101;125;29062021162653
102;123;29062021162653
103;123;29062021162653
104;124;29062021162653
105;121;29062021162653
106;124;29062021162653
107;122;29062021162653
108;122;29062021162653
109;122;29062021162653
110;120;29062021162653
111;121;29062021162653
112;122;29062021162653
113;120;29062021162653
114;122;29062021162653
115;121;29062021162653
116;120;29062021162653
117;122;29062021162653
118;121;29062021162653
119;120;29062021162653
120;119;29062021162653
121;119;29062021162653
122;119;29062021162653
123;119;29062021162653
124;118;29062021162653
125;120;29062021162653
126;117;29062021162653
127;118;29062021162653
128;121;29062021162653
129;118;29062021162653
130;119;29062021162653
131;119;29062021162653
132;117;29062021162653
133;121;29062021162653
134;118;29062021162653
135;117;29062021162653
136;120;29062021162653
137;117;29062021162653
138;119;29062021162653
139;117;29062021162653
140;117;29062021162653
141;119;29062021162653
142;117;29062021162653
143;117;29062021162653
144;118;29062021162653
145;116;29062021162653
146;119;29062021162653
147;118;29062021162653
148;116;29062021162653
149;117;29062021162653
150;116;29062021162653
151;117;29062021162653
152;117;29062021162653
153;115;29062021162653
154;118;29062021162653
155;117;29062021162653
156;117;29062021162653
157;118;29062021162653
158;116;29062021162653
159;116;29062021162653
160;118;29062021162653
161;115;29062021162653
162;117;29062021162653
163;117;29062021162653
164;116;29062021162653
165;119;29062021162653
166;118;29062021162653
167;117;29062021162653
168;118;29062021162653
169;115;29062021162653
170;118;29062021162653
171;117;29062021162653
172;117;29062021162653
173;118;29062021162653
174;116;29062021162653
175;115;29062021162653
176;117;29062021162653
177;116;29062021162653
178;118;29062021162653
179;115;29062021162653
180;115;29062021162653
181;118;29062021162653
182;116;29062021162653
183;116;29062021162653
184;117;29062021162653
185;115;29062021162653
186;119;29062021162653
187;117;29062021162653
188;116;29062021162653
189;117;29062021162653
190;115;29062021162653
191;116;29062021162653
192;119;29062021162653
193;116;29062021162653
194;116;29062021162653
195;116;29062021162653
196;116;29062021162653
197;118;29062021162653
198;118;29062021162653
199;116;29062021162653
200;0;29062021162653
0;0;29062021162654
1;140;29062021162654
2;118;29062021162654
3;117;29062021162654
4;117;29062021162654
5;118;29062021162654
6;117;29062021162654
7;118;29062021162654
8;119;29062021162654
9;117;29062021162654
10;120;29062021162654
11;117;29062021162654
12;118;29062021162654
13;120;29062021162654
14;120;29062021162654
15;123;29062021162654
16;124;29062021162654
17;125;29062021162654
18;132;29062021162654
19;144;29062021162654
20;173;29062021162654
21;245;29062021162654
22;428;29062021162654
23;840;29062021162654
24;1017;29062021162654
25;1016;29062021162654
26;1021;29062021162654
27;1023;29062021162654
28;1019;29062021162654
29;1022;29062021162654
30;1021;29062021162654
31;838;29062021162654
32;594;29062021162654
33;438;29062021162654
34;343;29062021162654
35;273;29062021162654
36;226;29062021162654
37;196;29062021162654
38;175;29062021162654
39;162;29062021162654
40;155;29062021162654
41;146;29062021162654
42;146;29062021162654
43;144;29062021162654
44;142;29062021162654
45;140;29062021162654
46;140;29062021162654
47;142;29062021162654
48;143;29062021162654
49;139;29062021162654
50;142;29062021162654
51;140;29062021162654
52;139;29062021162654
53;141;29062021162654
54;141;29062021162654
55;139;29062021162654
56;142;29062021162654
57;140;29062021162654
58;143;29062021162654
59;143;29062021162654
60;145;29062021162654
61;147;29062021162654
62;145;29062021162654
63;147;29062021162654
64;149;29062021162654
65;143;29062021162654
66;147;29062021162654
67;145;29062021162654
68;145;29062021162654
69;146;29062021162654
70;143;29062021162654
71;144;29062021162654
72;144;29062021162654
73;140;29062021162654
74;143;29062021162654
75;138;29062021162654
76;137;29062021162654
77;139;29062021162654
78;135;29062021162654
79;135;29062021162654
80;136;29062021162654
81;132;29062021162654
82;134;29062021162654
83;131;29062021162654
84;131;29062021162654
85;131;29062021162654
86;129;29062021162654
87;131;29062021162654
88;131;29062021162654
89;126;29062021162654
90;131;29062021162654
91;128;29062021162654
92;126;29062021162654
93;129;29062021162654
94;126;29062021162654
95;126;29062021162654
96;128;29062021162654
97;125;29062021162654
98;125;29062021162654
99;124;29062021162654
100;123;29062021162654
101;125;29062021162654
102;124;29062021162654
103;122;29062021162654
104;123;29062021162654
105;121;29062021162654
106;123;29062021162654
107;122;29062021162654
108;121;29062021162654
109;122;29062021162654
110;120;29062021162654
111;121;29062021162654
112;122;29062021162654
113;119;29062021162654
114;121;29062021162654
115;121;29062021162654
116;120;29062021162654
117;123;29062021162654
118;119;29062021162654
119;120;29062021162654
120;120;29062021162654
121;118;29062021162654
122;120;29062021162654
123;120;29062021162654
124;119;29062021162654
125;120;29062021162654
126;118;29062021162654
127;119;29062021162654
128;120;29062021162654
129;117;29062021162654
130;118;29062021162654
131;119;29062021162654
132;117;29062021162654
133;121;29062021162654
134;118;29062021162654
135;118;29062021162654
136;120;29062021162654
137;116;29062021162654
138;119;29062021162654
139;117;29062021162654
140;116;29062021162654
141;120;29062021162654
142;117;29062021162654
143;117;29062021162654
144;119;29062021162654
145;116;29062021162654
146;118;29062021162654
147;118;29062021162654
148;116;29062021162654
149;117;29062021162654
150;116;29062021162654
151;117;29062021162654
152;117;29062021162654
153;116;29062021162654
154;118;29062021162654
155;116;29062021162654
156;116;29062021162654
157;116;29062021162654
158;116;29062021162654
159;116;29062021162654
160;117;29062021162654
161;116;29062021162654
162;117;29062021162654
163;117;29062021162654
164;116;29062021162654
165;118;29062021162654
166;117;29062021162654
167;117;29062021162654
168;118;29062021162654
169;115;29062021162654
170;117;29062021162654
171;117;29062021162654
172;116;29062021162654
173;117;29062021162654
174;116;29062021162654
175;116;29062021162654
176;118;29062021162654
177;115;29062021162654
178;118;29062021162654
179;117;29062021162654
180;116;29062021162654
181;118;29062021162654
182;117;29062021162654
183;116;29062021162654
184;117;29062021162654
185;115;29062021162654
186;117;29062021162654
187;117;29062021162654
188;115;29062021162654
189;117;29062021162654
190;116;29062021162654
191;117;29062021162654
192;121;29062021162654
193;116;29062021162654
194;116;29062021162654
195;116;29062021162654
196;115;29062021162654
197;117;29062021162654
198;117;29062021162654
199;115;29062021162654
200;0;29062021162654
0;0;29062021162654
1;140;29062021162654
2;118;29062021162654
3;117;29062021162654
4;118;29062021162654
5;120;29062021162654
6;117;29062021162654
7;119;29062021162654
8;119;29062021162654
9;118;29062021162654
10;120;29062021162654
11;118;29062021162654
12;117;29062021162654
13;120;29062021162654
14;119;29062021162654
15;123;29062021162654
16;125;29062021162654
17;125;29062021162654
18;134;29062021162654
19;146;29062021162654
20;172;29062021162654
21;245;29062021162654
22;431;29062021162654
23;837;29062021162654
24;1018;29062021162654
25;1017;29062021162654
26;1023;29062021162654
27;1023;29062021162654
28;1021;29062021162654
29;1023;29062021162654
30;1023;29062021162654
31;834;29062021162654
32;588;29062021162654
33;436;29062021162654
34;342;29062021162654
35;273;29062021162654
36;226;29062021162654
37;196;29062021162654
38;177;29062021162654
39;164;29062021162654
40;156;29062021162654
41;148;29062021162654
42;146;29062021162654
43;144;29062021162654
44;142;29062021162654
45;143;29062021162654
46;140;29062021162654
47;142;29062021162654
48;143;29062021162654
49;140;29062021162654
50;142;29062021162654
51;140;29062021162654
52;141;29062021162654
53;141;29062021162654
54;140;29062021162654
55;140;29062021162654
56;143;29062021162654
57;140;29062021162654
58;145;29062021162654
59;144;29062021162654
60;145;29062021162654
61;146;29062021162654
62;146;29062021162654
63;147;29062021162654
64;149;29062021162654
65;145;29062021162654
66;147;29062021162654
67;147;29062021162654
68;145;29062021162654
69;146;29062021162654
70;144;29062021162654
71;143;29062021162654
72;143;29062021162654
73;139;29062021162654
74;142;29062021162654
75;138;29062021162654
76;139;29062021162654
77;139;29062021162654
78;136;29062021162654
79;136;29062021162654
80;136;29062021162654
81;132;29062021162654
82;134;29062021162654
83;132;29062021162654
84;131;29062021162654
85;132;29062021162654
86;129;29062021162654
87;130;29062021162654
88;131;29062021162654
89;128;29062021162654
90;130;29062021162654
91;128;29062021162654
92;127;29062021162654
93;129;29062021162654
94;128;29062021162654
95;126;29062021162654
96;127;29062021162654
97;126;29062021162654
98;126;29062021162654
99;125;29062021162654
100;123;29062021162654
101;126;29062021162654
102;122;29062021162654
103;123;29062021162654
104;123;29062021162654
105;121;29062021162654
106;124;29062021162654
107;122;29062021162654
108;122;29062021162654
109;122;29062021162654
110;119;29062021162654
111;120;29062021162654
112;123;29062021162654
113;120;29062021162654
114;121;29062021162654
115;122;29062021162654
116;120;29062021162654
117;123;29062021162654
118;120;29062021162654
119;121;29062021162654
120;119;29062021162654
121;118;29062021162654
122;119;29062021162654
123;119;29062021162654
124;119;29062021162654
125;121;29062021162654
126;118;29062021162654
127;119;29062021162654
128;120;29062021162654
129;117;29062021162654
130;118;29062021162654
131;120;29062021162654
132;117;29062021162654
133;121;29062021162654
134;118;29062021162654
135;117;29062021162654
136;120;29062021162654
137;117;29062021162654
138;119;29062021162654
139;118;29062021162654
140;116;29062021162654
141;119;29062021162654
142;117;29062021162654
143;117;29062021162654
144;119;29062021162654
145;116;29062021162654
146;119;29062021162654
147;118;29062021162654
148;117;29062021162654
149;117;29062021162654
150;117;29062021162654
151;117;29062021162654
152;118;29062021162654
153;115;29062021162654
154;118;29062021162654
155;117;29062021162654
156;117;29062021162654
157;117;29062021162654
158;116;29062021162654
159;117;29062021162654
160;118;29062021162654
161;117;29062021162654
162;118;29062021162654
163;118;29062021162654
164;117;29062021162654
165;119;29062021162654
166;117;29062021162654
167;117;29062021162654
168;119;29062021162654
169;115;29062021162654
170;117;29062021162654
171;118;29062021162654
172;117;29062021162654
173;118;29062021162654
174;117;29062021162654
175;115;29062021162654
176;118;29062021162654
177;116;29062021162654
178;118;29062021162654
179;117;29062021162654
180;117;29062021162654
181;118;29062021162654
182;117;29062021162654
183;116;29062021162654
184;118;29062021162654
185;115;29062021162654
186;118;29062021162654
187;117;29062021162654
188;114;29062021162654
189;117;29062021162654
190;117;29062021162654
191;117;29062021162654
192;120;29062021162654
193;116;29062021162654
194;117;29062021162654
195;117;29062021162654
196;115;29062021162654
197;118;29062021162654
198;117;29062021162654
199;116;29062021162654
200;0;29062021162654
0;0;29062021162655
1;140;29062021162655
2;119;29062021162655
3;118;29062021162655
4;118;29062021162655
5;120;29062021162655
6;116;29062021162655
7;118;29062021162655
8;119;29062021162655
9;117;29062021162655
10;120;29062021162655
11;118;29062021162655
12;118;29062021162655
13;122;29062021162655
14;120;29062021162655
15;123;29062021162655
16;123;29062021162655
17;125;29062021162655
18;134;29062021162655
19;144;29062021162655
20;173;29062021162655
21;243;29062021162655
22;419;29062021162655
23;826;29062021162655
24;1018;29062021162655
25;1017;29062021162655
26;1023;29062021162655
27;1023;29062021162655
28;1023;29062021162655
29;1023;29062021162655
30;1023;29062021162655
31;838;29062021162655
32;594;29062021162655
33;441;29062021162655
34;342;29062021162655
35;274;29062021162655
36;223;29062021162655
37;197;29062021162655
38;177;29062021162655
39;164;29062021162655
40;156;29062021162655
41;148;29062021162655
42;147;29062021162655
43;143;29062021162655
44;141;29062021162655
45;142;29062021162655
46;141;29062021162655
47;140;29062021162655
48;142;29062021162655
49;140;29062021162655
50;141;29062021162655
51;140;29062021162655
52;139;29062021162655
53;141;29062021162655
54;139;29062021162655
55;140;29062021162655
56;142;29062021162655
57;141;29062021162655
58;143;29062021162655
59;143;29062021162655
60;145;29062021162655
61;145;29062021162655
62;144;29062021162655
63;148;29062021162655
64;148;29062021162655
65;144;29062021162655
66;148;29062021162655
67;146;29062021162655
68;144;29062021162655
69;146;29062021162655
70;142;29062021162655
71;143;29062021162655
72;143;29062021162655
73;139;29062021162655
74;142;29062021162655
75;138;29062021162655
76;137;29062021162655
77;138;29062021162655
78;135;29062021162655
79;135;29062021162655
80;134;29062021162655
81;132;29062021162655
82;134;29062021162655
83;132;29062021162655
84;131;29062021162655
85;130;29062021162655
86;129;29062021162655
87;129;29062021162655
88;131;29062021162655
89;127;29062021162655
90;129;29062021162655
91;129;29062021162655
92;126;29062021162655
93;128;29062021162655
94;126;29062021162655
95;125;29062021162655
96;128;29062021162655
97;124;29062021162655
98;126;29062021162655
99;125;29062021162655
100;123;29062021162655
101;125;29062021162655
102;124;29062021162655
103;122;29062021162655
104;123;29062021162655
105;121;29062021162655
106;124;29062021162655
107;122;29062021162655
108;121;29062021162655
109;123;29062021162655
110;119;29062021162655
111;120;29062021162655
112;123;29062021162655
113;118;29062021162655
114;120;29062021162655
115;120;29062021162655
116;119;29062021162655
117;123;29062021162655
118;120;29062021162655
119;121;29062021162655
120;120;29062021162655
121;119;29062021162655
122;119;29062021162655
123;119;29062021162655
124;117;29062021162655
125;119;29062021162655
126;117;29062021162655
127;119;29062021162655
128;120;29062021162655
129;117;29062021162655
130;118;29062021162655
131;119;29062021162655
132;117;29062021162655
133;120;29062021162655
134;118;29062021162655
135;117;29062021162655
136;120;29062021162655
137;117;29062021162655
138;119;29062021162655
139;117;29062021162655
140;116;29062021162655
141;119;29062021162655
142;116;29062021162655
143;116;29062021162655
144;119;29062021162655
145;116;29062021162655
146;118;29062021162655
147;117;29062021162655
148;116;29062021162655
149;117;29062021162655
150;117;29062021162655
151;118;29062021162655
152;117;29062021162655
153;114;29062021162655
154;118;29062021162655
155;116;29062021162655
156;116;29062021162655
157;117;29062021162655
158;116;29062021162655
159;116;29062021162655
160;118;29062021162655
161;115;29062021162655
162;118;29062021162655
163;118;29062021162655
164;116;29062021162655
165;118;29062021162655
166;116;29062021162655
167;117;29062021162655
168;118;29062021162655
169;116;29062021162655
170;118;29062021162655
171;118;29062021162655
172;116;29062021162655
173;118;29062021162655
174;117;29062021162655
175;117;29062021162655
176;117;29062021162655
177;115;29062021162655
178;118;29062021162655
179;117;29062021162655
180;115;29062021162655
181;119;29062021162655
182;117;29062021162655
183;116;29062021162655
184;117;29062021162655
185;115;29062021162655
186;118;29062021162655
187;117;29062021162655
188;115;29062021162655
189;117;29062021162655
190;115;29062021162655
191;116;29062021162655
192;119;29062021162655
193;117;29062021162655
194;116;29062021162655
195;117;29062021162655
196;115;29062021162655
197;116;29062021162655
198;116;29062021162655
199;116;29062021162655
200;0;29062021162655
0;0;29062021162655
1;139;29062021162655
2;118;29062021162655
3;117;29062021162655
4;118;29062021162655
5;119;29062021162655
6;116;29062021162655
7;118;29062021162655
8;118;29062021162655
9;117;29062021162655
10;120;29062021162655
11;117;29062021162655
12;118;29062021162655
13;121;29062021162655
14;120;29062021162655
15;121;29062021162655
16;123;29062021162655
17;124;29062021162655
18;133;29062021162655
19;144;29062021162655
20;173;29062021162655
21;241;29062021162655
22;429;29062021162655
23;837;29062021162655
24;1017;29062021162655
25;1016;29062021162655
26;1022;29062021162655
27;1023;29062021162655
28;1020;29062021162655
29;1022;29062021162655
30;1021;29062021162655
31;834;29062021162655
32;595;29062021162655
33;437;29062021162655
34;342;29062021162655
35;275;29062021162655
36;227;29062021162655
37;196;29062021162655
38;175;29062021162655
39;163;29062021162655
40;156;29062021162655
41;148;29062021162655
42;147;29062021162655
43;144;29062021162655
44;142;29062021162655
45;142;29062021162655
46;140;29062021162655
47;141;29062021162655
48;143;29062021162655
49;141;29062021162655
50;142;29062021162655
51;140;29062021162655
52;139;29062021162655
53;141;29062021162655
54;140;29062021162655
55;140;29062021162655
56;141;29062021162655
57;140;29062021162655
58;144;29062021162655
59;143;29062021162655
60;144;29062021162655
61;144;29062021162655
62;145;29062021162655
63;147;29062021162655
64;148;29062021162655
65;145;29062021162655
66;148;29062021162655
67;146;29062021162655
68;144;29062021162655
69;146;29062021162655
70;143;29062021162655
71;144;29062021162655
72;145;29062021162655
73;139;29062021162655
74;141;29062021162655
75;139;29062021162655
76;138;29062021162655
77;138;29062021162655
78;135;29062021162655
79;135;29062021162655
80;135;29062021162655
81;132;29062021162655
82;134;29062021162655
83;130;29062021162655
84;132;29062021162655
85;132;29062021162655
86;128;29062021162655
87;130;29062021162655
88;132;29062021162655
89;127;29062021162655
90;131;29062021162655
91;128;29062021162655
92;125;29062021162655
93;128;29062021162655
94;127;29062021162655
95;125;29062021162655
96;128;29062021162655
97;126;29062021162655
98;125;29062021162655
99;125;29062021162655
100;122;29062021162655
101;125;29062021162655
102;123;29062021162655
103;123;29062021162655
104;123;29062021162655
105;121;29062021162655
106;125;29062021162655
107;122;29062021162655
108;121;29062021162655
109;122;29062021162655
110;119;29062021162655
111;121;29062021162655
112;122;29062021162655
113;120;29062021162655
114;121;29062021162655
115;122;29062021162655
116;120;29062021162655
117;122;29062021162655
118;120;29062021162655
119;120;29062021162655
120;120;29062021162655
121;118;29062021162655
122;120;29062021162655
123;120;29062021162655
124;118;29062021162655
125;120;29062021162655
126;118;29062021162655
127;119;29062021162655
128;120;29062021162655
129;118;29062021162655
130;119;29062021162655
131;119;29062021162655
132;118;29062021162655
133;121;29062021162655
134;118;29062021162655
135;117;29062021162655
136;120;29062021162655
137;117;29062021162655
138;119;29062021162655
139;118;29062021162655
140;116;29062021162655
141;118;29062021162655
142;117;29062021162655
143;117;29062021162655
144;119;29062021162655
145;115;29062021162655
146;120;29062021162655
147;118;29062021162655
148;116;29062021162655
149;117;29062021162655
150;116;29062021162655
151;117;29062021162655
152;118;29062021162655
153;116;29062021162655
154;118;29062021162655
155;116;29062021162655
156;117;29062021162655
157;117;29062021162655
158;116;29062021162655
159;115;29062021162655
160;117;29062021162655
161;115;29062021162655
162;118;29062021162655
163;117;29062021162655
164;117;29062021162655
165;118;29062021162655
166;117;29062021162655
167;117;29062021162655
168;118;29062021162655
169;115;29062021162655
170;117;29062021162655
171;117;29062021162655
172;116;29062021162655
173;117;29062021162655
174;117;29062021162655
175;116;29062021162655
176;117;29062021162655
177;116;29062021162655
178;118;29062021162655
179;116;29062021162655
180;116;29062021162655
181;118;29062021162655
182;118;29062021162655
183;117;29062021162655
184;118;29062021162655
185;115;29062021162655
186;118;29062021162655
187;117;29062021162655
188;115;29062021162655
189;116;29062021162655
190;116;29062021162655
191;117;29062021162655
192;120;29062021162655
193;116;29062021162655
194;117;29062021162655
195;116;29062021162655
196;116;29062021162655
197;117;29062021162655
198;116;29062021162655
199;116;29062021162655
200;0;29062021162655
