ind;val;datetime
0;0;
1;165;
2;160;
3;158;
4;159;
5;158;
6;156;
7;160;
8;161;
9;159;
10;161;
11;162;
12;161;
13;166;
14;166;
15;169;
16;174;
17;179;
18;196;
19;226;
20;290;
21;456;
22;852;
23;1023;
24;1023;
25;1023;
26;1023;
27;1023;
28;1023;
29;1023;
30;1023;
31;1023;
32;1023;
33;977;
34;704;
35;525;
36;405;
37;337;
38;297;
39;277;
40;262;
41;250;
42;250;
43;245;
44;245;
45;248;
46;243;
47;242;
48;238;
49;234;
50;231;
51;229;
52;221;
53;222;
54;216;
55;216;
56;213;
57;214;
58;219;
59;216;
60;218;
61;219;
62;215;
63;217;
64;217;
65;214;
66;216;
67;211;
68;207;
69;210;
70;205;
71;204;
72;209;
73;207;
74;214;
75;217;
76;223;
77;227;
78;235;
79;258;
80;282;
81;305;
82;333;
83;356;
84;353;
85;326;
86;286;
87;244;
88;213;
89;184;
90;176;
91;165;
92;160;
93;162;
94;160;
95;157;
96;160;
97;156;
98;156;
99;156;
100;153;
101;158;
102;155;
103;152;
104;153;
105;151;
106;154;
107;151;
108;151;
109;153;
110;148;
111;148;
112;151;
113;148;
114;148;
115;150;
116;149;
117;151;
118;148;
119;150;
120;149;
121;147;
122;149;
123;147;
124;148;
125;149;
126;146;
127;147;
128;150;
129;145;
130;147;
131;148;
132;144;
133;151;
134;144;
135;145;
136;147;
137;144;
138;148;
139;145;
140;144;
141;148;
142;144;
143;145;
144;148;
145;143;
146;146;
147;146;
148;144;
149;146;
150;145;
151;144;
152;145;
153;143;
154;144;
155;145;
156;143;
157;144;
158;142;
159;143;
160;145;
161;143;
162;145;
163;144;
164;143;
165;146;
166;144;
167;145;
168;146;
169;141;
170;145;
171;144;
172;143;
173;145;
174;143;
175;142;
176;144;
177;141;
178;145;
179;144;
180;143;
181;144;
182;144;
183;143;
184;144;
185;141;
186;146;
187;145;
188;143;
189;145;
190;142;
191;142;
192;147;
193;142;
194;144;
195;144;
196;142;
197;143;
198;144;
199;142;
200;0;
0;0;
1;167;
2;161;
3;157;
4;159;
5;161;
6;157;
7;160;
8;162;
9;158;
10;163;
11;162;
12;161;
13;167;
14;166;
15;172;
16;175;
17;178;
18;198;
19;227;
20;291;
21;454;
22;848;
23;1023;
24;1023;
25;1023;
26;1023;
27;1023;
28;1023;
29;1023;
30;1023;
31;1023;
32;1023;
33;982;
34;709;
35;529;
36;409;
37;342;
38;301;
39;281;
40;263;
41;254;
42;254;
43;246;
44;247;
45;251;
46;246;
47;243;
48;241;
49;235;
50;232;
51;225;
52;223;
53;224;
54;218;
55;216;
56;215;
57;216;
58;217;
59;217;
60;217;
61;221;
62;216;
63;218;
64;219;
65;212;
66;215;
67;211;
68;212;
69;209;
70;206;
71;206;
72;208;
73;209;
74;217;
75;218;
76;221;
77;228;
78;240;
79;258;
80;279;
81;308;
82;342;
83;357;
84;354;
85;330;
86;285;
87;248;
88;212;
89;186;
90;176;
91;165;
92;159;
93;163;
94;161;
95;156;
96;159;
97;158;
98;156;
99;156;
100;155;
101;158;
102;154;
103;154;
104;153;
105;152;
106;153;
107;153;
108;151;
109;153;
110;148;
111;149;
112;151;
113;148;
114;151;
115;152;
116;149;
117;153;
118;148;
119;151;
120;151;
121;147;
122;149;
123;148;
124;147;
125;148;
126;146;
127;148;
128;151;
129;146;
130;147;
131;147;
132;144;
133;152;
134;146;
135;145;
136;148;
137;145;
138;147;
139;146;
140;145;
141;148;
142;146;
143;145;
144;148;
145;143;
146;147;
147;147;
148;144;
149;145;
150;146;
151;145;
152;146;
153;143;
154;146;
155;146;
156;144;
157;144;
158;143;
159;143;
160;146;
161;143;
162;145;
163;145;
164;144;
165;145;
166;144;
167;144;
168;146;
169;142;
170;146;
171;144;
172;144;
173;146;
174;144;
175;142;
176;145;
177;143;
178;146;
179;145;
180;143;
181;144;
182;145;
183;144;
184;145;
185;143;
186;146;
187;144;
188;143;
189;144;
190;143;
191;144;
192;148;
193;144;
194;145;
195;144;
196;143;
197;144;
198;144;
199;143;
200;0;
0;0;
1;166;
2;161;
3;157;
4;160;
5;158;
6;158;
7;161;
8;161;
9;159;
10;163;
11;161;
12;160;
13;168;
14;164;
15;170;
16;173;
17;179;
18;199;
19;227;
20;294;
21;461;
22;853;
23;1023;
24;1023;
25;1023;
26;1023;
27;1023;
28;1023;
29;1023;
30;1023;
31;1023;
32;1023;
33;992;
34;715;
35;533;
36;411;
37;345;
38;300;
39;279;
40;265;
41;253;
42;251;
43;247;
44;248;
45;250;
46;247;
47;245;
48;240;
49;234;
50;235;
51;229;
52;223;
53;226;
54;219;
55;216;
56;218;
57;215;
58;217;
59;216;
60;216;
61;221;
62;218;
63;219;
64;220;
65;212;
66;216;
67;212;
68;210;
69;211;
70;207;
71;207;
72;209;
73;209;
74;216;
75;217;
76;221;
77;227;
78;239;
79;258;
80;282;
81;305;
82;340;
83;356;
84;359;
85;327;
86;290;
87;246;
88;215;
89;187;
90;177;
91;165;
92;160;
93;165;
94;160;
95;158;
96;159;
97;155;
98;156;
99;155;
100;155;
101;158;
102;155;
103;153;
104;153;
105;152;
106;154;
107;151;
108;151;
109;153;
110;149;
111;150;
112;152;
113;147;
114;149;
115;150;
116;148;
117;152;
118;149;
119;151;
120;149;
121;146;
122;148;
123;147;
124;147;
125;148;
126;146;
127;149;
128;150;
129;146;
130;148;
131;148;
132;145;
133;150;
134;145;
135;146;
136;147;
137;144;
138;147;
139;146;
140;144;
141;147;
142;145;
143;143;
144;147;
145;144;
146;146;
147;147;
148;144;
149;145;
150;145;
151;145;
152;145;
153;142;
154;144;
155;144;
156;143;
157;144;
158;143;
159;143;
160;144;
161;143;
162;144;
163;144;
164;143;
165;146;
166;144;
167;144;
168;147;
169;142;
170;144;
171;144;
172;142;
173;145;
174;142;
175;142;
176;144;
177;141;
178;145;
179;143;
180;143;
181;143;
182;144;
183;142;
184;144;
185;140;
186;146;
187;144;
188;142;
189;144;
190;143;
191;145;
192;148;
193;143;
194;145;
195;143;
196;143;
197;144;
198;144;
199;141;
200;0;
0;0;
1;167;
2;162;
3;159;
4;160;
5;161;
6;159;
7;161;
8;162;
9;160;
10;164;
11;162;
12;164;
13;167;
14;166;
15;171;
16;176;
17;180;
18;200;
19;227;
20;295;
21;454;
22;853;
23;1023;
24;1023;
25;1023;
26;1023;
27;1023;
28;1023;
29;1023;
30;1023;
31;1023;
32;1023;
33;991;
34;715;
35;538;
36;417;
37;342;
38;302;
39;280;
40;265;
41;253;
42;253;
43;247;
44;248;
45;249;
46;249;
47;243;
48;244;
49;237;
50;233;
51;228;
52;224;
53;224;
54;221;
55;218;
56;217;
57;214;
58;220;
59;219;
60;219;
61;221;
62;218;
63;219;
64;221;
65;213;
66;218;
67;213;
68;211;
69;210;
70;206;
71;206;
72;209;
73;211;
74;217;
75;219;
76;222;
77;231;
78;239;
79;257;
80;283;
81;309;
82;339;
83;358;
84;358;
85;330;
86;287;
87;247;
88;215;
89;190;
90;178;
91;165;
92;160;
93;163;
94;161;
95;158;
96;159;
97;157;
98;157;
99;156;
100;154;
101;158;
102;156;
103;153;
104;155;
105;152;
106;154;
107;153;
108;152;
109;153;
110;150;
111;150;
112;152;
113;150;
114;150;
115;151;
116;148;
117;154;
118;149;
119;150;
120;149;
121;146;
122;149;
123;148;
124;148;
125;150;
126;147;
127;148;
128;150;
129;147;
130;148;
131;148;
132;145;
133;152;
134;146;
135;146;
136;149;
137;145;
138;148;
139;145;
140;145;
141;148;
142;146;
143;144;
144;146;
145;144;
146;147;
147;148;
148;145;
149;145;
150;146;
151;146;
152;145;
153;143;
154;147;
155;146;
156;144;
157;144;
158;144;
159;144;
160;145;
161;143;
162;145;
163;146;
164;144;
165;145;
166;145;
167;147;
168;147;
169;143;
170;146;
171;145;
172;145;
173;145;
174;143;
175;144;
176;146;
177;143;
178;146;
179;146;
180;144;
181;146;
182;145;
183;143;
184;145;
185;141;
186;146;
187;145;
188;143;
189;145;
190;143;
191;144;
192;148;
193;143;
194;146;
195;145;
196;144;
197;145;
198;144;
199;143;
200;0;
0;0;
1;167;
2;163;
3;159;
4;160;
5;161;
6;159;
7;161;
8;163;
9;159;
10;162;
11;163;
12;162;
13;168;
14;167;
15;172;
16;176;
17;182;
18;199;
19;229;
20;292;
21;457;
22;852;
23;1023;
24;1023;
25;1023;
26;1023;
27;1023;
28;1023;
29;1023;
30;1023;
31;1023;
32;1023;
33;994;
34;718;
35;538;
36;414;
37;345;
38;300;
39;280;
40;267;
41;254;
42;254;
43;248;
44;247;
45;252;
46;246;
47;245;
48;242;
49;236;
50;236;
51;230;
52;225;
53;223;
54;220;
55;219;
56;218;
57;215;
58;217;
59;216;
60;218;
61;219;
62;219;
63;218;
64;222;
65;213;
66;217;
67;213;
68;210;
69;212;
70;206;
71;207;
72;211;
73;208;
74;216;
75;219;
76;223;
77;233;
78;238;
79;258;
80;281;
81;309;
82;337;
83;354;
84;355;
85;330;
86;288;
87;249;
88;215;
89;186;
90;177;
91;166;
92;161;
93;163;
94;161;
95;159;
96;160;
97;158;
98;156;
99;157;
100;154;
101;159;
102;157;
103;154;
104;155;
105;152;
106;154;
107;152;
108;152;
109;154;
110;151;
111;151;
112;153;
113;149;
114;151;
115;153;
116;150;
117;152;
118;149;
119;151;
120;150;
121;149;
122;149;
123;148;
124;148;
125;148;
126;146;
127;148;
128;150;
129;146;
130;147;
131;148;
132;146;
133;152;
134;146;
135;147;
136;148;
137;146;
138;148;
139;146;
140;145;
141;148;
142;146;
143;144;
144;147;
145;144;
146;147;
147;147;
148;144;
149;146;
150;145;
151;146;
152;146;
153;145;
154;147;
155;145;
156;145;
157;145;
158;145;
159;143;
160;145;
161;144;
162;146;
163;145;
164;144;
165;146;
166;144;
167;146;
168;146;
169;143;
170;147;
171;144;
172;144;
173;147;
174;143;
175;143;
176;146;
177;144;
178;147;
179;145;
180;144;
181;145;
182;145;
183;143;
184;144;
185;142;
186;146;
187;144;
188;143;
189;145;
190;143;
191;145;
192;148;
193;144;
194;146;
195;145;
196;143;
197;145;
198;146;
199;143;
200;0;
0;0;
1;167;
2;163;
3;159;
4;161;
5;162;
6;159;
7;162;
8;164;
9;160;
10;165;
11;163;
12;162;
13;168;
14;168;
15;172;
16;178;
17;182;
18;199;
19;229;
20;291;
21;456;
22;848;
23;1023;
24;1023;
25;1023;
26;1023;
27;1023;
28;1023;
29;1023;
30;1023;
31;1023;
32;1023;
33;998;
34;718;
35;539;
36;417;
37;344;
38;301;
39;281;
40;266;
41;256;
42;255;
43;248;
44;249;
45;251;
46;249;
47;246;
48;242;
49;237;
50;236;
51;229;
52;224;
53;225;
54;218;
55;217;
56;219;
57;218;
58;221;
59;221;
60;218;
61;221;
62;217;
63;220;
64;220;
65;214;
66;217;
67;213;
68;210;
69;211;
70;207;
71;208;
72;210;
73;209;
74;216;
75;218;
76;224;
77;230;
78;240;
79;262;
80;284;
81;307;
82;340;
83;358;
84;355;
85;330;
86;288;
87;247;
88;215;
89;187;
90;177;
91;166;
92;161;
93;163;
94;162;
95;157;
96;160;
97;157;
98;157;
99;159;
100;156;
101;159;
102;156;
103;155;
104;155;
105;153;
106;156;
107;154;
108;154;
109;155;
110;150;
111;151;
112;154;
113;149;
114;150;
115;153;
116;150;
117;154;
118;150;
119;152;
120;150;
121;148;
122;150;
123;149;
124;149;
125;151;
126;147;
127;149;
128;151;
129;147;
130;148;
131;149;
132;147;
133;153;
134;145;
135;146;
136;149;
137;147;
138;149;
139;147;
140;147;
141;149;
142;145;
143;146;
144;148;
145;144;
146;149;
147;147;
148;145;
149;146;
150;146;
151;145;
152;146;
153;143;
154;147;
155;146;
156;146;
157;145;
158;144;
159;144;
160;144;
161;144;
162;145;
163;146;
164;146;
165;147;
166;146;
167;146;
168;148;
169;142;
170;146;
171;145;
172;145;
173;147;
174;144;
175;144;
176;146;
177;143;
178;147;
179;145;
180;144;
181;146;
182;147;
183;144;
184;146;
185;142;
186;147;
187;146;
188;144;
189;146;
190;144;
191;145;
192;149;
193;144;
194;147;
195;145;
196;144;
197;145;
198;145;
199;144;
200;0;
0;0;
1;167;
2;161;
3;158;
4;159;
5;160;
6;158;
7;161;
8;164;
9;160;
10;163;
11;162;
12;162;
13;168;
14;166;
15;173;
16;177;
17;180;
18;199;
19;228;
20;295;
21;456;
22;849;
23;1023;
24;1023;
25;1023;
26;1023;
27;1023;
28;1023;
29;1023;
30;1023;
31;1023;
32;1023;
33;991;
34;718;
35;537;
36;410;
37;344;
38;304;
39;281;
40;265;
41;254;
42;252;
43;249;
44;249;
45;250;
46;244;
47;247;
48;242;
49;235;
50;235;
51;230;
52;225;
53;224;
54;218;
55;219;
56;218;
57;217;
58;219;
59;220;
60;223;
61;221;
62;218;
63;220;
64;223;
65;214;
66;217;
67;212;
68;211;
69;210;
70;207;
71;206;
72;209;
73;211;
74;218;
75;219;
76;224;
77;229;
78;238;
79;259;
80;283;
81;307;
82;339;
83;353;
84;361;
85;331;
86;289;
87;247;
88;214;
89;189;
90;177;
91;167;
92;161;
93;163;
94;161;
95;158;
96;160;
97;158;
98;157;
99;157;
100;154;
101;159;
102;156;
103;154;
104;155;
105;152;
106;155;
107;153;
108;153;
109;154;
110;150;
111;150;
112;152;
113;147;
114;151;
115;152;
116;149;
117;153;
118;150;
119;151;
120;150;
121;148;
122;149;
123;149;
124;148;
125;150;
126;147;
127;150;
128;151;
129;148;
130;147;
131;148;
132;145;
133;152;
134;146;
135;146;
136;148;
137;145;
138;148;
139;147;
140;146;
141;148;
142;147;
143;144;
144;148;
145;144;
146;148;
147;147;
148;144;
149;146;
150;145;
151;146;
152;144;
153;144;
154;147;
155;147;
156;144;
157;145;
158;145;
159;144;
160;146;
161;144;
162;146;
163;146;
164;145;
165;147;
166;143;
167;145;
168;147;
169;143;
170;146;
171;144;
172;145;
173;146;
174;143;
175;143;
176;145;
177;144;
178;146;
179;144;
180;143;
181;147;
182;146;
183;144;
184;146;
185;142;
186;147;
187;145;
188;143;
189;146;
190;143;
191;145;
192;147;
193;143;
194;146;
195;144;
196;143;
197;145;
198;145;
199;143;
200;0;
0;0;
1;167;
2;161;
3;160;
4;161;
5;161;
6;159;
7;163;
8;162;
9;159;
10;164;
11;162;
12;162;
13;167;
14;167;
15;171;
16;175;
17;181;
18;201;
19;228;
20;292;
21;457;
22;852;
23;1023;
24;1023;
25;1023;
26;1023;
27;1023;
28;1023;
29;1023;
30;1023;
31;1023;
32;1023;
33;999;
34;722;
35;535;
36;416;
37;344;
38;302;
39;280;
40;263;
41;254;
42;254;
43;247;
44;247;
45;251;
46;248;
47;245;
48;243;
49;237;
50;235;
51;230;
52;226;
53;224;
54;219;
55;219;
56;219;
57;216;
58;220;
59;218;
60;218;
61;221;
62;217;
63;220;
64;221;
65;215;
66;215;
67;214;
68;212;
69;210;
70;208;
71;206;
72;212;
73;208;
74;217;
75;218;
76;223;
77;229;
78;238;
79;258;
80;283;
81;307;
82;344;
83;354;
84;356;
85;330;
86;286;
87;250;
88;215;
89;188;
90;178;
91;167;
92;161;
93;164;
94;161;
95;158;
96;160;
97;157;
98;157;
99;157;
100;155;
101;159;
102;157;
103;155;
104;155;
105;152;
106;154;
107;151;
108;152;
109;153;
110;150;
111;151;
112;154;
113;149;
114;150;
115;152;
116;150;
117;153;
118;149;
119;150;
120;148;
121;147;
122;149;
123;149;
124;148;
125;148;
126;147;
127;148;
128;151;
129;147;
130;148;
131;149;
132;146;
133;153;
134;146;
135;146;
136;148;
137;146;
138;148;
139;146;
140;145;
141;148;
142;145;
143;145;
144;147;
145;143;
146;148;
147;146;
148;144;
149;146;
150;146;
151;147;
152;147;
153;144;
154;147;
155;145;
156;144;
157;146;
158;145;
159;144;
160;145;
161;144;
162;145;
163;146;
164;145;
165;147;
166;143;
167;146;
168;147;
169;142;
170;146;
171;144;
172;144;
173;148;
174;143;
175;143;
176;146;
177;143;
178;147;
179;145;
180;144;
181;145;
182;146;
183;144;
184;145;
185;142;
186;146;
187;145;
188;143;
189;145;
190;143;
191;145;
192;148;
193;143;
194;146;
195;144;
196;143;
197;145;
198;145;
199;144;
200;0;
