31052021184543
ind;val
0;129
1;129
2;957
3;972
4;968
5;967
6;971
7;973
8;965
9;966
10;963
11;973
12;966
13;972
14;973
15;974
16;976
17;969
18;973
19;967
20;962
21;974
22;974
23;966
24;971
25;966
26;972
27;977
28;969
29;972
30;971
31;965
32;977
33;967
34;971
35;975
36;972
37;969
38;963
39;959
40;958
41;948
42;946
43;948
44;951
45;949
46;943
47;949
48;944
49;957
50;946
51;952
52;948
53;942
54;949
55;951
56;944
57;944
58;945
59;944
60;946
61;944
62;941
63;946
64;947
65;935
66;937
67;942
68;938
69;944
70;943
71;944
72;948
73;948
74;949
75;945
76;950
77;950
78;946
79;963
80;957
81;957
82;960
83;958
84;960
85;951
86;953
87;959
88;955
89;956
90;956
91;958
92;957
93;960
94;960
95;960
96;963
97;959
98;962
99;966
