ind;val;datetime
0;0;29062021165457
1;145;29062021165457
2;147;29062021165457
3;146;29062021165457
4;147;29062021165457
5;149;29062021165457
6;148;29062021165457
7;151;29062021165457
8;154;29062021165457
9;154;29062021165457
10;160;29062021165457
11;160;29062021165457
12;163;29062021165457
13;172;29062021165457
14;178;29062021165457
15;192;29062021165457
16;213;29062021165457
17;247;29062021165457
18;323;29062021165457
19;488;29062021165457
20;841;29062021165457
21;1023;29062021165457
22;1023;29062021165457
23;1023;29062021165457
24;1023;29062021165457
25;1016;29062021165457
26;935;29062021165457
27;937;29062021165457
28;1007;29062021165457
29;1023;29062021165457
30;1023;29062021165457
31;1023;29062021165457
32;1023;29062021165457
33;1023;29062021165457
34;1023;29062021165457
35;1023;29062021165457
36;1023;29062021165457
37;1023;29062021165457
38;1023;29062021165457
39;1023;29062021165457
40;1012;29062021165457
41;904;29062021165457
42;816;29062021165457
43;746;29062021165457
44;704;29062021165457
45;673;29062021165457
46;655;29062021165457
47;645;29062021165457
48;644;29062021165457
49;638;29062021165457
50;643;29062021165457
51;651;29062021165457
52;657;29062021165457
53;668;29062021165457
54;683;29062021165457
55;701;29062021165457
56;717;29062021165457
57;741;29062021165457
58;762;29062021165457
59;781;29062021165457
60;808;29062021165457
61;827;29062021165457
62;835;29062021165457
63;856;29062021165457
64;866;29062021165457
65;870;29062021165457
66;879;29062021165457
67;883;29062021165457
68;875;29062021165457
69;869;29062021165457
70;847;29062021165457
71;842;29062021165457
72;832;29062021165457
73;799;29062021165457
74;786;29062021165457
75;745;29062021165457
76;730;29062021165457
77;709;29062021165457
78;685;29062021165457
79;655;29062021165457
80;629;29062021165457
81;601;29062021165457
82;589;29062021165457
83;573;29062021165457
84;556;29062021165457
85;545;29062021165457
86;538;29062021165457
87;530;29062021165457
88;521;29062021165457
89;510;29062021165457
90;503;29062021165457
91;493;29062021165457
92;472;29062021165457
93;458;29062021165457
94;446;29062021165457
95;425;29062021165457
96;418;29062021165457
97;400;29062021165457
98;391;29062021165457
99;374;29062021165457
100;367;29062021165457
101;360;29062021165457
102;352;29062021165457
103;340;29062021165457
104;333;29062021165457
105;324;29062021165457
106;318;29062021165457
107;307;29062021165457
108;301;29062021165457
109;295;29062021165457
110;287;29062021165457
111;279;29062021165457
112;271;29062021165457
113;264;29062021165457
114;261;29062021165457
115;257;29062021165457
116;254;29062021165457
117;252;29062021165457
118;245;29062021165457
119;240;29062021165457
120;232;29062021165457
121;229;29062021165457
122;227;29062021165457
123;223;29062021165457
124;219;29062021165457
125;215;29062021165457
126;207;29062021165457
127;206;29062021165457
128;204;29062021165457
129;197;29062021165457
130;198;29062021165457
131;193;29062021165457
132;187;29062021165457
133;190;29062021165457
134;183;29062021165457
135;180;29062021165457
136;177;29062021165457
137;174;29062021165457
138;173;29062021165457
139;172;29062021165457
140;166;29062021165457
141;167;29062021165457
142;164;29062021165457
143;161;29062021165457
144;161;29062021165457
145;158;29062021165457
146;159;29062021165457
147;157;29062021165457
148;153;29062021165457
149;152;29062021165457
150;151;29062021165457
151;150;29062021165457
152;148;29062021165457
153;147;29062021165457
154;147;29062021165457
155;145;29062021165457
156;143;29062021165457
157;144;29062021165457
158;141;29062021165457
159;141;29062021165457
160;142;29062021165457
161;141;29062021165457
162;142;29062021165457
163;140;29062021165457
164;140;29062021165457
165;141;29062021165457
166;138;29062021165457
167;138;29062021165457
168;138;29062021165457
169;134;29062021165457
170;137;29062021165457
171;134;29062021165457
172;132;29062021165457
173;135;29062021165457
174;132;29062021165457
175;131;29062021165457
176;134;29062021165457
177;130;29062021165457
178;133;29062021165457
179;131;29062021165457
180;130;29062021165457
181;131;29062021165457
182;131;29062021165457
183;129;29062021165457
184;131;29062021165457
185;127;29062021165457
186;131;29062021165457
187;129;29062021165457
188;127;29062021165457
189;129;29062021165457
190;128;29062021165457
191;129;29062021165457
192;131;29062021165457
193;128;29062021165457
194;130;29062021165457
195;128;29062021165457
196;126;29062021165457
197;128;29062021165457
198;127;29062021165457
199;125;29062021165457
200;0;29062021165457
0;0;29062021165457
1;141;29062021165457
2;144;29062021165457
3;142;29062021165457
4;143;29062021165457
5;146;29062021165457
6;146;29062021165457
7;149;29062021165457
8;151;29062021165457
9;151;29062021165457
10;157;29062021165457
11;156;29062021165457
12;159;29062021165457
13;172;29062021165457
14;177;29062021165457
15;190;29062021165457
16;210;29062021165457
17;245;29062021165457
18;326;29062021165457
19;492;29062021165457
20;844;29062021165457
21;1023;29062021165457
22;1023;29062021165457
23;1023;29062021165457
24;1023;29062021165457
25;993;29062021165457
26;909;29062021165457
27;904;29062021165457
28;973;29062021165457
29;1023;29062021165457
30;1023;29062021165457
31;1023;29062021165457
32;1023;29062021165457
33;1023;29062021165457
34;1023;29062021165457
35;1023;29062021165457
36;1023;29062021165457
37;1023;29062021165457
38;1023;29062021165457
39;1023;29062021165457
40;1019;29062021165457
41;926;29062021165457
42;833;29062021165457
43;767;29062021165457
44;715;29062021165457
45;683;29062021165457
46;667;29062021165457
47;657;29062021165457
48;650;29062021165457
49;651;29062021165457
50;650;29062021165457
51;660;29062021165457
52;665;29062021165457
53;683;29062021165457
54;696;29062021165457
55;710;29062021165457
56;727;29062021165457
57;748;29062021165457
58;775;29062021165457
59;788;29062021165457
60;815;29062021165457
61;837;29062021165457
62;846;29062021165457
63;872;29062021165457
64;875;29062021165457
65;886;29062021165457
66;891;29062021165457
67;893;29062021165457
68;882;29062021165457
69;879;29062021165457
70;862;29062021165457
71;852;29062021165457
72;844;29062021165457
73;817;29062021165457
74;791;29062021165457
75;758;29062021165457
76;742;29062021165457
77;718;29062021165457
78;693;29062021165457
79;666;29062021165457
80;637;29062021165457
81;615;29062021165457
82;597;29062021165457
83;572;29062021165457
84;565;29062021165457
85;549;29062021165457
86;545;29062021165457
87;536;29062021165457
88;528;29062021165457
89;515;29062021165457
90;510;29062021165457
91;499;29062021165457
92;477;29062021165457
93;462;29062021165457
94;446;29062021165457
95;433;29062021165457
96;419;29062021165457
97;403;29062021165457
98;391;29062021165457
99;382;29062021165457
100;371;29062021165457
101;365;29062021165457
102;354;29062021165457
103;344;29062021165457
104;336;29062021165457
105;325;29062021165457
106;322;29062021165457
107;309;29062021165457
108;302;29062021165457
109;296;29062021165457
110;286;29062021165457
111;279;29062021165457
112;272;29062021165457
113;262;29062021165457
114;259;29062021165457
115;259;29062021165457
116;252;29062021165457
117;250;29062021165457
118;241;29062021165457
119;239;29062021165457
120;235;29062021165457
121;228;29062021165457
122;228;29062021165457
123;222;29062021165457
124;216;29062021165457
125;214;29062021165457
126;206;29062021165457
127;203;29062021165457
128;203;29062021165457
129;196;29062021165457
130;194;29062021165457
131;192;29062021165457
132;186;29062021165457
133;186;29062021165457
134;180;29062021165457
135;180;29062021165457
136;176;29062021165457
137;171;29062021165457
138;171;29062021165457
139;170;29062021165457
140;166;29062021165457
141;166;29062021165457
142;161;29062021165457
143;157;29062021165457
144;158;29062021165457
145;153;29062021165457
146;157;29062021165457
147;153;29062021165457
148;150;29062021165457
149;150;29062021165457
150;148;29062021165457
151;147;29062021165457
152;145;29062021165457
153;144;29062021165457
154;144;29062021165457
155;142;29062021165457
156;142;29062021165457
157;141;29062021165457
158;140;29062021165457
159;137;29062021165457
160;138;29062021165457
161;138;29062021165457
162;137;29062021165457
163;136;29062021165457
164;135;29062021165457
165;137;29062021165457
166;134;29062021165457
167;135;29062021165457
168;134;29062021165457
169;128;29062021165457
170;132;29062021165457
171;130;29062021165457
172;130;29062021165457
173;132;29062021165457
174;129;29062021165457
175;129;29062021165457
176;130;29062021165457
177;127;29062021165457
178;128;29062021165457
179;127;29062021165457
180;127;29062021165457
181;127;29062021165457
182;128;29062021165457
183;127;29062021165457
184;126;29062021165457
185;124;29062021165457
186;128;29062021165457
187;126;29062021165457
188;125;29062021165457
189;126;29062021165457
190;123;29062021165457
191;125;29062021165457
192;127;29062021165457
193;123;29062021165457
194;125;29062021165457
195;123;29062021165457
196;123;29062021165457
197;123;29062021165457
198;124;29062021165457
199;122;29062021165457
200;0;29062021165457
0;0;29062021165457
1;141;29062021165457
2;144;29062021165457
3;143;29062021165457
4;145;29062021165457
5;145;29062021165457
6;145;29062021165457
7;148;29062021165457
8;151;29062021165457
9;151;29062021165457
10;156;29062021165457
11;157;29062021165457
12;163;29062021165457
13;170;29062021165457
14;175;29062021165457
15;190;29062021165457
16;211;29062021165457
17;244;29062021165457
18;328;29062021165457
19;492;29062021165457
20;842;29062021165457
21;1023;29062021165457
22;1023;29062021165457
23;1023;29062021165457
24;1023;29062021165457
25;996;29062021165457
26;911;29062021165457
27;907;29062021165457
28;975;29062021165457
29;1023;29062021165457
30;1023;29062021165457
31;1023;29062021165457
32;1023;29062021165457
33;1023;29062021165457
34;1023;29062021165457
35;1023;29062021165457
36;1023;29062021165457
37;1023;29062021165457
38;1023;29062021165457
39;1023;29062021165457
40;1020;29062021165457
41;926;29062021165457
42;834;29062021165457
43;765;29062021165457
44;714;29062021165457
45;685;29062021165457
46;663;29062021165457
47;656;29062021165457
48;648;29062021165457
49;649;29062021165457
50;647;29062021165457
51;661;29062021165457
52;660;29062021165457
53;677;29062021165457
54;695;29062021165457
55;708;29062021165457
56;730;29062021165457
57;745;29062021165457
58;774;29062021165457
59;789;29062021165457
60;815;29062021165457
61;837;29062021165457
62;847;29062021165457
63;871;29062021165457
64;875;29062021165457
65;883;29062021165457
66;894;29062021165457
67;888;29062021165457
68;888;29062021165457
69;877;29062021165457
70;862;29062021165457
71;853;29062021165457
72;838;29062021165457
73;808;29062021165457
74;792;29062021165457
75;760;29062021165457
76;745;29062021165457
77;714;29062021165457
78;691;29062021165457
79;666;29062021165457
80;641;29062021165457
81;611;29062021165457
82;596;29062021165457
83;574;29062021165457
84;561;29062021165457
85;550;29062021165457
86;545;29062021165457
87;536;29062021165457
88;524;29062021165457
89;518;29062021165457
90;508;29062021165457
91;496;29062021165457
92;479;29062021165457
93;463;29062021165457
94;448;29062021165457
95;429;29062021165457
96;418;29062021165457
97;406;29062021165457
98;389;29062021165457
99;381;29062021165457
100;372;29062021165457
101;366;29062021165457
102;353;29062021165457
103;343;29062021165457
104;336;29062021165457
105;325;29062021165457
106;322;29062021165457
107;308;29062021165457
108;303;29062021165457
109;296;29062021165457
110;284;29062021165457
111;281;29062021165457
112;274;29062021165457
113;262;29062021165457
114;259;29062021165457
115;258;29062021165457
116;253;29062021165457
117;249;29062021165457
118;240;29062021165457
119;238;29062021165457
120;232;29062021165457
121;227;29062021165457
122;225;29062021165457
123;221;29062021165457
124;214;29062021165457
125;212;29062021165457
126;207;29062021165457
127;203;29062021165457
128;203;29062021165457
129;195;29062021165457
130;193;29062021165457
131;191;29062021165457
132;185;29062021165457
133;188;29062021165457
134;181;29062021165457
135;179;29062021165457
136;176;29062021165457
137;171;29062021165457
138;172;29062021165457
139;168;29062021165457
140;164;29062021165457
141;164;29062021165457
142;161;29062021165457
143;157;29062021165457
144;158;29062021165457
145;153;29062021165457
146;155;29062021165457
147;152;29062021165457
148;149;29062021165457
149;148;29062021165457
150;147;29062021165457
151;148;29062021165457
152;146;29062021165457
153;143;29062021165457
154;144;29062021165457
155;141;29062021165457
156;141;29062021165457
157;140;29062021165457
158;139;29062021165457
159;138;29062021165457
160;138;29062021165457
161;136;29062021165457
162;139;29062021165457
163;136;29062021165457
164;135;29062021165457
165;136;29062021165457
166;133;29062021165457
167;134;29062021165457
168;133;29062021165457
169;130;29062021165457
170;133;29062021165457
171;131;29062021165457
172;130;29062021165457
173;131;29062021165457
174;128;29062021165457
175;128;29062021165457
176;130;29062021165457
177;126;29062021165457
178;129;29062021165457
179;128;29062021165457
180;127;29062021165457
181;128;29062021165457
182;127;29062021165457
183;126;29062021165457
184;126;29062021165457
185;124;29062021165457
186;126;29062021165457
187;125;29062021165457
188;124;29062021165457
189;125;29062021165457
190;124;29062021165457
191;125;29062021165457
192;128;29062021165457
193;124;29062021165457
194;125;29062021165457
195;125;29062021165457
196;123;29062021165457
197;124;29062021165457
198;123;29062021165457
199;121;29062021165457
200;0;29062021165457
0;0;29062021165457
1;141;29062021165457
2;145;29062021165457
3;143;29062021165457
4;144;29062021165457
5;145;29062021165457
6;145;29062021165457
7;147;29062021165457
8;151;29062021165457
9;149;29062021165457
10;158;29062021165457
11;157;29062021165457
12;160;29062021165457
13;170;29062021165457
14;175;29062021165457
15;191;29062021165457
16;209;29062021165457
17;245;29062021165457
18;327;29062021165457
19;496;29062021165457
20;845;29062021165457
21;1023;29062021165457
22;1023;29062021165457
23;1023;29062021165457
24;1023;29062021165457
25;991;29062021165457
26;903;29062021165457
27;901;29062021165457
28;967;29062021165457
29;1023;29062021165457
30;1023;29062021165457
31;1023;29062021165457
32;1023;29062021165457
33;1023;29062021165457
34;1023;29062021165457
35;1023;29062021165457
36;1023;29062021165457
37;1023;29062021165457
38;1023;29062021165457
39;1023;29062021165457
40;1020;29062021165457
41;930;29062021165457
42;845;29062021165457
43;767;29062021165457
44;722;29062021165457
45;693;29062021165457
46;665;29062021165457
47;657;29062021165457
48;653;29062021165457
49;651;29062021165457
50;652;29062021165457
51;663;29062021165457
52;668;29062021165457
53;684;29062021165457
54;695;29062021165457
55;710;29062021165457
56;726;29062021165457
57;750;29062021165457
58;779;29062021165457
59;793;29062021165457
60;812;29062021165457
61;840;29062021165457
62;850;29062021165457
63;869;29062021165457
64;880;29062021165457
65;886;29062021165457
66;895;29062021165457
67;894;29062021165457
68;886;29062021165457
69;878;29062021165457
70;862;29062021165457
71;855;29062021165457
72;836;29062021165457
73;810;29062021165457
74;795;29062021165457
75;763;29062021165457
76;743;29062021165457
77;718;29062021165457
78;693;29062021165457
79;667;29062021165457
80;638;29062021165457
81;614;29062021165457
82;600;29062021165457
83;576;29062021165457
84;564;29062021165457
85;553;29062021165457
86;546;29062021165457
87;534;29062021165457
88;529;29062021165457
89;517;29062021165457
90;510;29062021165457
91;495;29062021165457
92;477;29062021165457
93;463;29062021165457
94;450;29062021165457
95;432;29062021165457
96;419;29062021165457
97;405;29062021165457
98;392;29062021165457
99;384;29062021165457
100;374;29062021165457
101;369;29062021165457
102;353;29062021165457
103;346;29062021165457
104;334;29062021165457
105;326;29062021165457
106;321;29062021165457
107;311;29062021165457
108;302;29062021165457
109;296;29062021165457
110;285;29062021165457
111;280;29062021165457
112;274;29062021165457
113;266;29062021165457
114;261;29062021165457
115;259;29062021165457
116;252;29062021165457
117;251;29062021165457
118;243;29062021165457
119;240;29062021165457
120;232;29062021165457
121;229;29062021165457
122;225;29062021165457
123;223;29062021165457
124;216;29062021165457
125;212;29062021165457
126;207;29062021165457
127;207;29062021165457
128;201;29062021165457
129;195;29062021165457
130;194;29062021165457
131;191;29062021165457
132;186;29062021165457
133;187;29062021165457
134;181;29062021165457
135;177;29062021165457
136;176;29062021165457
137;171;29062021165457
138;172;29062021165457
139;168;29062021165457
140;164;29062021165457
141;164;29062021165457
142;161;29062021165457
143;158;29062021165457
144;158;29062021165457
145;154;29062021165457
146;155;29062021165457
147;154;29062021165457
148;150;29062021165457
149;149;29062021165457
150;149;29062021165457
151;148;29062021165457
152;147;29062021165457
153;143;29062021165457
154;146;29062021165457
155;142;29062021165457
156;141;29062021165457
157;141;29062021165457
158;140;29062021165457
159;138;29062021165457
160;139;29062021165457
161;136;29062021165457
162;138;29062021165457
163;137;29062021165457
164;135;29062021165457
165;137;29062021165457
166;134;29062021165457
167;134;29062021165457
168;135;29062021165457
169;131;29062021165457
170;133;29062021165457
171;131;29062021165457
172;130;29062021165457
173;131;29062021165457
174;130;29062021165457
175;128;29062021165457
176;130;29062021165457
177;127;29062021165457
178;130;29062021165457
179;128;29062021165457
180;127;29062021165457
181;128;29062021165457
182;127;29062021165457
183;125;29062021165457
184;128;29062021165457
185;124;29062021165457
186;126;29062021165457
187;126;29062021165457
188;124;29062021165457
189;126;29062021165457
190;124;29062021165457
191;124;29062021165457
192;128;29062021165457
193;123;29062021165457
194;125;29062021165457
195;124;29062021165457
196;123;29062021165457
197;124;29062021165457
198;124;29062021165457
199;123;29062021165457
200;0;29062021165457
0;0;29062021165457
1;141;29062021165457
2;144;29062021165457
3;142;29062021165457
4;143;29062021165457
5;146;29062021165457
6;146;29062021165457
7;148;29062021165457
8;151;29062021165457
9;150;29062021165457
10;158;29062021165457
11;157;29062021165457
12;162;29062021165457
13;169;29062021165457
14;174;29062021165457
15;189;29062021165457
16;210;29062021165457
17;246;29062021165457
18;325;29062021165457
19;488;29062021165457
20;835;29062021165457
21;1023;29062021165457
22;1023;29062021165457
23;1023;29062021165457
24;1023;29062021165457
25;1000;29062021165457
26;913;29062021165457
27;910;29062021165457
28;975;29062021165457
29;1023;29062021165457
30;1023;29062021165457
31;1023;29062021165457
32;1023;29062021165457
33;1023;29062021165457
34;1023;29062021165457
35;1023;29062021165457
36;1023;29062021165457
37;1023;29062021165457
38;1023;29062021165457
39;1023;29062021165457
40;1022;29062021165457
41;922;29062021165457
42;835;29062021165457
43;757;29062021165457
44;716;29062021165457
45;683;29062021165457
46;664;29062021165457
47;647;29062021165457
48;647;29062021165457
49;646;29062021165457
50;649;29062021165457
51;658;29062021165457
52;659;29062021165457
53;681;29062021165457
54;691;29062021165457
55;708;29062021165457
56;725;29062021165457
57;743;29062021165457
58;768;29062021165457
59;784;29062021165457
60;809;29062021165457
61;832;29062021165457
62;840;29062021165457
63;868;29062021165457
64;877;29062021165457
65;879;29062021165457
66;892;29062021165457
67;886;29062021165457
68;883;29062021165457
69;871;29062021165457
70;861;29062021165457
71;847;29062021165457
72;835;29062021165457
73;805;29062021165457
74;787;29062021165457
75;766;29062021165457
76;742;29062021165457
77;717;29062021165457
78;687;29062021165457
79;664;29062021165457
80;632;29062021165457
81;614;29062021165457
82;594;29062021165457
83;574;29062021165457
84;558;29062021165457
85;549;29062021165457
86;539;29062021165457
87;536;29062021165457
88;527;29062021165457
89;513;29062021165457
90;509;29062021165457
91;496;29062021165457
92;480;29062021165457
93;460;29062021165457
94;448;29062021165457
95;432;29062021165457
96;422;29062021165457
97;403;29062021165457
98;391;29062021165457
99;379;29062021165457
100;369;29062021165457
101;363;29062021165457
102;350;29062021165457
103;340;29062021165457
104;335;29062021165457
105;328;29062021165457
106;318;29062021165457
107;307;29062021165457
108;296;29062021165457
109;294;29062021165457
110;286;29062021165457
111;279;29062021165457
112;271;29062021165457
113;262;29062021165457
114;259;29062021165457
115;255;29062021165457
116;252;29062021165457
117;250;29062021165457
118;241;29062021165457
119;238;29062021165457
120;233;29062021165457
121;227;29062021165457
122;224;29062021165457
123;220;29062021165457
124;215;29062021165457
125;213;29062021165457
126;204;29062021165457
127;203;29062021165457
128;203;29062021165457
129;195;29062021165457
130;195;29062021165457
131;189;29062021165457
132;186;29062021165457
133;186;29062021165457
134;180;29062021165457
135;176;29062021165457
136;176;29062021165457
137;172;29062021165457
138;172;29062021165457
139;168;29062021165457
140;163;29062021165457
141;165;29062021165457
142;160;29062021165457
143;157;29062021165457
144;158;29062021165457
145;154;29062021165457
146;156;29062021165457
147;153;29062021165457
148;150;29062021165457
149;150;29062021165457
150;149;29062021165457
151;147;29062021165457
152;147;29062021165457
153;144;29062021165457
154;144;29062021165457
155;143;29062021165457
156;141;29062021165457
157;141;29062021165457
158;140;29062021165457
159;139;29062021165457
160;140;29062021165457
161;136;29062021165457
162;138;29062021165457
163;138;29062021165457
164;135;29062021165457
165;137;29062021165457
166;134;29062021165457
167;134;29062021165457
168;134;29062021165457
169;130;29062021165457
170;131;29062021165457
171;130;29062021165457
172;130;29062021165457
173;132;29062021165457
174;129;29062021165457
175;129;29062021165457
176;130;29062021165457
177;128;29062021165457
178;129;29062021165457
179;129;29062021165457
180;127;29062021165457
181;128;29062021165457
182;126;29062021165457
183;125;29062021165457
184;127;29062021165457
185;124;29062021165457
186;126;29062021165457
187;126;29062021165457
188;124;29062021165457
189;125;29062021165457
190;123;29062021165457
191;124;29062021165457
192;128;29062021165457
193;122;29062021165457
194;125;29062021165457
195;125;29062021165457
196;123;29062021165457
197;124;29062021165457
198;124;29062021165457
199;122;29062021165457
200;0;29062021165457
0;0;29062021165457
1;141;29062021165457
2;144;29062021165457
3;143;29062021165457
4;144;29062021165457
5;145;29062021165457
6;145;29062021165457
7;149;29062021165457
8;150;29062021165457
9;151;29062021165457
10;156;29062021165457
11;159;29062021165457
12;161;29062021165457
13;170;29062021165457
14;177;29062021165457
15;190;29062021165457
16;209;29062021165457
17;245;29062021165457
18;322;29062021165457
19;490;29062021165457
20;838;29062021165457
21;1023;29062021165457
22;1023;29062021165457
23;1023;29062021165457
24;1023;29062021165457
25;998;29062021165457
26;912;29062021165457
27;907;29062021165457
28;972;29062021165457
29;1023;29062021165457
30;1023;29062021165457
31;1023;29062021165457
32;1023;29062021165457
33;1023;29062021165457
34;1023;29062021165457
35;1023;29062021165457
36;1023;29062021165457
37;1023;29062021165457
38;1023;29062021165457
39;1023;29062021165457
40;1023;29062021165457
41;928;29062021165457
42;847;29062021165457
43;770;29062021165457
44;718;29062021165457
45;687;29062021165457
46;667;29062021165457
47;649;29062021165457
48;651;29062021165457
49;651;29062021165457
50;653;29062021165457
51;661;29062021165457
52;663;29062021165457
53;680;29062021165457
54;692;29062021165457
55;706;29062021165457
56;729;29062021165457
57;745;29062021165457
58;767;29062021165457
59;788;29062021165457
60;817;29062021165457
61;835;29062021165457
62;843;29062021165457
63;867;29062021165457
64;875;29062021165457
65;886;29062021165457
66;892;29062021165457
67;892;29062021165457
68;886;29062021165457
69;878;29062021165457
70;862;29062021165457
71;853;29062021165457
72;837;29062021165457
73;810;29062021165457
74;792;29062021165457
75;761;29062021165457
76;739;29062021165457
77;718;29062021165457
78;693;29062021165457
79;664;29062021165457
80;641;29062021165457
81;612;29062021165457
82;600;29062021165457
83;575;29062021165457
84;568;29062021165457
85;550;29062021165457
86;542;29062021165457
87;537;29062021165457
88;529;29062021165457
89;516;29062021165457
90;508;29062021165457
91;495;29062021165457
92;478;29062021165457
93;467;29062021165457
94;450;29062021165457
95;429;29062021165457
96;419;29062021165457
97;402;29062021165457
98;391;29062021165457
99;383;29062021165457
100;368;29062021165457
101;368;29062021165457
102;353;29062021165457
103;342;29062021165457
104;334;29062021165457
105;327;29062021165457
106;320;29062021165457
107;311;29062021165457
108;305;29062021165457
109;295;29062021165457
110;286;29062021165457
111;280;29062021165457
112;274;29062021165457
113;266;29062021165457
114;261;29062021165457
115;260;29062021165457
116;252;29062021165457
117;251;29062021165457
118;244;29062021165457
119;239;29062021165457
120;233;29062021165457
121;228;29062021165457
122;229;29062021165457
123;223;29062021165457
124;216;29062021165457
125;213;29062021165457
126;207;29062021165457
127;202;29062021165457
128;202;29062021165457
129;197;29062021165457
130;195;29062021165457
131;190;29062021165457
132;187;29062021165457
133;187;29062021165457
134;180;29062021165457
135;176;29062021165457
136;177;29062021165457
137;172;29062021165457
138;171;29062021165457
139;168;29062021165457
140;164;29062021165457
141;165;29062021165457
142;161;29062021165457
143;159;29062021165457
144;159;29062021165457
145;156;29062021165457
146;157;29062021165457
147;154;29062021165457
148;151;29062021165457
149;150;29062021165457
150;148;29062021165457
151;149;29062021165457
152;147;29062021165457
153;144;29062021165457
154;145;29062021165457
155;144;29062021165457
156;142;29062021165457
157;140;29062021165457
158;137;29062021165457
159;139;29062021165457
160;139;29062021165457
161;136;29062021165457
162;138;29062021165457
163;137;29062021165457
164;137;29062021165457
165;137;29062021165457
166;134;29062021165457
167;135;29062021165457
168;135;29062021165457
169;131;29062021165457
170;133;29062021165457
171;131;29062021165457
172;130;29062021165457
173;131;29062021165457
174;130;29062021165457
175;129;29062021165457
176;130;29062021165457
177;128;29062021165457
178;131;29062021165457
179;128;29062021165457
180;127;29062021165457
181;128;29062021165457
182;128;29062021165457
183;126;29062021165457
184;127;29062021165457
185;124;29062021165457
186;127;29062021165457
187;126;29062021165457
188;124;29062021165457
189;126;29062021165457
190;124;29062021165457
191;125;29062021165457
192;127;29062021165457
193;124;29062021165457
194;124;29062021165457
195;124;29062021165457
196;123;29062021165457
197;124;29062021165457
198;125;29062021165457
199;123;29062021165457
200;0;29062021165457
0;0;29062021165457
1;140;29062021165457
2;143;29062021165457
3;143;29062021165457
4;144;29062021165457
5;146;29062021165457
6;145;29062021165457
7;147;29062021165457
8;150;29062021165457
9;149;29062021165457
10;157;29062021165457
11;157;29062021165457
12;160;29062021165457
13;172;29062021165457
14;174;29062021165457
15;189;29062021165457
16;209;29062021165457
17;246;29062021165457
18;327;29062021165457
19;494;29062021165457
20;841;29062021165457
21;1023;29062021165457
22;1023;29062021165457
23;1023;29062021165457
24;1023;29062021165457
25;994;29062021165457
26;910;29062021165457
27;904;29062021165457
28;966;29062021165457
29;1023;29062021165457
30;1023;29062021165457
31;1023;29062021165457
32;1023;29062021165457
33;1023;29062021165457
34;1023;29062021165457
35;1023;29062021165457
36;1023;29062021165457
37;1023;29062021165457
38;1023;29062021165457
39;1023;29062021165457
40;1021;29062021165457
41;932;29062021165457
42;846;29062021165457
43;768;29062021165457
44;719;29062021165457
45;684;29062021165457
46;666;29062021165457
47;656;29062021165457
48;654;29062021165457
49;651;29062021165457
50;655;29062021165457
51;668;29062021165457
52;665;29062021165457
53;677;29062021165457
54;696;29062021165457
55;712;29062021165457
56;729;29062021165457
57;746;29062021165457
58;769;29062021165457
59;786;29062021165457
60;813;29062021165457
61;837;29062021165457
62;850;29062021165457
63;871;29062021165457
64;878;29062021165457
65;886;29062021165457
66;892;29062021165457
67;895;29062021165457
68;887;29062021165457
69;879;29062021165457
70;855;29062021165457
71;851;29062021165457
72;842;29062021165457
73;813;29062021165457
74;794;29062021165457
75;760;29062021165457
76;744;29062021165457
77;720;29062021165457
78;695;29062021165457
79;668;29062021165457
80;638;29062021165457
81;616;29062021165457
82;601;29062021165457
83;577;29062021165457
84;567;29062021165457
85;555;29062021165457
86;543;29062021165457
87;533;29062021165457
88;533;29062021165457
89;516;29062021165457
90;515;29062021165457
91;495;29062021165457
92;480;29062021165457
93;464;29062021165457
94;451;29062021165457
95;433;29062021165457
96;419;29062021165457
97;405;29062021165457
98;397;29062021165457
99;382;29062021165457
100;367;29062021165457
101;366;29062021165457
102;355;29062021165457
103;343;29062021165457
104;337;29062021165457
105;329;29062021165457
106;319;29062021165457
107;312;29062021165457
108;304;29062021165457
109;296;29062021165457
110;286;29062021165457
111;281;29062021165457
112;275;29062021165457
113;267;29062021165457
114;261;29062021165457
115;258;29062021165457
116;254;29062021165457
117;252;29062021165457
118;242;29062021165457
119;239;29062021165457
120;233;29062021165457
121;229;29062021165457
122;226;29062021165457
123;222;29062021165457
124;217;29062021165457
125;216;29062021165457
126;206;29062021165457
127;204;29062021165457
128;203;29062021165457
129;197;29062021165457
130;193;29062021165457
131;191;29062021165457
132;186;29062021165457
133;187;29062021165457
134;182;29062021165457
135;176;29062021165457
136;177;29062021165457
137;172;29062021165457
138;170;29062021165457
139;169;29062021165457
140;166;29062021165457
141;165;29062021165457
142;160;29062021165457
143;157;29062021165457
144;159;29062021165457
145;154;29062021165457
146;156;29062021165457
147;153;29062021165457
148;150;29062021165457
149;150;29062021165457
150;148;29062021165457
151;148;29062021165457
152;145;29062021165457
153;144;29062021165457
154;144;29062021165457
155;142;29062021165457
156;140;29062021165457
157;140;29062021165457
158;139;29062021165457
159;138;29062021165457
160;138;29062021165457
161;136;29062021165457
162;137;29062021165457
163;137;29062021165457
164;134;29062021165457
165;137;29062021165457
166;134;29062021165457
167;133;29062021165457
168;134;29062021165457
169;129;29062021165457
170;132;29062021165457
171;131;29062021165457
172;129;29062021165457
173;131;29062021165457
174;129;29062021165457
175;128;29062021165457
176;129;29062021165457
177;126;29062021165457
178;129;29062021165457
179;128;29062021165457
180;127;29062021165457
181;129;29062021165457
182;127;29062021165457
183;125;29062021165457
184;126;29062021165457
185;123;29062021165457
186;127;29062021165457
187;125;29062021165457
188;123;29062021165457
189;126;29062021165457
190;123;29062021165457
191;124;29062021165457
192;126;29062021165457
193;124;29062021165457
194;125;29062021165457
195;124;29062021165457
196;123;29062021165457
197;124;29062021165457
198;124;29062021165457
199;123;29062021165457
200;0;29062021165457
0;0;29062021165457
1;141;29062021165457
2;143;29062021165457
3;143;29062021165457
4;143;29062021165457
5;146;29062021165457
6;146;29062021165457
7;147;29062021165457
8;152;29062021165457
9;153;29062021165457
10;158;29062021165457
11;159;29062021165457
12;161;29062021165457
13;170;29062021165457
14;176;29062021165457
15;190;29062021165457
16;210;29062021165457
17;246;29062021165457
18;328;29062021165457
19;491;29062021165457
20;835;29062021165457
21;1023;29062021165457
22;1023;29062021165457
23;1023;29062021165457
24;1023;29062021165457
25;999;29062021165457
26;910;29062021165457
27;906;29062021165457
28;968;29062021165457
29;1023;29062021165457
30;1023;29062021165457
31;1023;29062021165457
32;1023;29062021165457
33;1023;29062021165457
34;1023;29062021165457
35;1023;29062021165457
36;1023;29062021165457
37;1023;29062021165457
38;1023;29062021165457
39;1023;29062021165457
40;1023;29062021165457
41;930;29062021165457
42;847;29062021165457
43;765;29062021165457
44;724;29062021165457
45;688;29062021165457
46;665;29062021165457
47;652;29062021165457
48;650;29062021165457
49;646;29062021165457
50;654;29062021165457
51;660;29062021165457
52;660;29062021165457
53;679;29062021165457
54;694;29062021165457
55;707;29062021165457
56;725;29062021165457
57;746;29062021165457
58;773;29062021165457
59;787;29062021165457
60;811;29062021165457
61;831;29062021165457
62;846;29062021165457
63;867;29062021165457
64;874;29062021165457
65;881;29062021165457
66;887;29062021165457
67;896;29062021165457
68;884;29062021165457
69;881;29062021165457
70;862;29062021165457
71;855;29062021165457
72;839;29062021165457
73;805;29062021165457
74;793;29062021165457
75;761;29062021165457
76;741;29062021165457
77;723;29062021165457
78;691;29062021165457
79;666;29062021165457
80;637;29062021165457
81;611;29062021165457
82;595;29062021165457
83;576;29062021165457
84;564;29062021165457
85;551;29062021165457
86;543;29062021165457
87;538;29062021165457
88;528;29062021165457
89;514;29062021165457
90;504;29062021165457
91;494;29062021165457
92;478;29062021165457
93;463;29062021165457
94;448;29062021165457
95;432;29062021165457
96;417;29062021165457
97;405;29062021165457
98;392;29062021165457
99;382;29062021165457
100;371;29062021165457
101;366;29062021165457
102;352;29062021165457
103;345;29062021165457
104;336;29062021165457
105;326;29062021165457
106;319;29062021165457
107;309;29062021165457
108;301;29062021165457
109;293;29062021165457
110;286;29062021165457
111;277;29062021165457
112;274;29062021165457
113;267;29062021165457
114;259;29062021165457
115;258;29062021165457
116;255;29062021165457
117;252;29062021165457
118;241;29062021165457
119;238;29062021165457
120;232;29062021165457
121;228;29062021165457
122;226;29062021165457
123;220;29062021165457
124;216;29062021165457
125;214;29062021165457
126;207;29062021165457
127;205;29062021165457
128;203;29062021165457
129;195;29062021165457
130;192;29062021165457
131;192;29062021165457
132;184;29062021165457
133;190;29062021165457
134;179;29062021165457
135;179;29062021165457
136;179;29062021165457
137;171;29062021165457
138;172;29062021165457
139;170;29062021165457
140;166;29062021165457
141;166;29062021165457
142;162;29062021165457
143;158;29062021165457
144;159;29062021165457
145;155;29062021165457
146;156;29062021165457
147;155;29062021165457
148;150;29062021165457
149;150;29062021165457
150;148;29062021165457
151;148;29062021165457
152;146;29062021165457
153;146;29062021165457
154;145;29062021165457
155;143;29062021165457
156;143;29062021165457
157;141;29062021165457
158;138;29062021165457
159;138;29062021165457
160;139;29062021165457
161;137;29062021165457
162;137;29062021165457
163;137;29062021165457
164;137;29062021165457
165;137;29062021165457
166;134;29062021165457
167;134;29062021165457
168;135;29062021165457
169;130;29062021165457
170;133;29062021165457
171;130;29062021165457
172;130;29062021165457
173;131;29062021165457
174;131;29062021165457
175;128;29062021165457
176;130;29062021165457
177;127;29062021165457
178;130;29062021165457
179;129;29062021165457
180;127;29062021165457
181;128;29062021165457
182;128;29062021165457
183;126;29062021165457
184;127;29062021165457
185;123;29062021165457
186;127;29062021165457
187;127;29062021165457
188;124;29062021165457
189;126;29062021165457
190;123;29062021165457
191;125;29062021165457
192;128;29062021165457
193;124;29062021165457
194;126;29062021165457
195;125;29062021165457
196;123;29062021165457
197;124;29062021165457
198;125;29062021165457
199;124;29062021165457
200;0;29062021165457
0;0;29062021165457
1;141;29062021165457
2;144;29062021165457
3;142;29062021165457
4;144;29062021165457
5;145;29062021165457
6;145;29062021165457
7;149;29062021165457
8;151;29062021165457
9;151;29062021165457
10;156;29062021165457
11;156;29062021165457
12;161;29062021165457
13;169;29062021165457
14;175;29062021165457
15;192;29062021165457
16;209;29062021165457
17;246;29062021165457
18;327;29062021165457
19;490;29062021165457
20;834;29062021165457
21;1023;29062021165457
22;1023;29062021165457
23;1023;29062021165457
24;1023;29062021165457
25;997;29062021165457
26;909;29062021165457
27;902;29062021165457
28;968;29062021165457
29;1023;29062021165457
30;1023;29062021165457
31;1023;29062021165457
32;1023;29062021165457
33;1023;29062021165457
34;1023;29062021165457
35;1023;29062021165457
36;1023;29062021165457
37;1023;29062021165457
38;1023;29062021165457
39;1023;29062021165457
40;1023;29062021165457
41;935;29062021165457
42;843;29062021165457
43;766;29062021165457
44;721;29062021165457
45;687;29062021165457
46;665;29062021165457
47;654;29062021165457
48;649;29062021165457
49;652;29062021165457
50;650;29062021165457
51;658;29062021165457
52;661;29062021165457
53;684;29062021165457
54;691;29062021165457
55;706;29062021165457
56;728;29062021165457
57;747;29062021165457
58;770;29062021165457
59;788;29062021165457
60;812;29062021165457
61;833;29062021165457
62;847;29062021165457
63;863;29062021165457
64;874;29062021165457
65;880;29062021165457
66;888;29062021165457
67;892;29062021165457
68;883;29062021165457
69;879;29062021165457
70;862;29062021165457
71;851;29062021165457
72;833;29062021165457
73;808;29062021165457
74;792;29062021165457
75;759;29062021165457
76;741;29062021165457
77;719;29062021165457
78;691;29062021165457
79;669;29062021165457
80;637;29062021165457
81;610;29062021165457
82;595;29062021165457
83;573;29062021165457
84;563;29062021165457
85;549;29062021165457
86;544;29062021165457
87;535;29062021165457
88;531;29062021165457
89;515;29062021165457
90;507;29062021165457
91;494;29062021165457
92;482;29062021165457
93;463;29062021165457
94;450;29062021165457
95;431;29062021165457
96;420;29062021165457
97;404;29062021165457
98;393;29062021165457
99;379;29062021165457
100;370;29062021165457
101;365;29062021165457
102;354;29062021165457
103;342;29062021165457
104;335;29062021165457
105;325;29062021165457
106;322;29062021165457
107;310;29062021165457
108;302;29062021165457
109;290;29062021165457
110;286;29062021165457
111;278;29062021165457
112;274;29062021165457
113;264;29062021165457
114;261;29062021165457
115;259;29062021165457
116;255;29062021165457
117;250;29062021165457
118;244;29062021165457
119;239;29062021165457
120;232;29062021165457
121;229;29062021165457
122;227;29062021165457
123;222;29062021165457
124;217;29062021165457
125;212;29062021165457
126;207;29062021165457
127;205;29062021165457
128;201;29062021165457
129;195;29062021165457
130;193;29062021165457
131;190;29062021165457
132;186;29062021165457
133;189;29062021165457
134;180;29062021165457
135;178;29062021165457
136;177;29062021165457
137;171;29062021165457
138;172;29062021165457
139;168;29062021165457
140;165;29062021165457
141;165;29062021165457
142;161;29062021165457
143;158;29062021165457
144;158;29062021165457
145;155;29062021165457
146;156;29062021165457
147;153;29062021165457
148;151;29062021165457
149;150;29062021165457
150;149;29062021165457
151;148;29062021165457
152;146;29062021165457
153;144;29062021165457
154;145;29062021165457
155;143;29062021165457
156;140;29062021165457
157;141;29062021165457
158;139;29062021165457
159;139;29062021165457
160;139;29062021165457
161;137;29062021165457
162;137;29062021165457
163;138;29062021165457
164;136;29062021165457
165;138;29062021165457
166;134;29062021165457
167;134;29062021165457
168;136;29062021165457
169;131;29062021165457
170;134;29062021165457
171;132;29062021165457
172;130;29062021165457
173;132;29062021165457
174;129;29062021165457
175;127;29062021165457
176;130;29062021165457
177;127;29062021165457
178;129;29062021165457
179;128;29062021165457
180;127;29062021165457
181;128;29062021165457
182;128;29062021165457
183;126;29062021165457
184;128;29062021165457
185;124;29062021165457
186;127;29062021165457
187;126;29062021165457
188;123;29062021165457
189;125;29062021165457
190;124;29062021165457
191;125;29062021165457
192;127;29062021165457
193;124;29062021165457
194;124;29062021165457
195;126;29062021165457
196;123;29062021165457
197;125;29062021165457
198;124;29062021165457
199;123;29062021165457
200;0;29062021165457
0;0;29062021165457
1;141;29062021165457
2;143;29062021165457
3;142;29062021165457
4;144;29062021165457
5;145;29062021165457
6;146;29062021165457
7;148;29062021165457
8;152;29062021165457
9;150;29062021165457
10;157;29062021165457
11;157;29062021165457
12;161;29062021165457
13;171;29062021165457
14;176;29062021165457
15;189;29062021165457
16;210;29062021165457
17;244;29062021165457
18;323;29062021165457
19;489;29062021165457
20;829;29062021165457
21;1023;29062021165457
22;1023;29062021165457
23;1023;29062021165457
24;1023;29062021165457
25;1001;29062021165457
26;911;29062021165457
27;905;29062021165457
28;968;29062021165457
29;1023;29062021165457
30;1023;29062021165457
31;1023;29062021165457
32;1023;29062021165457
33;1023;29062021165457
34;1023;29062021165457
35;1023;29062021165457
36;1023;29062021165457
37;1023;29062021165457
38;1023;29062021165457
39;1023;29062021165457
40;1023;29062021165457
41;931;29062021165457
42;840;29062021165457
43;768;29062021165457
44;719;29062021165457
45;685;29062021165457
46;659;29062021165457
47;653;29062021165457
48;647;29062021165457
49;646;29062021165457
50;648;29062021165457
51;660;29062021165457
52;663;29062021165457
53;679;29062021165457
54;688;29062021165457
55;705;29062021165457
56;724;29062021165457
57;747;29062021165457
58;770;29062021165457
59;788;29062021165457
60;812;29062021165457
61;832;29062021165457
62;845;29062021165457
63;869;29062021165457
64;877;29062021165457
65;880;29062021165457
66;889;29062021165457
67;889;29062021165457
68;881;29062021165457
69;876;29062021165457
70;863;29062021165457
71;846;29062021165457
72;840;29062021165457
73;805;29062021165457
74;790;29062021165457
75;759;29062021165457
76;739;29062021165457
77;717;29062021165457
78;691;29062021165457
79;668;29062021165457
80;635;29062021165457
81;609;29062021165457
82;599;29062021165457
83;575;29062021165457
84;564;29062021165457
85;551;29062021165457
86;543;29062021165457
87;535;29062021165457
88;526;29062021165457
89;514;29062021165457
90;507;29062021165457
91;496;29062021165457
92;478;29062021165457
93;463;29062021165457
94;445;29062021165457
95;430;29062021165457
96;421;29062021165457
97;405;29062021165457
98;392;29062021165457
99;381;29062021165457
100;368;29062021165457
101;361;29062021165457
102;350;29062021165457
103;344;29062021165457
104;335;29062021165457
105;326;29062021165457
106;319;29062021165457
107;308;29062021165457
108;304;29062021165457
109;296;29062021165457
110;286;29062021165457
111;279;29062021165457
112;275;29062021165457
113;263;29062021165457
114;261;29062021165457
115;256;29062021165457
116;254;29062021165457
117;252;29062021165457
118;243;29062021165457
119;238;29062021165457
120;232;29062021165457
121;228;29062021165457
122;223;29062021165457
123;222;29062021165457
124;217;29062021165457
125;214;29062021165457
126;208;29062021165457
127;202;29062021165457
128;201;29062021165457
129;197;29062021165457
130;194;29062021165457
131;191;29062021165457
132;186;29062021165457
133;187;29062021165457
134;179;29062021165457
135;179;29062021165457
136;177;29062021165457
137;171;29062021165457
138;172;29062021165457
139;169;29062021165457
140;164;29062021165457
141;163;29062021165457
142;161;29062021165457
143;160;29062021165457
144;157;29062021165457
145;154;29062021165457
146;156;29062021165457
147;153;29062021165457
148;150;29062021165457
149;150;29062021165457
150;147;29062021165457
151;148;29062021165457
152;147;29062021165457
153;143;29062021165457
154;143;29062021165457
155;144;29062021165457
156;143;29062021165457
157;141;29062021165457
158;140;29062021165457
159;138;29062021165457
160;139;29062021165457
161;136;29062021165457
162;139;29062021165457
163;137;29062021165457
164;136;29062021165457
165;137;29062021165457
166;134;29062021165457
167;134;29062021165457
168;135;29062021165457
169;130;29062021165457
170;132;29062021165457
171;132;29062021165457
172;130;29062021165457
173;130;29062021165457
174;129;29062021165457
175;128;29062021165457
176;130;29062021165457
177;127;29062021165457
178;129;29062021165457
179;128;29062021165457
180;127;29062021165457
181;128;29062021165457
182;126;29062021165457
183;125;29062021165457
184;128;29062021165457
185;123;29062021165457
186;127;29062021165457
187;125;29062021165457
188;124;29062021165457
189;125;29062021165457
190;123;29062021165457
191;125;29062021165457
192;128;29062021165457
193;124;29062021165457
194;125;29062021165457
195;125;29062021165457
196;123;29062021165457
197;124;29062021165457
198;124;29062021165457
199;123;29062021165457
200;0;29062021165457
0;0;29062021165457
1;141;29062021165457
2;143;29062021165457
3;143;29062021165457
4;144;29062021165457
5;146;29062021165457
6;145;29062021165457
7;149;29062021165457
8;150;29062021165457
9;150;29062021165457
10;157;29062021165457
11;156;29062021165457
12;160;29062021165457
13;168;29062021165457
14;174;29062021165457
15;191;29062021165457
16;210;29062021165457
17;245;29062021165457
18;323;29062021165457
19;490;29062021165457
20;836;29062021165457
21;1023;29062021165457
22;1023;29062021165457
23;1023;29062021165457
24;1023;29062021165457
25;996;29062021165457
26;906;29062021165457
27;897;29062021165457
28;960;29062021165457
29;1023;29062021165457
30;1023;29062021165457
31;1023;29062021165457
32;1023;29062021165457
33;1023;29062021165457
34;1023;29062021165457
35;1023;29062021165457
36;1023;29062021165457
37;1023;29062021165457
38;1023;29062021165457
39;1023;29062021165457
40;1023;29062021165457
41;937;29062021165457
42;843;29062021165457
43;766;29062021165457
44;724;29062021165457
45;686;29062021165457
46;663;29062021165457
47;655;29062021165457
48;651;29062021165457
49;651;29062021165457
50;652;29062021165457
51;663;29062021165457
52;663;29062021165457
53;681;29062021165457
54;696;29062021165457
55;710;29062021165457
56;723;29062021165457
57;746;29062021165457
58;772;29062021165457
59;789;29062021165457
60;808;29062021165457
61;834;29062021165457
62;846;29062021165457
63;868;29062021165457
64;877;29062021165457
65;883;29062021165457
66;894;29062021165457
67;891;29062021165457
68;883;29062021165457
69;877;29062021165457
70;866;29062021165457
71;850;29062021165457
72;842;29062021165457
73;811;29062021165457
74;797;29062021165457
75;761;29062021165457
76;742;29062021165457
77;722;29062021165457
78;693;29062021165457
79;666;29062021165457
80;640;29062021165457
81;614;29062021165457
82;596;29062021165457
83;575;29062021165457
84;565;29062021165457
85;551;29062021165457
86;545;29062021165457
87;537;29062021165457
88;532;29062021165457
89;521;29062021165457
90;510;29062021165457
91;497;29062021165457
92;483;29062021165457
93;466;29062021165457
94;449;29062021165457
95;433;29062021165457
96;419;29062021165457
97;405;29062021165457
98;392;29062021165457
99;380;29062021165457
100;372;29062021165457
101;363;29062021165457
102;354;29062021165457
103;344;29062021165457
104;338;29062021165457
105;327;29062021165457
106;321;29062021165457
107;310;29062021165457
108;302;29062021165457
109;291;29062021165457
110;285;29062021165457
111;277;29062021165457
112;275;29062021165457
113;264;29062021165457
114;261;29062021165457
115;258;29062021165457
116;252;29062021165457
117;251;29062021165457
118;243;29062021165457
119;238;29062021165457
120;233;29062021165457
121;229;29062021165457
122;225;29062021165457
123;222;29062021165457
124;216;29062021165457
125;212;29062021165457
126;207;29062021165457
127;204;29062021165457
128;205;29062021165457
129;196;29062021165457
130;193;29062021165457
131;192;29062021165457
132;186;29062021165457
133;187;29062021165457
134;180;29062021165457
135;178;29062021165457
136;176;29062021165457
137;173;29062021165457
138;172;29062021165457
139;167;29062021165457
140;165;29062021165457
141;164;29062021165457
142;160;29062021165457
143;158;29062021165457
144;157;29062021165457
145;153;29062021165457
146;155;29062021165457
147;153;29062021165457
148;149;29062021165457
149;149;29062021165457
150;147;29062021165457
151;146;29062021165457
152;146;29062021165457
153;143;29062021165457
154;146;29062021165457
155;142;29062021165457
156;140;29062021165457
157;140;29062021165457
158;140;29062021165457
159;138;29062021165457
160;137;29062021165457
161;136;29062021165457
162;137;29062021165457
163;136;29062021165457
164;136;29062021165457
165;137;29062021165457
166;134;29062021165457
167;134;29062021165457
168;133;29062021165457
169;131;29062021165457
170;132;29062021165457
171;131;29062021165457
172;129;29062021165457
173;130;29062021165457
174;129;29062021165457
175;128;29062021165457
176;130;29062021165457
177;127;29062021165457
178;129;29062021165457
179;127;29062021165457
180;126;29062021165457
181;128;29062021165457
182;127;29062021165457
183;126;29062021165457
184;127;29062021165457
185;123;29062021165457
186;126;29062021165457
187;126;29062021165457
188;124;29062021165457
189;125;29062021165457
190;123;29062021165457
191;124;29062021165457
192;126;29062021165457
193;123;29062021165457
194;124;29062021165457
195;125;29062021165457
196;124;29062021165457
197;124;29062021165457
198;123;29062021165457
199;122;29062021165457
200;0;29062021165457
