ind;val;datetime
0;0;30062021114908
1;152;30062021114908
2;171;30062021114908
3;169;30062021114908
4;172;30062021114908
5;174;30062021114908
6;174;30062021114908
7;180;30062021114908
8;184;30062021114908
9;186;30062021114908
10;195;30062021114908
11;201;30062021114908
12;207;30062021114908
13;221;30062021114908
14;237;30062021114908
15;264;30062021114908
16;306;30062021114908
17;382;30062021114908
18;549;30062021114908
19;862;30062021114908
20;1023;30062021114908
21;1023;30062021114908
22;1023;30062021114908
23;1023;30062021114908
24;1023;30062021114908
25;967;30062021114908
26;942;30062021114908
27;947;30062021114908
28;971;30062021114908
29;1018;30062021114908
30;1023;30062021114908
31;1023;30062021114908
32;1023;30062021114908
33;1023;30062021114908
34;1023;30062021114908
35;1023;30062021114908
36;1023;30062021114908
37;1023;30062021114908
38;1023;30062021114908
39;1023;30062021114908
40;987;30062021114908
41;873;30062021114908
42;798;30062021114908
43;735;30062021114908
44;703;30062021114908
45;676;30062021114908
46;663;30062021114908
47;655;30062021114908
48;649;30062021114908
49;645;30062021114908
50;643;30062021114908
51;648;30062021114908
52;645;30062021114908
53;664;30062021114908
54;663;30062021114908
55;674;30062021114908
56;691;30062021114908
57;704;30062021114908
58;725;30062021114908
59;737;30062021114908
60;755;30062021114908
61;773;30062021114908
62;778;30062021114908
63;802;30062021114908
64;805;30062021114908
65;801;30062021114908
66;809;30062021114908
67;801;30062021114908
68;797;30062021114908
69;787;30062021114908
70;770;30062021114908
71;753;30062021114908
72;747;30062021114908
73;713;30062021114908
74;699;30062021114908
75;671;30062021114908
76;661;30062021114908
77;640;30062021114908
78;619;30062021114908
79;598;30062021114908
80;571;30062021114908
81;549;30062021114908
82;535;30062021114908
83;522;30062021114908
84;508;30062021114908
85;495;30062021114908
86;492;30062021114908
87;485;30062021114908
88;476;30062021114908
89;466;30062021114908
90;457;30062021114908
91;445;30062021114908
92;430;30062021114908
93;419;30062021114908
94;404;30062021114908
95;389;30062021114908
96;382;30062021114908
97;371;30062021114908
98;361;30062021114908
99;351;30062021114908
100;341;30062021114908
101;336;30062021114908
102;327;30062021114908
103;319;30062021114908
104;314;30062021114908
105;302;30062021114908
106;300;30062021114908
107;290;30062021114908
108;285;30062021114908
109;278;30062021114908
110;271;30062021114908
111;267;30062021114908
112;262;30062021114908
113;254;30062021114908
114;253;30062021114908
115;249;30062021114908
116;242;30062021114908
117;241;30062021114908
118;234;30062021114908
119;234;30062021114908
120;228;30062021114908
121;222;30062021114908
122;222;30062021114908
123;217;30062021114908
124;213;30062021114908
125;210;30062021114908
126;204;30062021114908
127;201;30062021114908
128;202;30062021114908
129;195;30062021114908
130;192;30062021114908
131;190;30062021114908
132;186;30062021114908
133;189;30062021114908
134;182;30062021114908
135;179;30062021114908
136;179;30062021114908
137;175;30062021114908
138;176;30062021114908
139;171;30062021114908
140;169;30062021114908
141;170;30062021114908
142;165;30062021114908
143;164;30062021114908
144;165;30062021114908
145;160;30062021114908
146;162;30062021114908
147;160;30062021114908
148;157;30062021114908
149;158;30062021114908
150;156;30062021114908
151;156;30062021114908
152;153;30062021114908
153;152;30062021114908
154;152;30062021114908
155;153;30062021114908
156;149;30062021114908
157;148;30062021114908
158;147;30062021114908
159;146;30062021114908
160;147;30062021114908
161;146;30062021114908
162;147;30062021114908
163;145;30062021114908
164;144;30062021114908
165;146;30062021114908
166;141;30062021114908
167;143;30062021114908
168;143;30062021114908
169;140;30062021114908
170;142;30062021114908
171;141;30062021114908
172;139;30062021114908
173;141;30062021114908
174;138;30062021114908
175;138;30062021114908
176;140;30062021114908
177;137;30062021114908
178;141;30062021114908
179;138;30062021114908
180;137;30062021114908
181;138;30062021114908
182;139;30062021114908
183;137;30062021114908
184;138;30062021114908
185;134;30062021114908
186;139;30062021114908
187;137;30062021114908
188;135;30062021114908
189;137;30062021114908
190;135;30062021114908
191;136;30062021114908
192;139;30062021114908
193;134;30062021114908
194;137;30062021114908
195;136;30062021114908
196;135;30062021114908
197;135;30062021114908
198;136;30062021114908
199;133;30062021114908
200;0;30062021114908
0;0;30062021114909
1;152;30062021114909
2;170;30062021114909
3;169;30062021114909
4;171;30062021114909
5;175;30062021114909
6;175;30062021114909
7;180;30062021114909
8;183;30062021114909
9;186;30062021114909
10;196;30062021114909
11;202;30062021114909
12;209;30062021114909
13;222;30062021114909
14;236;30062021114909
15;265;30062021114909
16;304;30062021114909
17;382;30062021114909
18;545;30062021114909
19;856;30062021114909
20;1023;30062021114909
21;1023;30062021114909
22;1023;30062021114909
23;1023;30062021114909
24;1023;30062021114909
25;971;30062021114909
26;941;30062021114909
27;948;30062021114909
28;970;30062021114909
29;1013;30062021114909
30;1023;30062021114909
31;1023;30062021114909
32;1023;30062021114909
33;1023;30062021114909
34;1023;30062021114909
35;1023;30062021114909
36;1023;30062021114909
37;1023;30062021114909
38;1023;30062021114909
39;1023;30062021114909
40;995;30062021114909
41;881;30062021114909
42;799;30062021114909
43;740;30062021114909
44;703;30062021114909
45;678;30062021114909
46;663;30062021114909
47;655;30062021114909
48;649;30062021114909
49;645;30062021114909
50;644;30062021114909
51;648;30062021114909
52;646;30062021114909
53;655;30062021114909
54;661;30062021114909
55;675;30062021114909
56;690;30062021114909
57;700;30062021114909
58;726;30062021114909
59;737;30062021114909
60;757;30062021114909
61;772;30062021114909
62;781;30062021114909
63;798;30062021114909
64;805;30062021114909
65;804;30062021114909
66;806;30062021114909
67;804;30062021114909
68;797;30062021114909
69;782;30062021114909
70;767;30062021114909
71;756;30062021114909
72;744;30062021114909
73;714;30062021114909
74;700;30062021114909
75;671;30062021114909
76;654;30062021114909
77;645;30062021114909
78;618;30062021114909
79;595;30062021114909
80;574;30062021114909
81;549;30062021114909
82;539;30062021114909
83;517;30062021114909
84;508;30062021114909
85;499;30062021114909
86;493;30062021114909
87;484;30062021114909
88;475;30062021114909
89;464;30062021114909
90;457;30062021114909
91;440;30062021114909
92;427;30062021114909
93;419;30062021114909
94;402;30062021114909
95;389;30062021114909
96;379;30062021114909
97;368;30062021114909
98;359;30062021114909
99;351;30062021114909
100;342;30062021114909
101;339;30062021114909
102;329;30062021114909
103;317;30062021114909
104;311;30062021114909
105;302;30062021114909
106;298;30062021114909
107;292;30062021114909
108;286;30062021114909
109;281;30062021114909
110;269;30062021114909
111;266;30062021114909
112;260;30062021114909
113;252;30062021114909
114;249;30062021114909
115;249;30062021114909
116;244;30062021114909
117;241;30062021114909
118;233;30062021114909
119;230;30062021114909
120;226;30062021114909
121;223;30062021114909
122;220;30062021114909
123;216;30062021114909
124;213;30062021114909
125;211;30062021114909
126;203;30062021114909
127;201;30062021114909
128;203;30062021114909
129;196;30062021114909
130;192;30062021114909
131;192;30062021114909
132;185;30062021114909
133;188;30062021114909
134;182;30062021114909
135;179;30062021114909
136;180;30062021114909
137;174;30062021114909
138;174;30062021114909
139;171;30062021114909
140;170;30062021114909
141;169;30062021114909
142;166;30062021114909
143;163;30062021114909
144;165;30062021114909
145;160;30062021114909
146;163;30062021114909
147;159;30062021114909
148;157;30062021114909
149;156;30062021114909
150;155;30062021114909
151;155;30062021114909
152;153;30062021114909
153;151;30062021114909
154;152;30062021114909
155;150;30062021114909
156;148;30062021114909
157;147;30062021114909
158;146;30062021114909
159;146;30062021114909
160;147;30062021114909
161;145;30062021114909
162;146;30062021114909
163;145;30062021114909
164;144;30062021114909
165;146;30062021114909
166;142;30062021114909
167;142;30062021114909
168;143;30062021114909
169;139;30062021114909
170;142;30062021114909
171;142;30062021114909
172;139;30062021114909
173;142;30062021114909
174;139;30062021114909
175;138;30062021114909
176;140;30062021114909
177;136;30062021114909
178;141;30062021114909
179;138;30062021114909
180;136;30062021114909
181;137;30062021114909
182;139;30062021114909
183;136;30062021114909
184;137;30062021114909
185;134;30062021114909
186;138;30062021114909
187;135;30062021114909
188;135;30062021114909
189;136;30062021114909
190;135;30062021114909
191;135;30062021114909
192;137;30062021114909
193;135;30062021114909
194;137;30062021114909
195;136;30062021114909
196;135;30062021114909
197;135;30062021114909
198;137;30062021114909
199;134;30062021114909
200;0;30062021114909
0;0;30062021114910
1;152;30062021114910
2;169;30062021114910
3;168;30062021114910
4;172;30062021114910
5;175;30062021114910
6;174;30062021114910
7;182;30062021114910
8;184;30062021114910
9;185;30062021114910
10;194;30062021114910
11;200;30062021114910
12;207;30062021114910
13;221;30062021114910
14;236;30062021114910
15;263;30062021114910
16;306;30062021114910
17;383;30062021114910
18;548;30062021114910
19;850;30062021114910
20;1023;30062021114910
21;1023;30062021114910
22;1023;30062021114910
23;1023;30062021114910
24;1023;30062021114910
25;971;30062021114910
26;943;30062021114910
27;951;30062021114910
28;973;30062021114910
29;1015;30062021114910
30;1023;30062021114910
31;1023;30062021114910
32;1023;30062021114910
33;1023;30062021114910
34;1023;30062021114910
35;1023;30062021114910
36;1023;30062021114910
37;1023;30062021114910
38;1023;30062021114910
39;1023;30062021114910
40;997;30062021114910
41;880;30062021114910
42;804;30062021114910
43;739;30062021114910
44;699;30062021114910
45;678;30062021114910
46;663;30062021114910
47;654;30062021114910
48;643;30062021114910
49;643;30062021114910
50;638;30062021114910
51;642;30062021114910
52;644;30062021114910
53;655;30062021114910
54;667;30062021114910
55;676;30062021114910
56;695;30062021114910
57;706;30062021114910
58;729;30062021114910
59;735;30062021114910
60;758;30062021114910
61;774;30062021114910
62;780;30062021114910
63;794;30062021114910
64;800;30062021114910
65;804;30062021114910
66;808;30062021114910
67;797;30062021114910
68;794;30062021114910
69;782;30062021114910
70;766;30062021114910
71;754;30062021114910
72;737;30062021114910
73;713;30062021114910
74;702;30062021114910
75;672;30062021114910
76;656;30062021114910
77;640;30062021114910
78;612;30062021114910
79;594;30062021114910
80;572;30062021114910
81;546;30062021114910
82;537;30062021114910
83;521;30062021114910
84;509;30062021114910
85;497;30062021114910
86;492;30062021114910
87;485;30062021114910
88;476;30062021114910
89;464;30062021114910
90;453;30062021114910
91;442;30062021114910
92;426;30062021114910
93;420;30062021114910
94;402;30062021114910
95;388;30062021114910
96;383;30062021114910
97;368;30062021114910
98;358;30062021114910
99;348;30062021114910
100;341;30062021114910
101;337;30062021114910
102;327;30062021114910
103;316;30062021114910
104;312;30062021114910
105;304;30062021114910
106;296;30062021114910
107;290;30062021114910
108;284;30062021114910
109;280;30062021114910
110;270;30062021114910
111;264;30062021114910
112;260;30062021114910
113;250;30062021114910
114;249;30062021114910
115;248;30062021114910
116;242;30062021114910
117;241;30062021114910
118;233;30062021114910
119;231;30062021114910
120;227;30062021114910
121;225;30062021114910
122;221;30062021114910
123;219;30062021114910
124;214;30062021114910
125;210;30062021114910
126;204;30062021114910
127;202;30062021114910
128;201;30062021114910
129;194;30062021114910
130;192;30062021114910
131;191;30062021114910
132;183;30062021114910
133;189;30062021114910
134;181;30062021114910
135;180;30062021114910
136;179;30062021114910
137;173;30062021114910
138;174;30062021114910
139;170;30062021114910
140;169;30062021114910
141;169;30062021114910
142;165;30062021114910
143;163;30062021114910
144;163;30062021114910
145;159;30062021114910
146;162;30062021114910
147;160;30062021114910
148;157;30062021114910
149;156;30062021114910
150;155;30062021114910
151;156;30062021114910
152;154;30062021114910
153;150;30062021114910
154;153;30062021114910
155;152;30062021114910
156;149;30062021114910
157;147;30062021114910
158;147;30062021114910
159;146;30062021114910
160;146;30062021114910
161;145;30062021114910
162;147;30062021114910
163;145;30062021114910
164;145;30062021114910
165;145;30062021114910
166;143;30062021114910
167;143;30062021114910
168;144;30062021114910
169;139;30062021114910
170;143;30062021114910
171;141;30062021114910
172;139;30062021114910
173;142;30062021114910
174;139;30062021114910
175;138;30062021114910
176;140;30062021114910
177;137;30062021114910
178;141;30062021114910
179;138;30062021114910
180;137;30062021114910
181;138;30062021114910
182;137;30062021114910
183;137;30062021114910
184;136;30062021114910
185;134;30062021114910
186;138;30062021114910
187;136;30062021114910
188;135;30062021114910
189;137;30062021114910
190;134;30062021114910
191;135;30062021114910
192;139;30062021114910
193;135;30062021114910
194;136;30062021114910
195;135;30062021114910
196;134;30062021114910
197;136;30062021114910
198;135;30062021114910
199;134;30062021114910
200;0;30062021114910
0;0;30062021114911
1;152;30062021114911
2;171;30062021114911
3;169;30062021114911
4;172;30062021114911
5;173;30062021114911
6;175;30062021114911
7;181;30062021114911
8;185;30062021114911
9;186;30062021114911
10;195;30062021114911
11;199;30062021114911
12;208;30062021114911
13;221;30062021114911
14;236;30062021114911
15;263;30062021114911
16;302;30062021114911
17;381;30062021114911
18;541;30062021114911
19;855;30062021114911
20;1023;30062021114911
21;1023;30062021114911
22;1023;30062021114911
23;1023;30062021114911
24;1023;30062021114911
25;970;30062021114911
26;942;30062021114911
27;946;30062021114911
28;968;30062021114911
29;1011;30062021114911
30;1023;30062021114911
31;1023;30062021114911
32;1023;30062021114911
33;1023;30062021114911
34;1023;30062021114911
35;1023;30062021114911
36;1023;30062021114911
37;1023;30062021114911
38;1023;30062021114911
39;1023;30062021114911
40;992;30062021114911
41;880;30062021114911
42;796;30062021114911
43;727;30062021114911
44;700;30062021114911
45;675;30062021114911
46;662;30062021114911
47;651;30062021114911
48;648;30062021114911
49;641;30062021114911
50;641;30062021114911
51;646;30062021114911
52;644;30062021114911
53;657;30062021114911
54;661;30062021114911
55;675;30062021114911
56;688;30062021114911
57;701;30062021114911
58;725;30062021114911
59;732;30062021114911
60;752;30062021114911
61;771;30062021114911
62;776;30062021114911
63;786;30062021114911
64;795;30062021114911
65;800;30062021114911
66;797;30062021114911
67;800;30062021114911
68;792;30062021114911
69;781;30062021114911
70;765;30062021114911
71;755;30062021114911
72;738;30062021114911
73;711;30062021114911
74;701;30062021114911
75;669;30062021114911
76;657;30062021114911
77;637;30062021114911
78;617;30062021114911
79;592;30062021114911
80;570;30062021114911
81;548;30062021114911
82;537;30062021114911
83;516;30062021114911
84;507;30062021114911
85;496;30062021114911
86;488;30062021114911
87;484;30062021114911
88;479;30062021114911
89;464;30062021114911
90;457;30062021114911
91;443;30062021114911
92;427;30062021114911
93;415;30062021114911
94;405;30062021114911
95;388;30062021114911
96;381;30062021114911
97;366;30062021114911
98;363;30062021114911
99;349;30062021114911
100;342;30062021114911
101;333;30062021114911
102;327;30062021114911
103;316;30062021114911
104;314;30062021114911
105;302;30062021114911
106;297;30062021114911
107;290;30062021114911
108;284;30062021114911
109;278;30062021114911
110;270;30062021114911
111;266;30062021114911
112;258;30062021114911
113;251;30062021114911
114;249;30062021114911
115;246;30062021114911
116;243;30062021114911
117;243;30062021114911
118;234;30062021114911
119;231;30062021114911
120;225;30062021114911
121;220;30062021114911
122;221;30062021114911
123;218;30062021114911
124;214;30062021114911
125;210;30062021114911
126;205;30062021114911
127;201;30062021114911
128;202;30062021114911
129;194;30062021114911
130;192;30062021114911
131;192;30062021114911
132;186;30062021114911
133;190;30062021114911
134;182;30062021114911
135;180;30062021114911
136;180;30062021114911
137;174;30062021114911
138;174;30062021114911
139;172;30062021114911
140;169;30062021114911
141;170;30062021114911
142;165;30062021114911
143;162;30062021114911
144;164;30062021114911
145;158;30062021114911
146;160;30062021114911
147;160;30062021114911
148;157;30062021114911
149;156;30062021114911
150;155;30062021114911
151;155;30062021114911
152;153;30062021114911
153;151;30062021114911
154;153;30062021114911
155;152;30062021114911
156;148;30062021114911
157;149;30062021114911
158;147;30062021114911
159;146;30062021114911
160;146;30062021114911
161;145;30062021114911
162;147;30062021114911
163;146;30062021114911
164;144;30062021114911
165;145;30062021114911
166;142;30062021114911
167;143;30062021114911
168;144;30062021114911
169;140;30062021114911
170;142;30062021114911
171;140;30062021114911
172;138;30062021114911
173;141;30062021114911
174;138;30062021114911
175;138;30062021114911
176;140;30062021114911
177;138;30062021114911
178;140;30062021114911
179;138;30062021114911
180;137;30062021114911
181;139;30062021114911
182;139;30062021114911
183;136;30062021114911
184;137;30062021114911
185;134;30062021114911
186;138;30062021114911
187;136;30062021114911
188;135;30062021114911
189;137;30062021114911
190;134;30062021114911
191;136;30062021114911
192;139;30062021114911
193;134;30062021114911
194;136;30062021114911
195;135;30062021114911
196;135;30062021114911
197;136;30062021114911
198;135;30062021114911
199;134;30062021114911
200;0;30062021114911
0;0;30062021114911
1;152;30062021114911
2;170;30062021114911
3;170;30062021114911
4;170;30062021114911
5;174;30062021114911
6;175;30062021114911
7;180;30062021114911
8;184;30062021114911
9;186;30062021114911
10;196;30062021114911
11;200;30062021114911
12;207;30062021114911
13;223;30062021114911
14;237;30062021114911
15;261;30062021114911
16;306;30062021114911
17;381;30062021114911
18;541;30062021114911
19;854;30062021114911
20;1023;30062021114911
21;1023;30062021114911
22;1023;30062021114911
23;1023;30062021114911
24;1023;30062021114911
25;972;30062021114911
26;945;30062021114911
27;951;30062021114911
28;972;30062021114911
29;1015;30062021114911
30;1023;30062021114911
31;1023;30062021114911
32;1023;30062021114911
33;1023;30062021114911
34;1023;30062021114911
35;1023;30062021114911
36;1023;30062021114911
37;1023;30062021114911
38;1023;30062021114911
39;1023;30062021114911
40;997;30062021114911
41;879;30062021114911
42;802;30062021114911
43;736;30062021114911
44;700;30062021114911
45;671;30062021114911
46;659;30062021114911
47;649;30062021114911
48;646;30062021114911
49;640;30062021114911
50;637;30062021114911
51;641;30062021114911
52;638;30062021114911
53;654;30062021114911
54;660;30062021114911
55;670;30062021114911
56;687;30062021114911
57;700;30062021114911
58;721;30062021114911
59;734;30062021114911
60;748;30062021114911
61;770;30062021114911
62;777;30062021114911
63;790;30062021114911
64;801;30062021114911
65;796;30062021114911
66;802;30062021114911
67;798;30062021114911
68;790;30062021114911
69;777;30062021114911
70;767;30062021114911
71;754;30062021114911
72;741;30062021114911
73;711;30062021114911
74;698;30062021114911
75;669;30062021114911
76;650;30062021114911
77;638;30062021114911
78;612;30062021114911
79;593;30062021114911
80;571;30062021114911
81;546;30062021114911
82;535;30062021114911
83;521;30062021114911
84;507;30062021114911
85;494;30062021114911
86;490;30062021114911
87;484;30062021114911
88;478;30062021114911
89;460;30062021114911
90;452;30062021114911
91;438;30062021114911
92;427;30062021114911
93;414;30062021114911
94;405;30062021114911
95;386;30062021114911
96;377;30062021114911
97;369;30062021114911
98;359;30062021114911
99;348;30062021114911
100;338;30062021114911
101;337;30062021114911
102;326;30062021114911
103;314;30062021114911
104;309;30062021114911
105;302;30062021114911
106;298;30062021114911
107;288;30062021114911
108;282;30062021114911
109;278;30062021114911
110;270;30062021114911
111;263;30062021114911
112;259;30062021114911
113;252;30062021114911
114;253;30062021114911
115;248;30062021114911
116;242;30062021114911
117;241;30062021114911
118;233;30062021114911
119;230;30062021114911
120;228;30062021114911
121;221;30062021114911
122;221;30062021114911
123;217;30062021114911
124;214;30062021114911
125;209;30062021114911
126;202;30062021114911
127;200;30062021114911
128;200;30062021114911
129;195;30062021114911
130;192;30062021114911
131;190;30062021114911
132;187;30062021114911
133;188;30062021114911
134;180;30062021114911
135;178;30062021114911
136;179;30062021114911
137;174;30062021114911
138;175;30062021114911
139;170;30062021114911
140;168;30062021114911
141;170;30062021114911
142;165;30062021114911
143;163;30062021114911
144;165;30062021114911
145;161;30062021114911
146;162;30062021114911
147;160;30062021114911
148;157;30062021114911
149;156;30062021114911
150;156;30062021114911
151;156;30062021114911
152;153;30062021114911
153;150;30062021114911
154;152;30062021114911
155;152;30062021114911
156;149;30062021114911
157;149;30062021114911
158;147;30062021114911
159;146;30062021114911
160;148;30062021114911
161;144;30062021114911
162;146;30062021114911
163;146;30062021114911
164;144;30062021114911
165;145;30062021114911
166;143;30062021114911
167;144;30062021114911
168;144;30062021114911
169;139;30062021114911
170;141;30062021114911
171;141;30062021114911
172;139;30062021114911
173;141;30062021114911
174;140;30062021114911
175;138;30062021114911
176;139;30062021114911
177;137;30062021114911
178;141;30062021114911
179;139;30062021114911
180;137;30062021114911
181;139;30062021114911
182;139;30062021114911
183;137;30062021114911
184;138;30062021114911
185;133;30062021114911
186;139;30062021114911
187;136;30062021114911
188;135;30062021114911
189;136;30062021114911
190;135;30062021114911
191;135;30062021114911
192;139;30062021114911
193;135;30062021114911
194;137;30062021114911
195;135;30062021114911
196;135;30062021114911
197;135;30062021114911
198;135;30062021114911
199;133;30062021114911
200;0;30062021114911
0;0;30062021114912
1;153;30062021114912
2;169;30062021114912
3;170;30062021114912
4;173;30062021114912
5;174;30062021114912
6;176;30062021114912
7;181;30062021114912
8;185;30062021114912
9;185;30062021114912
10;195;30062021114912
11;201;30062021114912
12;207;30062021114912
13;221;30062021114912
14;236;30062021114912
15;262;30062021114912
16;302;30062021114912
17;377;30062021114912
18;540;30062021114912
19;851;30062021114912
20;1023;30062021114912
21;1023;30062021114912
22;1023;30062021114912
23;1023;30062021114912
24;1023;30062021114912
25;974;30062021114912
26;946;30062021114912
27;949;30062021114912
28;974;30062021114912
29;1017;30062021114912
30;1023;30062021114912
31;1023;30062021114912
32;1023;30062021114912
33;1023;30062021114912
34;1023;30062021114912
35;1023;30062021114912
36;1023;30062021114912
37;1023;30062021114912
38;1023;30062021114912
39;1023;30062021114912
40;994;30062021114912
41;876;30062021114912
42;794;30062021114912
43;732;30062021114912
44;693;30062021114912
45;669;30062021114912
46;654;30062021114912
47;645;30062021114912
48;645;30062021114912
49;640;30062021114912
50;633;30062021114912
51;637;30062021114912
52;636;30062021114912
53;647;30062021114912
54;663;30062021114912
55;667;30062021114912
56;681;30062021114912
57;700;30062021114912
58;716;30062021114912
59;733;30062021114912
60;750;30062021114912
61;766;30062021114912
62;772;30062021114912
63;788;30062021114912
64;793;30062021114912
65;791;30062021114912
66;797;30062021114912
67;796;30062021114912
68;789;30062021114912
69;774;30062021114912
70;758;30062021114912
71;750;30062021114912
72;737;30062021114912
73;713;30062021114912
74;695;30062021114912
75;670;30062021114912
76;651;30062021114912
77;628;30062021114912
78;613;30062021114912
79;589;30062021114912
80;563;30062021114912
81;540;30062021114912
82;531;30062021114912
83;515;30062021114912
84;510;30062021114912
85;495;30062021114912
86;490;30062021114912
87;478;30062021114912
88;474;30062021114912
89;460;30062021114912
90;451;30062021114912
91;441;30062021114912
92;425;30062021114912
93;415;30062021114912
94;401;30062021114912
95;385;30062021114912
96;379;30062021114912
97;366;30062021114912
98;356;30062021114912
99;349;30062021114912
100;339;30062021114912
101;337;30062021114912
102;327;30062021114912
103;316;30062021114912
104;307;30062021114912
105;302;30062021114912
106;297;30062021114912
107;289;30062021114912
108;285;30062021114912
109;277;30062021114912
110;267;30062021114912
111;264;30062021114912
112;262;30062021114912
113;252;30062021114912
114;249;30062021114912
115;245;30062021114912
116;242;30062021114912
117;239;30062021114912
118;235;30062021114912
119;232;30062021114912
120;226;30062021114912
121;221;30062021114912
122;219;30062021114912
123;218;30062021114912
124;212;30062021114912
125;209;30062021114912
126;202;30062021114912
127;202;30062021114912
128;200;30062021114912
129;193;30062021114912
130;192;30062021114912
131;190;30062021114912
132;186;30062021114912
133;191;30062021114912
134;183;30062021114912
135;180;30062021114912
136;177;30062021114912
137;174;30062021114912
138;174;30062021114912
139;170;30062021114912
140;169;30062021114912
141;169;30062021114912
142;166;30062021114912
143;164;30062021114912
144;162;30062021114912
145;160;30062021114912
146;160;30062021114912
147;160;30062021114912
148;156;30062021114912
149;158;30062021114912
150;156;30062021114912
151;156;30062021114912
152;153;30062021114912
153;152;30062021114912
154;153;30062021114912
155;151;30062021114912
156;149;30062021114912
157;148;30062021114912
158;148;30062021114912
159;146;30062021114912
160;146;30062021114912
161;145;30062021114912
162;147;30062021114912
163;145;30062021114912
164;144;30062021114912
165;146;30062021114912
166;143;30062021114912
167;143;30062021114912
168;144;30062021114912
169;140;30062021114912
170;143;30062021114912
171;141;30062021114912
172;140;30062021114912
173;141;30062021114912
174;139;30062021114912
175;138;30062021114912
176;140;30062021114912
177;137;30062021114912
178;140;30062021114912
179;139;30062021114912
180;137;30062021114912
181;138;30062021114912
182;139;30062021114912
183;137;30062021114912
184;137;30062021114912
185;135;30062021114912
186;139;30062021114912
187;137;30062021114912
188;134;30062021114912
189;137;30062021114912
190;135;30062021114912
191;136;30062021114912
192;140;30062021114912
193;135;30062021114912
194;137;30062021114912
195;136;30062021114912
196;135;30062021114912
197;136;30062021114912
198;136;30062021114912
199;134;30062021114912
200;0;30062021114912
0;0;30062021114913
1;152;30062021114913
2;170;30062021114913
3;168;30062021114913
4;171;30062021114913
5;173;30062021114913
6;175;30062021114913
7;181;30062021114913
8;185;30062021114913
9;186;30062021114913
10;196;30062021114913
11;199;30062021114913
12;206;30062021114913
13;220;30062021114913
14;234;30062021114913
15;260;30062021114913
16;301;30062021114913
17;382;30062021114913
18;536;30062021114913
19;852;30062021114913
20;1023;30062021114913
21;1023;30062021114913
22;1023;30062021114913
23;1023;30062021114913
24;1023;30062021114913
25;974;30062021114913
26;946;30062021114913
27;950;30062021114913
28;972;30062021114913
29;1014;30062021114913
30;1023;30062021114913
31;1023;30062021114913
32;1023;30062021114913
33;1023;30062021114913
34;1023;30062021114913
35;1023;30062021114913
36;1023;30062021114913
37;1023;30062021114913
38;1023;30062021114913
39;1023;30062021114913
40;995;30062021114913
41;883;30062021114913
42;797;30062021114913
43;735;30062021114913
44;695;30062021114913
45;671;30062021114913
46;656;30062021114913
47;647;30062021114913
48;641;30062021114913
49;636;30062021114913
50;637;30062021114913
51;639;30062021114913
52;636;30062021114913
53;651;30062021114913
54;660;30062021114913
55;669;30062021114913
56;681;30062021114913
57;695;30062021114913
58;719;30062021114913
59;737;30062021114913
60;749;30062021114913
61;763;30062021114913
62;776;30062021114913
63;789;30062021114913
64;798;30062021114913
65;795;30062021114913
66;806;30062021114913
67;790;30062021114913
68;789;30062021114913
69;776;30062021114913
70;761;30062021114913
71;750;30062021114913
72;737;30062021114913
73;711;30062021114913
74;695;30062021114913
75;669;30062021114913
76;653;30062021114913
77;636;30062021114913
78;609;30062021114913
79;592;30062021114913
80;564;30062021114913
81;548;30062021114913
82;535;30062021114913
83;516;30062021114913
84;506;30062021114913
85;496;30062021114913
86;486;30062021114913
87;484;30062021114913
88;475;30062021114913
89;458;30062021114913
90;454;30062021114913
91;440;30062021114913
92;425;30062021114913
93;418;30062021114913
94;405;30062021114913
95;388;30062021114913
96;377;30062021114913
97;367;30062021114913
98;357;30062021114913
99;353;30062021114913
100;340;30062021114913
101;336;30062021114913
102;328;30062021114913
103;316;30062021114913
104;308;30062021114913
105;298;30062021114913
106;298;30062021114913
107;289;30062021114913
108;284;30062021114913
109;276;30062021114913
110;270;30062021114913
111;262;30062021114913
112;258;30062021114913
113;253;30062021114913
114;249;30062021114913
115;248;30062021114913
116;241;30062021114913
117;240;30062021114913
118;234;30062021114913
119;230;30062021114913
120;225;30062021114913
121;223;30062021114913
122;220;30062021114913
123;217;30062021114913
124;212;30062021114913
125;211;30062021114913
126;204;30062021114913
127;204;30062021114913
128;201;30062021114913
129;195;30062021114913
130;192;30062021114913
131;190;30062021114913
132;184;30062021114913
133;189;30062021114913
134;182;30062021114913
135;179;30062021114913
136;178;30062021114913
137;173;30062021114913
138;175;30062021114913
139;171;30062021114913
140;170;30062021114913
141;169;30062021114913
142;165;30062021114913
143;162;30062021114913
144;165;30062021114913
145;159;30062021114913
146;161;30062021114913
147;159;30062021114913
148;156;30062021114913
149;157;30062021114913
150;155;30062021114913
151;155;30062021114913
152;153;30062021114913
153;150;30062021114913
154;152;30062021114913
155;152;30062021114913
156;150;30062021114913
157;148;30062021114913
158;146;30062021114913
159;146;30062021114913
160;147;30062021114913
161;145;30062021114913
162;146;30062021114913
163;145;30062021114913
164;144;30062021114913
165;146;30062021114913
166;141;30062021114913
167;143;30062021114913
168;144;30062021114913
169;139;30062021114913
170;141;30062021114913
171;139;30062021114913
172;139;30062021114913
173;141;30062021114913
174;139;30062021114913
175;137;30062021114913
176;140;30062021114913
177;137;30062021114913
178;140;30062021114913
179;139;30062021114913
180;137;30062021114913
181;138;30062021114913
182;139;30062021114913
183;137;30062021114913
184;137;30062021114913
185;134;30062021114913
186;138;30062021114913
187;136;30062021114913
188;135;30062021114913
189;137;30062021114913
190;135;30062021114913
191;136;30062021114913
192;139;30062021114913
193;134;30062021114913
194;135;30062021114913
195;136;30062021114913
196;134;30062021114913
197;135;30062021114913
198;135;30062021114913
199;133;30062021114913
200;0;30062021114913
0;0;30062021114914
1;152;30062021114914
2;171;30062021114914
3;168;30062021114914
4;171;30062021114914
5;174;30062021114914
6;174;30062021114914
7;180;30062021114914
8;185;30062021114914
9;185;30062021114914
10;194;30062021114914
11;198;30062021114914
12;207;30062021114914
13;220;30062021114914
14;235;30062021114914
15;262;30062021114914
16;299;30062021114914
17;379;30062021114914
18;542;30062021114914
19;850;30062021114914
20;1023;30062021114914
21;1023;30062021114914
22;1023;30062021114914
23;1023;30062021114914
24;1023;30062021114914
25;977;30062021114914
26;949;30062021114914
27;949;30062021114914
28;972;30062021114914
29;1015;30062021114914
30;1023;30062021114914
31;1023;30062021114914
32;1023;30062021114914
33;1023;30062021114914
34;1023;30062021114914
35;1023;30062021114914
36;1023;30062021114914
37;1023;30062021114914
38;1023;30062021114914
39;1023;30062021114914
40;994;30062021114914
41;878;30062021114914
42;798;30062021114914
43;735;30062021114914
44;693;30062021114914
45;674;30062021114914
46;655;30062021114914
47;645;30062021114914
48;642;30062021114914
49;636;30062021114914
50;633;30062021114914
51;639;30062021114914
52;638;30062021114914
53;653;30062021114914
54;659;30062021114914
55;670;30062021114914
56;680;30062021114914
57;695;30062021114914
58;719;30062021114914
59;729;30062021114914
60;750;30062021114914
61;762;30062021114914
62;775;30062021114914
63;786;30062021114914
64;796;30062021114914
65;789;30062021114914
66;799;30062021114914
67;794;30062021114914
68;786;30062021114914
69;776;30062021114914
70;759;30062021114914
71;748;30062021114914
72;735;30062021114914
73;708;30062021114914
74;699;30062021114914
75;666;30062021114914
76;653;30062021114914
77;631;30062021114914
78;612;30062021114914
79;591;30062021114914
80;568;30062021114914
81;542;30062021114914
82;537;30062021114914
83;514;30062021114914
84;504;30062021114914
85;493;30062021114914
86;487;30062021114914
87;479;30062021114914
88;473;30062021114914
89;458;30062021114914
90;454;30062021114914
91;442;30062021114914
92;426;30062021114914
93;416;30062021114914
94;404;30062021114914
95;388;30062021114914
96;378;30062021114914
97;366;30062021114914
98;357;30062021114914
99;346;30062021114914
100;340;30062021114914
101;335;30062021114914
102;325;30062021114914
103;314;30062021114914
104;309;30062021114914
105;299;30062021114914
106;299;30062021114914
107;288;30062021114914
108;284;30062021114914
109;278;30062021114914
110;268;30062021114914
111;261;30062021114914
112;259;30062021114914
113;251;30062021114914
114;246;30062021114914
115;247;30062021114914
116;242;30062021114914
117;240;30062021114914
118;234;30062021114914
119;231;30062021114914
120;224;30062021114914
121;221;30062021114914
122;220;30062021114914
123;216;30062021114914
124;214;30062021114914
125;210;30062021114914
126;202;30062021114914
127;203;30062021114914
128;201;30062021114914
129;196;30062021114914
130;191;30062021114914
131;190;30062021114914
132;185;30062021114914
133;189;30062021114914
134;181;30062021114914
135;179;30062021114914
136;178;30062021114914
137;173;30062021114914
138;175;30062021114914
139;171;30062021114914
140;170;30062021114914
141;169;30062021114914
142;166;30062021114914
143;163;30062021114914
144;164;30062021114914
145;158;30062021114914
146;161;30062021114914
147;160;30062021114914
148;157;30062021114914
149;157;30062021114914
150;156;30062021114914
151;155;30062021114914
152;153;30062021114914
153;152;30062021114914
154;153;30062021114914
155;152;30062021114914
156;149;30062021114914
157;149;30062021114914
158;146;30062021114914
159;146;30062021114914
160;146;30062021114914
161;145;30062021114914
162;146;30062021114914
163;144;30062021114914
164;145;30062021114914
165;145;30062021114914
166;142;30062021114914
167;143;30062021114914
168;142;30062021114914
169;140;30062021114914
170;142;30062021114914
171;140;30062021114914
172;138;30062021114914
173;142;30062021114914
174;139;30062021114914
175;137;30062021114914
176;140;30062021114914
177;137;30062021114914
178;141;30062021114914
179;137;30062021114914
180;137;30062021114914
181;138;30062021114914
182;139;30062021114914
183;136;30062021114914
184;138;30062021114914
185;134;30062021114914
186;139;30062021114914
187;136;30062021114914
188;135;30062021114914
189;137;30062021114914
190;134;30062021114914
191;136;30062021114914
192;139;30062021114914
193;135;30062021114914
194;136;30062021114914
195;135;30062021114914
196;134;30062021114914
197;135;30062021114914
198;136;30062021114914
199;134;30062021114914
200;0;30062021114914
0;0;30062021114914
1;153;30062021114914
2;171;30062021114914
3;168;30062021114914
4;173;30062021114914
5;174;30062021114914
6;175;30062021114914
7;179;30062021114914
8;183;30062021114914
9;187;30062021114914
10;196;30062021114914
11;199;30062021114914
12;205;30062021114914
13;219;30062021114914
14;235;30062021114914
15;264;30062021114914
16;301;30062021114914
17;378;30062021114914
18;539;30062021114914
19;848;30062021114914
20;1023;30062021114914
21;1023;30062021114914
22;1023;30062021114914
23;1023;30062021114914
24;1023;30062021114914
25;975;30062021114914
26;945;30062021114914
27;951;30062021114914
28;974;30062021114914
29;1017;30062021114914
30;1023;30062021114914
31;1023;30062021114914
32;1023;30062021114914
33;1023;30062021114914
34;1023;30062021114914
35;1023;30062021114914
36;1023;30062021114914
37;1023;30062021114914
38;1023;30062021114914
39;1023;30062021114914
40;999;30062021114914
41;878;30062021114914
42;801;30062021114914
43;731;30062021114914
44;701;30062021114914
45;671;30062021114914
46;658;30062021114914
47;648;30062021114914
48;641;30062021114914
49;636;30062021114914
50;632;30062021114914
51;640;30062021114914
52;637;30062021114914
53;650;30062021114914
54;660;30062021114914
55;668;30062021114914
56;681;30062021114914
57;694;30062021114914
58;714;30062021114914
59;723;30062021114914
60;749;30062021114914
61;761;30062021114914
62;769;30062021114914
63;790;30062021114914
64;793;30062021114914
65;794;30062021114914
66;797;30062021114914
67;797;30062021114914
68;785;30062021114914
69;776;30062021114914
70;759;30062021114914
71;746;30062021114914
72;735;30062021114914
73;709;30062021114914
74;693;30062021114914
75;668;30062021114914
76;649;30062021114914
77;635;30062021114914
78;610;30062021114914
79;583;30062021114914
80;563;30062021114914
81;540;30062021114914
82;536;30062021114914
83;512;30062021114914
84;506;30062021114914
85;494;30062021114914
86;491;30062021114914
87;484;30062021114914
88;471;30062021114914
89;458;30062021114914
90;452;30062021114914
91;438;30062021114914
92;425;30062021114914
93;418;30062021114914
94;401;30062021114914
95;386;30062021114914
96;379;30062021114914
97;367;30062021114914
98;354;30062021114914
99;347;30062021114914
100;338;30062021114914
101;334;30062021114914
102;325;30062021114914
103;317;30062021114914
104;306;30062021114914
105;302;30062021114914
106;299;30062021114914
107;287;30062021114914
108;281;30062021114914
109;276;30062021114914
110;270;30062021114914
111;261;30062021114914
112;260;30062021114914
113;251;30062021114914
114;250;30062021114914
115;247;30062021114914
116;243;30062021114914
117;243;30062021114914
118;232;30062021114914
119;230;30062021114914
120;227;30062021114914
121;221;30062021114914
122;220;30062021114914
123;215;30062021114914
124;213;30062021114914
125;209;30062021114914
126;205;30062021114914
127;203;30062021114914
128;201;30062021114914
129;196;30062021114914
130;192;30062021114914
131;191;30062021114914
132;186;30062021114914
133;187;30062021114914
134;181;30062021114914
135;178;30062021114914
136;179;30062021114914
137;174;30062021114914
138;176;30062021114914
139;171;30062021114914
140;168;30062021114914
141;169;30062021114914
142;166;30062021114914
143;163;30062021114914
144;164;30062021114914
145;160;30062021114914
146;162;30062021114914
147;160;30062021114914
148;157;30062021114914
149;156;30062021114914
150;156;30062021114914
151;155;30062021114914
152;154;30062021114914
153;151;30062021114914
154;150;30062021114914
155;152;30062021114914
156;149;30062021114914
157;149;30062021114914
158;147;30062021114914
159;146;30062021114914
160;147;30062021114914
161;146;30062021114914
162;145;30062021114914
163;146;30062021114914
164;145;30062021114914
165;146;30062021114914
166;142;30062021114914
167;143;30062021114914
168;144;30062021114914
169;139;30062021114914
170;142;30062021114914
171;141;30062021114914
172;139;30062021114914
173;142;30062021114914
174;138;30062021114914
175;138;30062021114914
176;140;30062021114914
177;137;30062021114914
178;141;30062021114914
179;139;30062021114914
180;137;30062021114914
181;139;30062021114914
182;139;30062021114914
183;136;30062021114914
184;137;30062021114914
185;135;30062021114914
186;139;30062021114914
187;137;30062021114914
188;135;30062021114914
189;136;30062021114914
190;133;30062021114914
191;135;30062021114914
192;139;30062021114914
193;135;30062021114914
194;137;30062021114914
195;135;30062021114914
196;134;30062021114914
197;136;30062021114914
198;137;30062021114914
199;135;30062021114914
200;0;30062021114914
0;0;30062021114915
1;153;30062021114915
2;170;30062021114915
3;168;30062021114915
4;172;30062021114915
5;173;30062021114915
6;175;30062021114915
7;180;30062021114915
8;185;30062021114915
9;187;30062021114915
10;194;30062021114915
11;199;30062021114915
12;205;30062021114915
13;222;30062021114915
14;235;30062021114915
15;262;30062021114915
16;302;30062021114915
17;380;30062021114915
18;539;30062021114915
19;852;30062021114915
20;1023;30062021114915
21;1023;30062021114915
22;1023;30062021114915
23;1023;30062021114915
24;1023;30062021114915
25;977;30062021114915
26;950;30062021114915
27;954;30062021114915
28;976;30062021114915
29;1018;30062021114915
30;1023;30062021114915
31;1023;30062021114915
32;1023;30062021114915
33;1023;30062021114915
34;1023;30062021114915
35;1023;30062021114915
36;1023;30062021114915
37;1023;30062021114915
38;1023;30062021114915
39;1023;30062021114915
40;998;30062021114915
41;877;30062021114915
42;795;30062021114915
43;733;30062021114915
44;693;30062021114915
45;674;30062021114915
46;658;30062021114915
47;648;30062021114915
48;633;30062021114915
49;637;30062021114915
50;632;30062021114915
51;634;30062021114915
52;637;30062021114915
53;647;30062021114915
54;654;30062021114915
55;668;30062021114915
56;677;30062021114915
57;694;30062021114915
58;715;30062021114915
59;723;30062021114915
60;747;30062021114915
61;765;30062021114915
62;769;30062021114915
63;783;30062021114915
64;791;30062021114915
65;797;30062021114915
66;794;30062021114915
67;794;30062021114915
68;784;30062021114915
69;771;30062021114915
70;760;30062021114915
71;746;30062021114915
72;735;30062021114915
73;707;30062021114915
74;692;30062021114915
75;662;30062021114915
76;649;30062021114915
77;632;30062021114915
78;608;30062021114915
79;587;30062021114915
80;571;30062021114915
81;540;30062021114915
82;529;30062021114915
83;512;30062021114915
84;502;30062021114915
85;494;30062021114915
86;485;30062021114915
87;480;30062021114915
88;472;30062021114915
89;459;30062021114915
90;454;30062021114915
91;441;30062021114915
92;422;30062021114915
93;414;30062021114915
94;404;30062021114915
95;386;30062021114915
96;377;30062021114915
97;364;30062021114915
98;356;30062021114915
99;347;30062021114915
100;339;30062021114915
101;331;30062021114915
102;325;30062021114915
103;313;30062021114915
104;310;30062021114915
105;300;30062021114915
106;301;30062021114915
107;287;30062021114915
108;283;30062021114915
109;274;30062021114915
110;269;30062021114915
111;263;30062021114915
112;259;30062021114915
113;254;30062021114915
114;249;30062021114915
115;245;30062021114915
116;241;30062021114915
117;242;30062021114915
118;233;30062021114915
119;233;30062021114915
120;226;30062021114915
121;221;30062021114915
122;218;30062021114915
123;216;30062021114915
124;212;30062021114915
125;209;30062021114915
126;205;30062021114915
127;202;30062021114915
128;201;30062021114915
129;196;30062021114915
130;193;30062021114915
131;191;30062021114915
132;184;30062021114915
133;189;30062021114915
134;181;30062021114915
135;179;30062021114915
136;179;30062021114915
137;174;30062021114915
138;176;30062021114915
139;171;30062021114915
140;168;30062021114915
141;170;30062021114915
142;166;30062021114915
143;163;30062021114915
144;163;30062021114915
145;159;30062021114915
146;162;30062021114915
147;160;30062021114915
148;157;30062021114915
149;156;30062021114915
150;157;30062021114915
151;155;30062021114915
152;154;30062021114915
153;150;30062021114915
154;153;30062021114915
155;152;30062021114915
156;150;30062021114915
157;149;30062021114915
158;147;30062021114915
159;146;30062021114915
160;148;30062021114915
161;146;30062021114915
162;145;30062021114915
163;145;30062021114915
164;144;30062021114915
165;143;30062021114915
166;141;30062021114915
167;143;30062021114915
168;146;30062021114915
169;138;30062021114915
170;141;30062021114915
171;140;30062021114915
172;140;30062021114915
173;143;30062021114915
174;139;30062021114915
175;138;30062021114915
176;139;30062021114915
177;137;30062021114915
178;140;30062021114915
179;139;30062021114915
180;137;30062021114915
181;138;30062021114915
182;139;30062021114915
183;136;30062021114915
184;138;30062021114915
185;135;30062021114915
186;138;30062021114915
187;136;30062021114915
188;135;30062021114915
189;137;30062021114915
190;135;30062021114915
191;136;30062021114915
192;138;30062021114915
193;135;30062021114915
194;137;30062021114915
195;136;30062021114915
196;135;30062021114915
197;136;30062021114915
198;136;30062021114915
199;134;30062021114915
200;0;30062021114915
