ind;val;datetime
0;0;29062021122158
1;143;29062021122158
2;151;29062021122158
3;149;29062021122158
4;151;29062021122158
5;151;29062021122158
6;152;29062021122158
7;156;29062021122158
8;159;29062021122158
9;159;29062021122158
10;166;29062021122158
11;169;29062021122158
12;173;29062021122158
13;184;29062021122158
14;189;29062021122158
15;209;29062021122158
16;235;29062021122158
17;283;29062021122158
18;393;29062021122158
19;605;29062021122158
20;984;29062021122158
21;1023;29062021122158
22;1023;29062021122158
23;1023;29062021122158
24;1023;29062021122158
25;999;29062021122158
26;968;29062021122158
27;979;29062021122158
28;1008;29062021122158
29;1023;29062021122158
30;1023;29062021122158
31;1023;29062021122158
32;1023;29062021122158
33;1023;29062021122158
34;1023;29062021122158
35;1023;29062021122158
36;1023;29062021122158
37;1023;29062021122158
38;1006;29062021122158
39;855;29062021122158
40;717;29062021122158
41;622;29062021122158
42;556;29062021122158
43;518;29062021122158
44;495;29062021122158
45;479;29062021122158
46;467;29062021122158
47;459;29062021122158
48;455;29062021122158
49;449;29062021122158
50;448;29062021122158
51;444;29062021122158
52;441;29062021122158
53;449;29062021122158
54;447;29062021122158
55;454;29062021122158
56;464;29062021122158
57;474;29062021122158
58;488;29062021122158
59;493;29062021122158
60;498;29062021122158
61;512;29062021122158
62;519;29062021122158
63;525;29062021122158
64;533;29062021122158
65;527;29062021122158
66;534;29062021122158
67;525;29062021122158
68;521;29062021122158
69;512;29062021122158
70;496;29062021122158
71;491;29062021122158
72;478;29062021122158
73;462;29062021122158
74;455;29062021122158
75;437;29062021122158
76;427;29062021122158
77;415;29062021122158
78;400;29062021122158
79;391;29062021122158
80;373;29062021122158
81;363;29062021122158
82;357;29062021122158
83;346;29062021122158
84;337;29062021122158
85;331;29062021122158
86;332;29062021122158
87;325;29062021122158
88;318;29062021122158
89;313;29062021122158
90;308;29062021122158
91;298;29062021122158
92;292;29062021122158
93;286;29062021122158
94;276;29062021122158
95;270;29062021122158
96;263;29062021122158
97;255;29062021122158
98;253;29062021122158
99;247;29062021122158
100;240;29062021122158
101;238;29062021122158
102;234;29062021122158
103;227;29062021122158
104;224;29062021122158
105;218;29062021122158
106;218;29062021122158
107;211;29062021122158
108;209;29062021122158
109;205;29062021122158
110;202;29062021122158
111;199;29062021122158
112;196;29062021122158
113;190;29062021122158
114;189;29062021122158
115;190;29062021122158
116;186;29062021122158
117;186;29062021122158
118;180;29062021122158
119;180;29062021122158
120;175;29062021122158
121;172;29062021122158
122;174;29062021122158
123;173;29062021122158
124;170;29062021122158
125;169;29062021122158
126;164;29062021122158
127;164;29062021122158
128;165;29062021122158
129;159;29062021122158
130;159;29062021122158
131;158;29062021122158
132;155;29062021122158
133;159;29062021122158
134;152;29062021122158
135;150;29062021122158
136;152;29062021122158
137;148;29062021122158
138;149;29062021122158
139;147;29062021122158
140;145;29062021122158
141;146;29062021122158
142;143;29062021122158
143;140;29062021122158
144;144;29062021122158
145;140;29062021122158
146;143;29062021122158
147;142;29062021122158
148;137;29062021122158
149;139;29062021122158
150;138;29062021122158
151;138;29062021122158
152;136;29062021122158
153;136;29062021122158
154;137;29062021122158
155;136;29062021122158
156;135;29062021122158
157;134;29062021122158
158;133;29062021122158
159;132;29062021122158
160;133;29062021122158
161;131;29062021122158
162;134;29062021122158
163;132;29062021122158
164;132;29062021122158
165;133;29062021122158
166;130;29062021122158
167;131;29062021122158
168;132;29062021122158
169;128;29062021122158
170;131;29062021122158
171;129;29062021122158
172;128;29062021122158
173;131;29062021122158
174;128;29062021122158
175;128;29062021122158
176;129;29062021122158
177;126;29062021122158
178;130;29062021122158
179;129;29062021122158
180;128;29062021122158
181;129;29062021122158
182;130;29062021122158
183;127;29062021122158
184;128;29062021122158
185;126;29062021122158
186;130;29062021122158
187;128;29062021122158
188;126;29062021122158
189;128;29062021122158
190;126;29062021122158
191;128;29062021122158
192;130;29062021122158
193;126;29062021122158
194;129;29062021122158
195;127;29062021122158
196;127;29062021122158
197;126;29062021122158
198;127;29062021122158
199;126;29062021122158
200;0;29062021122158
0;0;29062021122159
1;141;29062021122159
2;149;29062021122159
3;145;29062021122159
4;149;29062021122159
5;149;29062021122159
6;149;29062021122159
7;154;29062021122159
8;157;29062021122159
9;156;29062021122159
10;164;29062021122159
11;167;29062021122159
12;171;29062021122159
13;180;29062021122159
14;191;29062021122159
15;208;29062021122159
16;233;29062021122159
17;283;29062021122159
18;393;29062021122159
19;609;29062021122159
20;983;29062021122159
21;1023;29062021122159
22;1023;29062021122159
23;1023;29062021122159
24;1023;29062021122159
25;1000;29062021122159
26;969;29062021122159
27;980;29062021122159
28;1007;29062021122159
29;1023;29062021122159
30;1023;29062021122159
31;1023;29062021122159
32;1023;29062021122159
33;1023;29062021122159
34;1023;29062021122159
35;1023;29062021122159
36;1023;29062021122159
37;1023;29062021122159
38;1011;29062021122159
39;871;29062021122159
40;724;29062021122159
41;623;29062021122159
42;570;29062021122159
43;516;29062021122159
44;491;29062021122159
45;481;29062021122159
46;468;29062021122159
47;459;29062021122159
48;456;29062021122159
49;448;29062021122159
50;443;29062021122159
51;443;29062021122159
52;442;29062021122159
53;449;29062021122159
54;449;29062021122159
55;451;29062021122159
56;464;29062021122159
57;472;29062021122159
58;487;29062021122159
59;492;29062021122159
60;508;29062021122159
61;515;29062021122159
62;521;29062021122159
63;527;29062021122159
64;531;29062021122159
65;529;29062021122159
66;534;29062021122159
67;530;29062021122159
68;521;29062021122159
69;515;29062021122159
70;503;29062021122159
71;494;29062021122159
72;484;29062021122159
73;467;29062021122159
74;457;29062021122159
75;438;29062021122159
76;428;29062021122159
77;419;29062021122159
78;400;29062021122159
79;392;29062021122159
80;377;29062021122159
81;363;29062021122159
82;357;29062021122159
83;346;29062021122159
84;338;29062021122159
85;332;29062021122159
86;327;29062021122159
87;326;29062021122159
88;319;29062021122159
89;310;29062021122159
90;307;29062021122159
91;300;29062021122159
92;290;29062021122159
93;285;29062021122159
94;275;29062021122159
95;267;29062021122159
96;263;29062021122159
97;257;29062021122159
98;249;29062021122159
99;245;29062021122159
100;237;29062021122159
101;239;29062021122159
102;233;29062021122159
103;228;29062021122159
104;224;29062021122159
105;219;29062021122159
106;217;29062021122159
107;209;29062021122159
108;207;29062021122159
109;204;29062021122159
110;200;29062021122159
111;196;29062021122159
112;195;29062021122159
113;190;29062021122159
114;189;29062021122159
115;189;29062021122159
116;185;29062021122159
117;183;29062021122159
118;179;29062021122159
119;179;29062021122159
120;177;29062021122159
121;172;29062021122159
122;173;29062021122159
123;170;29062021122159
124;169;29062021122159
125;167;29062021122159
126;163;29062021122159
127;162;29062021122159
128;163;29062021122159
129;159;29062021122159
130;157;29062021122159
131;156;29062021122159
132;153;29062021122159
133;157;29062021122159
134;150;29062021122159
135;149;29062021122159
136;149;29062021122159
137;147;29062021122159
138;147;29062021122159
139;146;29062021122159
140;143;29062021122159
141;146;29062021122159
142;141;29062021122159
143;139;29062021122159
144;142;29062021122159
145;137;29062021122159
146;140;29062021122159
147;139;29062021122159
148;135;29062021122159
149;137;29062021122159
150;135;29062021122159
151;137;29062021122159
152;134;29062021122159
153;133;29062021122159
154;134;29062021122159
155;134;29062021122159
156;132;29062021122159
157;132;29062021122159
158;131;29062021122159
159;130;29062021122159
160;130;29062021122159
161;129;29062021122159
162;131;29062021122159
163;130;29062021122159
164;129;29062021122159
165;132;29062021122159
166;128;29062021122159
167;129;29062021122159
168;131;29062021122159
169;126;29062021122159
170;129;29062021122159
171;127;29062021122159
172;126;29062021122159
173;129;29062021122159
174;127;29062021122159
175;126;29062021122159
176;128;29062021122159
177;125;29062021122159
178;128;29062021122159
179;127;29062021122159
180;125;29062021122159
181;126;29062021122159
182;128;29062021122159
183;124;29062021122159
184;126;29062021122159
185;122;29062021122159
186;127;29062021122159
187;125;29062021122159
188;124;29062021122159
189;125;29062021122159
190;123;29062021122159
191;126;29062021122159
192;129;29062021122159
193;124;29062021122159
194;127;29062021122159
195;124;29062021122159
196;125;29062021122159
197;125;29062021122159
198;124;29062021122159
199;123;29062021122159
200;0;29062021122159
0;0;29062021122200
1;141;29062021122200
2;149;29062021122200
3;146;29062021122200
4;149;29062021122200
5;151;29062021122200
6;151;29062021122200
7;154;29062021122200
8;157;29062021122200
9;157;29062021122200
10;164;29062021122200
11;167;29062021122200
12;169;29062021122200
13;182;29062021122200
14;189;29062021122200
15;208;29062021122200
16;234;29062021122200
17;282;29062021122200
18;391;29062021122200
19;607;29062021122200
20;984;29062021122200
21;1023;29062021122200
22;1023;29062021122200
23;1023;29062021122200
24;1023;29062021122200
25;1002;29062021122200
26;971;29062021122200
27;978;29062021122200
28;1007;29062021122200
29;1023;29062021122200
30;1023;29062021122200
31;1023;29062021122200
32;1023;29062021122200
33;1023;29062021122200
34;1023;29062021122200
35;1023;29062021122200
36;1023;29062021122200
37;1023;29062021122200
38;1012;29062021122200
39;871;29062021122200
40;726;29062021122200
41;624;29062021122200
42;565;29062021122200
43;519;29062021122200
44;493;29062021122200
45;479;29062021122200
46;469;29062021122200
47;458;29062021122200
48;456;29062021122200
49;448;29062021122200
50;446;29062021122200
51;444;29062021122200
52;441;29062021122200
53;447;29062021122200
54;454;29062021122200
55;459;29062021122200
56;467;29062021122200
57;476;29062021122200
58;482;29062021122200
59;491;29062021122200
60;503;29062021122200
61;517;29062021122200
62;518;29062021122200
63;521;29062021122200
64;535;29062021122200
65;530;29062021122200
66;529;29062021122200
67;523;29062021122200
68;519;29062021122200
69;513;29062021122200
70;501;29062021122200
71;488;29062021122200
72;485;29062021122200
73;467;29062021122200
74;454;29062021122200
75;436;29062021122200
76;425;29062021122200
77;416;29062021122200
78;401;29062021122200
79;389;29062021122200
80;378;29062021122200
81;361;29062021122200
82;353;29062021122200
83;344;29062021122200
84;339;29062021122200
85;333;29062021122200
86;327;29062021122200
87;324;29062021122200
88;321;29062021122200
89;310;29062021122200
90;307;29062021122200
91;297;29062021122200
92;286;29062021122200
93;288;29062021122200
94;278;29062021122200
95;266;29062021122200
96;263;29062021122200
97;256;29062021122200
98;249;29062021122200
99;246;29062021122200
100;239;29062021122200
101;240;29062021122200
102;235;29062021122200
103;224;29062021122200
104;225;29062021122200
105;219;29062021122200
106;215;29062021122200
107;211;29062021122200
108;210;29062021122200
109;205;29062021122200
110;200;29062021122200
111;195;29062021122200
112;193;29062021122200
113;190;29062021122200
114;189;29062021122200
115;188;29062021122200
116;183;29062021122200
117;186;29062021122200
118;179;29062021122200
119;180;29062021122200
120;175;29062021122200
121;171;29062021122200
122;175;29062021122200
123;170;29062021122200
124;169;29062021122200
125;167;29062021122200
126;163;29062021122200
127;161;29062021122200
128;162;29062021122200
129;157;29062021122200
130;156;29062021122200
131;156;29062021122200
132;153;29062021122200
133;156;29062021122200
134;149;29062021122200
135;149;29062021122200
136;150;29062021122200
137;144;29062021122200
138;148;29062021122200
139;144;29062021122200
140;144;29062021122200
141;145;29062021122200
142;142;29062021122200
143;140;29062021122200
144;142;29062021122200
145;138;29062021122200
146;139;29062021122200
147;139;29062021122200
148;135;29062021122200
149;137;29062021122200
150;136;29062021122200
151;137;29062021122200
152;134;29062021122200
153;133;29062021122200
154;135;29062021122200
155;134;29062021122200
156;133;29062021122200
157;131;29062021122200
158;131;29062021122200
159;131;29062021122200
160;131;29062021122200
161;129;29062021122200
162;130;29062021122200
163;130;29062021122200
164;130;29062021122200
165;130;29062021122200
166;128;29062021122200
167;129;29062021122200
168;130;29062021122200
169;125;29062021122200
170;129;29062021122200
171;127;29062021122200
172;127;29062021122200
173;129;29062021122200
174;125;29062021122200
175;125;29062021122200
176;128;29062021122200
177;125;29062021122200
178;129;29062021122200
179;126;29062021122200
180;126;29062021122200
181;127;29062021122200
182;127;29062021122200
183;124;29062021122200
184;125;29062021122200
185;123;29062021122200
186;127;29062021122200
187;125;29062021122200
188;124;29062021122200
189;126;29062021122200
190;123;29062021122200
191;125;29062021122200
192;128;29062021122200
193;124;29062021122200
194;126;29062021122200
195;124;29062021122200
196;123;29062021122200
197;125;29062021122200
198;125;29062021122200
199;124;29062021122200
200;0;29062021122200
0;0;29062021122200
1;141;29062021122200
2;149;29062021122200
3;148;29062021122200
4;149;29062021122200
5;149;29062021122200
6;151;29062021122200
7;154;29062021122200
8;157;29062021122200
9;157;29062021122200
10;164;29062021122200
11;166;29062021122200
12;170;29062021122200
13;179;29062021122200
14;188;29062021122200
15;207;29062021122200
16;237;29062021122200
17;284;29062021122200
18;388;29062021122200
19;603;29062021122200
20;980;29062021122200
21;1023;29062021122200
22;1023;29062021122200
23;1023;29062021122200
24;1023;29062021122200
25;1001;29062021122200
26;970;29062021122200
27;977;29062021122200
28;1007;29062021122200
29;1023;29062021122200
30;1023;29062021122200
31;1023;29062021122200
32;1023;29062021122200
33;1023;29062021122200
34;1023;29062021122200
35;1023;29062021122200
36;1023;29062021122200
37;1023;29062021122200
38;1015;29062021122200
39;872;29062021122200
40;725;29062021122200
41;629;29062021122200
42;563;29062021122200
43;515;29062021122200
44;492;29062021122200
45;478;29062021122200
46;465;29062021122200
47;458;29062021122200
48;452;29062021122200
49;447;29062021122200
50;444;29062021122200
51;441;29062021122200
52;439;29062021122200
53;446;29062021122200
54;447;29062021122200
55;454;29062021122200
56;464;29062021122200
57;474;29062021122200
58;481;29062021122200
59;491;29062021122200
60;505;29062021122200
61;512;29062021122200
62;518;29062021122200
63;526;29062021122200
64;532;29062021122200
65;527;29062021122200
66;528;29062021122200
67;528;29062021122200
68;515;29062021122200
69;507;29062021122200
70;500;29062021122200
71;488;29062021122200
72;482;29062021122200
73;464;29062021122200
74;456;29062021122200
75;439;29062021122200
76;424;29062021122200
77;414;29062021122200
78;402;29062021122200
79;391;29062021122200
80;377;29062021122200
81;361;29062021122200
82;352;29062021122200
83;342;29062021122200
84;335;29062021122200
85;330;29062021122200
86;329;29062021122200
87;323;29062021122200
88;317;29062021122200
89;309;29062021122200
90;305;29062021122200
91;298;29062021122200
92;290;29062021122200
93;285;29062021122200
94;273;29062021122200
95;267;29062021122200
96;261;29062021122200
97;255;29062021122200
98;251;29062021122200
99;244;29062021122200
100;241;29062021122200
101;239;29062021122200
102;233;29062021122200
103;225;29062021122200
104;224;29062021122200
105;216;29062021122200
106;216;29062021122200
107;210;29062021122200
108;207;29062021122200
109;206;29062021122200
110;198;29062021122200
111;196;29062021122200
112;194;29062021122200
113;188;29062021122200
114;188;29062021122200
115;188;29062021122200
116;185;29062021122200
117;186;29062021122200
118;179;29062021122200
119;179;29062021122200
120;174;29062021122200
121;171;29062021122200
122;172;29062021122200
123;170;29062021122200
124;169;29062021122200
125;166;29062021122200
126;162;29062021122200
127;161;29062021122200
128;162;29062021122200
129;157;29062021122200
130;157;29062021122200
131;156;29062021122200
132;153;29062021122200
133;158;29062021122200
134;151;29062021122200
135;149;29062021122200
136;150;29062021122200
137;145;29062021122200
138;147;29062021122200
139;143;29062021122200
140;143;29062021122200
141;144;29062021122200
142;141;29062021122200
143;140;29062021122200
144;141;29062021122200
145;138;29062021122200
146;139;29062021122200
147;138;29062021122200
148;136;29062021122200
149;138;29062021122200
150;137;29062021122200
151;136;29062021122200
152;134;29062021122200
153;131;29062021122200
154;134;29062021122200
155;134;29062021122200
156;133;29062021122200
157;132;29062021122200
158;130;29062021122200
159;131;29062021122200
160;131;29062021122200
161;130;29062021122200
162;130;29062021122200
163;130;29062021122200
164;129;29062021122200
165;130;29062021122200
166;128;29062021122200
167;130;29062021122200
168;130;29062021122200
169;127;29062021122200
170;128;29062021122200
171;127;29062021122200
172;127;29062021122200
173;128;29062021122200
174;126;29062021122200
175;126;29062021122200
176;127;29062021122200
177;124;29062021122200
178;129;29062021122200
179;126;29062021122200
180;124;29062021122200
181;126;29062021122200
182;126;29062021122200
183;125;29062021122200
184;127;29062021122200
185;123;29062021122200
186;127;29062021122200
187;125;29062021122200
188;123;29062021122200
189;126;29062021122200
190;123;29062021122200
191;125;29062021122200
192;128;29062021122200
193;124;29062021122200
194;127;29062021122200
195;125;29062021122200
196;123;29062021122200
197;124;29062021122200
198;125;29062021122200
199;123;29062021122200
200;0;29062021122200
0;0;29062021122201
1;141;29062021122201
2;148;29062021122201
3;145;29062021122201
4;148;29062021122201
5;151;29062021122201
6;149;29062021122201
7;154;29062021122201
8;157;29062021122201
9;158;29062021122201
10;163;29062021122201
11;166;29062021122201
12;170;29062021122201
13;181;29062021122201
14;189;29062021122201
15;209;29062021122201
16;236;29062021122201
17;281;29062021122201
18;394;29062021122201
19;607;29062021122201
20;982;29062021122201
21;1023;29062021122201
22;1023;29062021122201
23;1023;29062021122201
24;1023;29062021122201
25;1001;29062021122201
26;969;29062021122201
27;976;29062021122201
28;1004;29062021122201
29;1023;29062021122201
30;1023;29062021122201
31;1023;29062021122201
32;1023;29062021122201
33;1023;29062021122201
34;1023;29062021122201
35;1023;29062021122201
36;1023;29062021122201
37;1023;29062021122201
38;1018;29062021122201
39;877;29062021122201
40;731;29062021122201
41;628;29062021122201
42;562;29062021122201
43;515;29062021122201
44;493;29062021122201
45;480;29062021122201
46;467;29062021122201
47;460;29062021122201
48;459;29062021122201
49;446;29062021122201
50;448;29062021122201
51;446;29062021122201
52;438;29062021122201
53;449;29062021122201
54;449;29062021122201
55;457;29062021122201
56;463;29062021122201
57;475;29062021122201
58;485;29062021122201
59;491;29062021122201
60;506;29062021122201
61;514;29062021122201
62;518;29062021122201
63;527;29062021122201
64;537;29062021122201
65;530;29062021122201
66;531;29062021122201
67;528;29062021122201
68;517;29062021122201
69;513;29062021122201
70;502;29062021122201
71;500;29062021122201
72;484;29062021122201
73;466;29062021122201
74;456;29062021122201
75;439;29062021122201
76;427;29062021122201
77;416;29062021122201
78;403;29062021122201
79;395;29062021122201
80;376;29062021122201
81;356;29062021122201
82;357;29062021122201
83;346;29062021122201
84;338;29062021122201
85;331;29062021122201
86;328;29062021122201
87;326;29062021122201
88;317;29062021122201
89;307;29062021122201
90;310;29062021122201
91;299;29062021122201
92;289;29062021122201
93;285;29062021122201
94;277;29062021122201
95;265;29062021122201
96;263;29062021122201
97;258;29062021122201
98;249;29062021122201
99;245;29062021122201
100;239;29062021122201
101;240;29062021122201
102;233;29062021122201
103;226;29062021122201
104;224;29062021122201
105;218;29062021122201
106;215;29062021122201
107;211;29062021122201
108;211;29062021122201
109;206;29062021122201
110;197;29062021122201
111;195;29062021122201
112;194;29062021122201
113;189;29062021122201
114;189;29062021122201
115;187;29062021122201
116;183;29062021122201
117;185;29062021122201
118;181;29062021122201
119;178;29062021122201
120;175;29062021122201
121;170;29062021122201
122;173;29062021122201
123;169;29062021122201
124;168;29062021122201
125;167;29062021122201
126;162;29062021122201
127;161;29062021122201
128;161;29062021122201
129;158;29062021122201
130;155;29062021122201
131;156;29062021122201
132;153;29062021122201
133;158;29062021122201
134;149;29062021122201
135;149;29062021122201
136;151;29062021122201
137;144;29062021122201
138;149;29062021122201
139;144;29062021122201
140;142;29062021122201
141;145;29062021122201
142;141;29062021122201
143;139;29062021122201
144;141;29062021122201
145;138;29062021122201
146;141;29062021122201
147;140;29062021122201
148;137;29062021122201
149;137;29062021122201
150;137;29062021122201
151;135;29062021122201
152;134;29062021122201
153;132;29062021122201
154;134;29062021122201
155;133;29062021122201
156;132;29062021122201
157;133;29062021122201
158;130;29062021122201
159;129;29062021122201
160;131;29062021122201
161;130;29062021122201
162;130;29062021122201
163;129;29062021122201
164;130;29062021122201
165;131;29062021122201
166;129;29062021122201
167;129;29062021122201
168;131;29062021122201
169;126;29062021122201
170;129;29062021122201
171;126;29062021122201
172;125;29062021122201
173;128;29062021122201
174;127;29062021122201
175;126;29062021122201
176;128;29062021122201
177;125;29062021122201
178;128;29062021122201
179;125;29062021122201
180;126;29062021122201
181;127;29062021122201
182;127;29062021122201
183;125;29062021122201
184;126;29062021122201
185;123;29062021122201
186;128;29062021122201
187;125;29062021122201
188;123;29062021122201
189;125;29062021122201
190;124;29062021122201
191;126;29062021122201
192;128;29062021122201
193;123;29062021122201
194;126;29062021122201
195;125;29062021122201
196;123;29062021122201
197;125;29062021122201
198;125;29062021122201
199;124;29062021122201
200;0;29062021122201
0;0;29062021122202
1;141;29062021122202
2;148;29062021122202
3;146;29062021122202
4;149;29062021122202
5;150;29062021122202
6;153;29062021122202
7;154;29062021122202
8;158;29062021122202
9;157;29062021122202
10;164;29062021122202
11;166;29062021122202
12;170;29062021122202
13;181;29062021122202
14;188;29062021122202
15;206;29062021122202
16;232;29062021122202
17;283;29062021122202
18;390;29062021122202
19;606;29062021122202
20;981;29062021122202
21;1023;29062021122202
22;1023;29062021122202
23;1023;29062021122202
24;1023;29062021122202
25;1001;29062021122202
26;972;29062021122202
27;976;29062021122202
28;1004;29062021122202
29;1023;29062021122202
30;1023;29062021122202
31;1023;29062021122202
32;1023;29062021122202
33;1023;29062021122202
34;1023;29062021122202
35;1023;29062021122202
36;1023;29062021122202
37;1023;29062021122202
38;1020;29062021122202
39;881;29062021122202
40;734;29062021122202
41;629;29062021122202
42;571;29062021122202
43;524;29062021122202
44;498;29062021122202
45;478;29062021122202
46;464;29062021122202
47;460;29062021122202
48;457;29062021122202
49;447;29062021122202
50;445;29062021122202
51;443;29062021122202
52;441;29062021122202
53;446;29062021122202
54;446;29062021122202
55;456;29062021122202
56;465;29062021122202
57;476;29062021122202
58;482;29062021122202
59;496;29062021122202
60;504;29062021122202
61;515;29062021122202
62;517;29062021122202
63;525;29062021122202
64;535;29062021122202
65;525;29062021122202
66;528;29062021122202
67;525;29062021122202
68;517;29062021122202
69;511;29062021122202
70;500;29062021122202
71;486;29062021122202
72;479;29062021122202
73;463;29062021122202
74;455;29062021122202
75;441;29062021122202
76;428;29062021122202
77;418;29062021122202
78;402;29062021122202
79;391;29062021122202
80;376;29062021122202
81;360;29062021122202
82;354;29062021122202
83;341;29062021122202
84;337;29062021122202
85;333;29062021122202
86;329;29062021122202
87;323;29062021122202
88;318;29062021122202
89;309;29062021122202
90;306;29062021122202
91;298;29062021122202
92;287;29062021122202
93;281;29062021122202
94;277;29062021122202
95;267;29062021122202
96;264;29062021122202
97;255;29062021122202
98;249;29062021122202
99;246;29062021122202
100;238;29062021122202
101;238;29062021122202
102;234;29062021122202
103;228;29062021122202
104;223;29062021122202
105;217;29062021122202
106;216;29062021122202
107;211;29062021122202
108;207;29062021122202
109;205;29062021122202
110;198;29062021122202
111;196;29062021122202
112;195;29062021122202
113;189;29062021122202
114;187;29062021122202
115;188;29062021122202
116;185;29062021122202
117;186;29062021122202
118;180;29062021122202
119;181;29062021122202
120;175;29062021122202
121;172;29062021122202
122;173;29062021122202
123;171;29062021122202
124;168;29062021122202
125;167;29062021122202
126;164;29062021122202
127;163;29062021122202
128;163;29062021122202
129;158;29062021122202
130;157;29062021122202
131;156;29062021122202
132;152;29062021122202
133;158;29062021122202
134;150;29062021122202
135;149;29062021122202
136;151;29062021122202
137;145;29062021122202
138;148;29062021122202
139;145;29062021122202
140;144;29062021122202
141;145;29062021122202
142;143;29062021122202
143;141;29062021122202
144;142;29062021122202
145;139;29062021122202
146;140;29062021122202
147;140;29062021122202
148;136;29062021122202
149;137;29062021122202
150;138;29062021122202
151;136;29062021122202
152;134;29062021122202
153;133;29062021122202
154;135;29062021122202
155;135;29062021122202
156;133;29062021122202
157;132;29062021122202
158;130;29062021122202
159;131;29062021122202
160;131;29062021122202
161;128;29062021122202
162;132;29062021122202
163;131;29062021122202
164;130;29062021122202
165;130;29062021122202
166;128;29062021122202
167;130;29062021122202
168;130;29062021122202
169;126;29062021122202
170;128;29062021122202
171;127;29062021122202
172;126;29062021122202
173;130;29062021122202
174;127;29062021122202
175;126;29062021122202
176;128;29062021122202
177;126;29062021122202
178;129;29062021122202
179;127;29062021122202
180;126;29062021122202
181;126;29062021122202
182;128;29062021122202
183;125;29062021122202
184;128;29062021122202
185;123;29062021122202
186;127;29062021122202
187;126;29062021122202
188;124;29062021122202
189;126;29062021122202
190;124;29062021122202
191;126;29062021122202
192;129;29062021122202
193;124;29062021122202
194;126;29062021122202
195;126;29062021122202
196;123;29062021122202
197;124;29062021122202
198;124;29062021122202
199;123;29062021122202
200;0;29062021122202
0;0;29062021122203
1;141;29062021122203
2;147;29062021122203
3;146;29062021122203
4;149;29062021122203
5;149;29062021122203
6;150;29062021122203
7;153;29062021122203
8;158;29062021122203
9;155;29062021122203
10;165;29062021122203
11;167;29062021122203
12;169;29062021122203
13;182;29062021122203
14;189;29062021122203
15;206;29062021122203
16;233;29062021122203
17;283;29062021122203
18;388;29062021122203
19;602;29062021122203
20;979;29062021122203
21;1023;29062021122203
22;1023;29062021122203
23;1023;29062021122203
24;1023;29062021122203
25;1002;29062021122203
26;969;29062021122203
27;976;29062021122203
28;1002;29062021122203
29;1023;29062021122203
30;1023;29062021122203
31;1023;29062021122203
32;1023;29062021122203
33;1023;29062021122203
34;1023;29062021122203
35;1023;29062021122203
36;1023;29062021122203
37;1023;29062021122203
38;1019;29062021122203
39;876;29062021122203
40;732;29062021122203
41;630;29062021122203
42;571;29062021122203
43;522;29062021122203
44;494;29062021122203
45;479;29062021122203
46;467;29062021122203
47;457;29062021122203
48;455;29062021122203
49;447;29062021122203
50;443;29062021122203
51;442;29062021122203
52;437;29062021122203
53;448;29062021122203
54;449;29062021122203
55;458;29062021122203
56;462;29062021122203
57;470;29062021122203
58;483;29062021122203
59;491;29062021122203
60;504;29062021122203
61;515;29062021122203
62;515;29062021122203
63;526;29062021122203
64;534;29062021122203
65;527;29062021122203
66;528;29062021122203
67;527;29062021122203
68;518;29062021122203
69;513;29062021122203
70;499;29062021122203
71;491;29062021122203
72;484;29062021122203
73;465;29062021122203
74;455;29062021122203
75;438;29062021122203
76;425;29062021122203
77;414;29062021122203
78;402;29062021122203
79;390;29062021122203
80;373;29062021122203
81;359;29062021122203
82;358;29062021122203
83;343;29062021122203
84;337;29062021122203
85;332;29062021122203
86;328;29062021122203
87;323;29062021122203
88;320;29062021122203
89;307;29062021122203
90;308;29062021122203
91;302;29062021122203
92;288;29062021122203
93;286;29062021122203
94;278;29062021122203
95;266;29062021122203
96;262;29062021122203
97;254;29062021122203
98;250;29062021122203
99;244;29062021122203
100;238;29062021122203
101;239;29062021122203
102;234;29062021122203
103;226;29062021122203
104;222;29062021122203
105;217;29062021122203
106;217;29062021122203
107;211;29062021122203
108;209;29062021122203
109;203;29062021122203
110;197;29062021122203
111;195;29062021122203
112;194;29062021122203
113;189;29062021122203
114;188;29062021122203
115;187;29062021122203
116;184;29062021122203
117;185;29062021122203
118;179;29062021122203
119;179;29062021122203
120;175;29062021122203
121;171;29062021122203
122;173;29062021122203
123;170;29062021122203
124;169;29062021122203
125;165;29062021122203
126;163;29062021122203
127;162;29062021122203
128;163;29062021122203
129;159;29062021122203
130;157;29062021122203
131;156;29062021122203
132;153;29062021122203
133;159;29062021122203
134;150;29062021122203
135;150;29062021122203
136;149;29062021122203
137;147;29062021122203
138;148;29062021122203
139;144;29062021122203
140;142;29062021122203
141;145;29062021122203
142;141;29062021122203
143;139;29062021122203
144;141;29062021122203
145;138;29062021122203
146;140;29062021122203
147;139;29062021122203
148;135;29062021122203
149;137;29062021122203
150;137;29062021122203
151;136;29062021122203
152;135;29062021122203
153;133;29062021122203
154;135;29062021122203
155;135;29062021122203
156;132;29062021122203
157;131;29062021122203
158;130;29062021122203
159;131;29062021122203
160;130;29062021122203
161;129;29062021122203
162;131;29062021122203
163;131;29062021122203
164;129;29062021122203
165;130;29062021122203
166;128;29062021122203
167;130;29062021122203
168;130;29062021122203
169;127;29062021122203
170;129;29062021122203
171;128;29062021122203
172;126;29062021122203
173;129;29062021122203
174;126;29062021122203
175;125;29062021122203
176;127;29062021122203
177;125;29062021122203
178;129;29062021122203
179;126;29062021122203
180;126;29062021122203
181;126;29062021122203
182;127;29062021122203
183;125;29062021122203
184;125;29062021122203
185;122;29062021122203
186;127;29062021122203
187;125;29062021122203
188;124;29062021122203
189;126;29062021122203
190;123;29062021122203
191;126;29062021122203
192;128;29062021122203
193;123;29062021122203
194;127;29062021122203
195;125;29062021122203
196;124;29062021122203
197;125;29062021122203
198;125;29062021122203
199;123;29062021122203
200;0;29062021122203
0;0;29062021122203
1;141;29062021122203
2;150;29062021122203
3;146;29062021122203
4;147;29062021122203
5;149;29062021122203
6;150;29062021122203
7;154;29062021122203
8;159;29062021122203
9;158;29062021122203
10;162;29062021122203
11;166;29062021122203
12;171;29062021122203
13;181;29062021122203
14;188;29062021122203
15;209;29062021122203
16;233;29062021122203
17;280;29062021122203
18;387;29062021122203
19;605;29062021122203
20;978;29062021122203
21;1023;29062021122203
22;1023;29062021122203
23;1023;29062021122203
24;1023;29062021122203
25;1003;29062021122203
26;967;29062021122203
27;975;29062021122203
28;1004;29062021122203
29;1023;29062021122203
30;1023;29062021122203
31;1023;29062021122203
32;1023;29062021122203
33;1023;29062021122203
34;1023;29062021122203
35;1023;29062021122203
36;1023;29062021122203
37;1023;29062021122203
38;1021;29062021122203
39;884;29062021122203
40;735;29062021122203
41;633;29062021122203
42;569;29062021122203
43;521;29062021122203
44;497;29062021122203
45;476;29062021122203
46;464;29062021122203
47;456;29062021122203
48;452;29062021122203
49;449;29062021122203
50;443;29062021122203
51;441;29062021122203
52;443;29062021122203
53;445;29062021122203
54;447;29062021122203
55;456;29062021122203
56;460;29062021122203
57;471;29062021122203
58;481;29062021122203
59;489;29062021122203
60;500;29062021122203
61;515;29062021122203
62;512;29062021122203
63;525;29062021122203
64;534;29062021122203
65;524;29062021122203
66;528;29062021122203
67;524;29062021122203
68;520;29062021122203
69;510;29062021122203
70;499;29062021122203
71;492;29062021122203
72;481;29062021122203
73;462;29062021122203
74;454;29062021122203
75;440;29062021122203
76;425;29062021122203
77;413;29062021122203
78;399;29062021122203
79;387;29062021122203
80;375;29062021122203
81;357;29062021122203
82;354;29062021122203
83;346;29062021122203
84;337;29062021122203
85;329;29062021122203
86;324;29062021122203
87;324;29062021122203
88;318;29062021122203
89;311;29062021122203
90;307;29062021122203
91;297;29062021122203
92;288;29062021122203
93;285;29062021122203
94;274;29062021122203
95;266;29062021122203
96;261;29062021122203
97;256;29062021122203
98;250;29062021122203
99;245;29062021122203
100;239;29062021122203
101;240;29062021122203
102;233;29062021122203
103;228;29062021122203
104;223;29062021122203
105;217;29062021122203
106;216;29062021122203
107;208;29062021122203
108;208;29062021122203
109;205;29062021122203
110;198;29062021122203
111;195;29062021122203
112;194;29062021122203
113;188;29062021122203
114;188;29062021122203
115;189;29062021122203
116;185;29062021122203
117;185;29062021122203
118;179;29062021122203
119;179;29062021122203
120;176;29062021122203
121;173;29062021122203
122;173;29062021122203
123;171;29062021122203
124;168;29062021122203
125;167;29062021122203
126;163;29062021122203
127;162;29062021122203
128;162;29062021122203
129;157;29062021122203
130;158;29062021122203
131;156;29062021122203
132;153;29062021122203
133;158;29062021122203
134;151;29062021122203
135;150;29062021122203
136;150;29062021122203
137;146;29062021122203
138;148;29062021122203
139;144;29062021122203
140;144;29062021122203
141;145;29062021122203
142;142;29062021122203
143;139;29062021122203
144;141;29062021122203
145;138;29062021122203
146;139;29062021122203
147;139;29062021122203
148;136;29062021122203
149;137;29062021122203
150;137;29062021122203
151;136;29062021122203
152;135;29062021122203
153;134;29062021122203
154;136;29062021122203
155;135;29062021122203
156;132;29062021122203
157;132;29062021122203
158;130;29062021122203
159;129;29062021122203
160;130;29062021122203
161;129;29062021122203
162;131;29062021122203
163;131;29062021122203
164;130;29062021122203
165;131;29062021122203
166;129;29062021122203
167;129;29062021122203
168;130;29062021122203
169;125;29062021122203
170;130;29062021122203
171;127;29062021122203
172;126;29062021122203
173;128;29062021122203
174;126;29062021122203
175;127;29062021122203
176;127;29062021122203
177;124;29062021122203
178;129;29062021122203
179;126;29062021122203
180;125;29062021122203
181;126;29062021122203
182;127;29062021122203
183;126;29062021122203
184;125;29062021122203
185;123;29062021122203
186;127;29062021122203
187;125;29062021122203
188;123;29062021122203
189;126;29062021122203
190;124;29062021122203
191;126;29062021122203
192;128;29062021122203
193;124;29062021122203
194;126;29062021122203
195;125;29062021122203
196;123;29062021122203
197;124;29062021122203
198;125;29062021122203
199;124;29062021122203
200;0;29062021122203
0;0;29062021122204
1;141;29062021122204
2;148;29062021122204
3;147;29062021122204
4;149;29062021122204
5;150;29062021122204
6;151;29062021122204
7;152;29062021122204
8;157;29062021122204
9;157;29062021122204
10;165;29062021122204
11;166;29062021122204
12;170;29062021122204
13;181;29062021122204
14;189;29062021122204
15;204;29062021122204
16;233;29062021122204
17;283;29062021122204
18;389;29062021122204
19;602;29062021122204
20;979;29062021122204
21;1023;29062021122204
22;1023;29062021122204
23;1023;29062021122204
24;1023;29062021122204
25;1003;29062021122204
26;971;29062021122204
27;974;29062021122204
28;1004;29062021122204
29;1023;29062021122204
30;1023;29062021122204
31;1023;29062021122204
32;1023;29062021122204
33;1023;29062021122204
34;1023;29062021122204
35;1023;29062021122204
36;1023;29062021122204
37;1023;29062021122204
38;1022;29062021122204
39;883;29062021122204
40;738;29062021122204
41;633;29062021122204
42;571;29062021122204
43;522;29062021122204
44;492;29062021122204
45;478;29062021122204
46;465;29062021122204
47;458;29062021122204
48;453;29062021122204
49;445;29062021122204
50;444;29062021122204
51;441;29062021122204
52;438;29062021122204
53;443;29062021122204
54;446;29062021122204
55;453;29062021122204
56;463;29062021122204
57;470;29062021122204
58;480;29062021122204
59;490;29062021122204
60;501;29062021122204
61;514;29062021122204
62;516;29062021122204
63;526;29062021122204
64;528;29062021122204
65;526;29062021122204
66;528;29062021122204
67;526;29062021122204
68;521;29062021122204
69;510;29062021122204
70;502;29062021122204
71;491;29062021122204
72;481;29062021122204
73;464;29062021122204
74;455;29062021122204
75;436;29062021122204
76;424;29062021122204
77;415;29062021122204
78;403;29062021122204
79;391;29062021122204
80;376;29062021122204
81;360;29062021122204
82;352;29062021122204
83;342;29062021122204
84;339;29062021122204
85;332;29062021122204
86;326;29062021122204
87;323;29062021122204
88;317;29062021122204
89;308;29062021122204
90;307;29062021122204
91;294;29062021122204
92;288;29062021122204
93;285;29062021122204
94;275;29062021122204
95;267;29062021122204
96;263;29062021122204
97;255;29062021122204
98;249;29062021122204
99;243;29062021122204
100;237;29062021122204
101;238;29062021122204
102;233;29062021122204
103;224;29062021122204
104;223;29062021122204
105;217;29062021122204
106;217;29062021122204
107;210;29062021122204
108;208;29062021122204
109;206;29062021122204
110;197;29062021122204
111;195;29062021122204
112;194;29062021122204
113;190;29062021122204
114;189;29062021122204
115;187;29062021122204
116;183;29062021122204
117;184;29062021122204
118;179;29062021122204
119;179;29062021122204
120;175;29062021122204
121;172;29062021122204
122;171;29062021122204
123;171;29062021122204
124;168;29062021122204
125;166;29062021122204
126;162;29062021122204
127;162;29062021122204
128;162;29062021122204
129;158;29062021122204
130;156;29062021122204
131;157;29062021122204
132;152;29062021122204
133;158;29062021122204
134;149;29062021122204
135;149;29062021122204
136;149;29062021122204
137;146;29062021122204
138;148;29062021122204
139;145;29062021122204
140;144;29062021122204
141;146;29062021122204
142;142;29062021122204
143;139;29062021122204
144;142;29062021122204
145;138;29062021122204
146;139;29062021122204
147;140;29062021122204
148;137;29062021122204
149;138;29062021122204
150;137;29062021122204
151;137;29062021122204
152;134;29062021122204
153;133;29062021122204
154;135;29062021122204
155;134;29062021122204
156;132;29062021122204
157;131;29062021122204
158;131;29062021122204
159;130;29062021122204
160;131;29062021122204
161;130;29062021122204
162;129;29062021122204
163;131;29062021122204
164;129;29062021122204
165;132;29062021122204
166;128;29062021122204
167;129;29062021122204
168;130;29062021122204
169;126;29062021122204
170;128;29062021122204
171;126;29062021122204
172;127;29062021122204
173;128;29062021122204
174;126;29062021122204
175;125;29062021122204
176;128;29062021122204
177;124;29062021122204
178;128;29062021122204
179;127;29062021122204
180;125;29062021122204
181;126;29062021122204
182;128;29062021122204
183;125;29062021122204
184;127;29062021122204
185;123;29062021122204
186;127;29062021122204
187;124;29062021122204
188;124;29062021122204
189;126;29062021122204
190;123;29062021122204
191;126;29062021122204
192;128;29062021122204
193;124;29062021122204
194;127;29062021122204
195;125;29062021122204
196;123;29062021122204
197;124;29062021122204
198;126;29062021122204
199;124;29062021122204
200;0;29062021122204
0;0;29062021122204
1;141;29062021122204
2;148;29062021122204
3;146;29062021122204
4;150;29062021122204
5;151;29062021122204
6;151;29062021122204
7;155;29062021122204
8;157;29062021122204
9;157;29062021122204
10;164;29062021122204
11;167;29062021122204
12;170;29062021122204
13;182;29062021122204
14;189;29062021122204
15;207;29062021122204
16;234;29062021122204
17;281;29062021122204
18;387;29062021122204
19;606;29062021122204
20;977;29062021122204
21;1023;29062021122204
22;1023;29062021122204
23;1023;29062021122204
24;1023;29062021122204
25;1004;29062021122204
26;970;29062021122204
27;978;29062021122204
28;1003;29062021122204
29;1023;29062021122204
30;1023;29062021122204
31;1023;29062021122204
32;1023;29062021122204
33;1023;29062021122204
34;1023;29062021122204
35;1023;29062021122204
36;1023;29062021122204
37;1023;29062021122204
38;1021;29062021122204
39;885;29062021122204
40;735;29062021122204
41;634;29062021122204
42;574;29062021122204
43;520;29062021122204
44;492;29062021122204
45;478;29062021122204
46;466;29062021122204
47;459;29062021122204
48;454;29062021122204
49;444;29062021122204
50;444;29062021122204
51;443;29062021122204
52;437;29062021122204
53;441;29062021122204
54;447;29062021122204
55;453;29062021122204
56;464;29062021122204
57;466;29062021122204
58;484;29062021122204
59;487;29062021122204
60;502;29062021122204
61;510;29062021122204
62;514;29062021122204
63;523;29062021122204
64;530;29062021122204
65;525;29062021122204
66;528;29062021122204
67;524;29062021122204
68;516;29062021122204
69;510;29062021122204
70;497;29062021122204
71;486;29062021122204
72;482;29062021122204
73;466;29062021122204
74;454;29062021122204
75;435;29062021122204
76;427;29062021122204
77;415;29062021122204
78;401;29062021122204
79;391;29062021122204
80;375;29062021122204
81;359;29062021122204
82;354;29062021122204
83;342;29062021122204
84;338;29062021122204
85;329;29062021122204
86;328;29062021122204
87;321;29062021122204
88;314;29062021122204
89;307;29062021122204
90;308;29062021122204
91;299;29062021122204
92;288;29062021122204
93;284;29062021122204
94;275;29062021122204
95;265;29062021122204
96;264;29062021122204
97;255;29062021122204
98;247;29062021122204
99;244;29062021122204
100;237;29062021122204
101;241;29062021122204
102;232;29062021122204
103;226;29062021122204
104;221;29062021122204
105;215;29062021122204
106;216;29062021122204
107;211;29062021122204
108;207;29062021122204
109;203;29062021122204
110;200;29062021122204
111;196;29062021122204
112;194;29062021122204
113;190;29062021122204
114;190;29062021122204
115;188;29062021122204
116;183;29062021122204
117;185;29062021122204
118;182;29062021122204
119;179;29062021122204
120;175;29062021122204
121;173;29062021122204
122;173;29062021122204
123;169;29062021122204
124;169;29062021122204
125;167;29062021122204
126;162;29062021122204
127;162;29062021122204
128;163;29062021122204
129;158;29062021122204
130;157;29062021122204
131;157;29062021122204
132;152;29062021122204
133;157;29062021122204
134;149;29062021122204
135;150;29062021122204
136;150;29062021122204
137;146;29062021122204
138;148;29062021122204
139;144;29062021122204
140;144;29062021122204
141;144;29062021122204
142;141;29062021122204
143;139;29062021122204
144;142;29062021122204
145;137;29062021122204
146;139;29062021122204
147;140;29062021122204
148;136;29062021122204
149;138;29062021122204
150;137;29062021122204
151;136;29062021122204
152;134;29062021122204
153;134;29062021122204
154;135;29062021122204
155;134;29062021122204
156;132;29062021122204
157;132;29062021122204
158;132;29062021122204
159;131;29062021122204
160;131;29062021122204
161;130;29062021122204
162;131;29062021122204
163;130;29062021122204
164;130;29062021122204
165;130;29062021122204
166;128;29062021122204
167;128;29062021122204
168;131;29062021122204
169;125;29062021122204
170;129;29062021122204
171;127;29062021122204
172;126;29062021122204
173;128;29062021122204
174;127;29062021122204
175;125;29062021122204
176;128;29062021122204
177;124;29062021122204
178;128;29062021122204
179;127;29062021122204
180;126;29062021122204
181;126;29062021122204
182;128;29062021122204
183;125;29062021122204
184;127;29062021122204
185;122;29062021122204
186;127;29062021122204
187;125;29062021122204
188;124;29062021122204
189;125;29062021122204
190;124;29062021122204
191;126;29062021122204
192;128;29062021122204
193;125;29062021122204
194;126;29062021122204
195;125;29062021122204
196;123;29062021122204
197;124;29062021122204
198;126;29062021122204
199;123;29062021122204
200;0;29062021122204
