ind;val;datetime
0;0;04062021130045
1;171;04062021130045
2;166;04062021130045
3;163;04062021130045
4;163;04062021130045
5;163;04062021130045
6;160;04062021130045
7;163;04062021130045
8;165;04062021130045
9;160;04062021130045
10;165;04062021130045
11;162;04062021130045
12;161;04062021130045
13;169;04062021130045
14;164;04062021130045
15;167;04062021130045
16;169;04062021130045
17;172;04062021130045
18;187;04062021130045
19;206;04062021130045
20;254;04062021130045
21;387;04062021130045
22;737;04062021130045
23;1023;04062021130045
24;1023;04062021130045
25;1023;04062021130045
26;1023;04062021130045
27;1023;04062021130045
28;1023;04062021130045
29;1023;04062021130045
30;1023;04062021130045
31;1023;04062021130045
32;771;04062021130045
33;615;04062021130045
34;524;04062021130045
35;469;04062021130045
36;438;04062021130045
37;435;04062021130045
38;433;04062021130045
39;444;04062021130045
40;454;04062021130045
41;463;04062021130045
42;486;04062021130045
43;490;04062021130045
44;497;04062021130045
45;505;04062021130045
46;510;04062021130045
47;514;04062021130045
48;522;04062021130045
49;525;04062021130045
50;529;04062021130045
51;535;04062021130045
52;537;04062021130045
53;551;04062021130045
54;557;04062021130045
55;567;04062021130045
56;577;04062021130045
57;589;04062021130045
58;607;04062021130045
59;611;04062021130045
60;622;04062021130045
61;631;04062021130045
62;634;04062021130045
63;646;04062021130045
64;647;04062021130045
65;639;04062021130045
66;648;04062021130045
67;638;04062021130045
68;637;04062021130045
69;643;04062021130045
70;644;04062021130045
71;660;04062021130045
72;669;04062021130045
73;663;04062021130045
74;659;04062021130045
75;622;04062021130045
76;584;04062021130045
77;545;04062021130045
78;501;04062021130045
79;474;04062021130045
80;447;04062021130045
81;416;04062021130045
82;406;04062021130045
83;391;04062021130045
84;381;04062021130045
85;372;04062021130045
86;366;04062021130045
87;360;04062021130045
88;355;04062021130045
89;343;04062021130045
90;339;04062021130045
91;330;04062021130045
92;317;04062021130045
93;313;04062021130045
94;305;04062021130045
95;291;04062021130045
96;290;04062021130045
97;283;04062021130045
98;275;04062021130045
99;268;04062021130045
100;263;04062021130045
101;263;04062021130045
102;253;04062021130045
103;249;04062021130045
104;245;04062021130045
105;238;04062021130045
106;240;04062021130045
107;230;04062021130045
108;230;04062021130045
109;226;04062021130045
110;219;04062021130045
111;218;04062021130045
112;216;04062021130045
113;210;04062021130045
114;208;04062021130045
115;209;04062021130045
116;205;04062021130045
117;206;04062021130045
118;200;04062021130045
119;199;04062021130045
120;197;04062021130045
121;192;04062021130045
122;193;04062021130045
123;189;04062021130045
124;186;04062021130045
125;186;04062021130045
126;183;04062021130045
127;183;04062021130045
128;186;04062021130045
129;181;04062021130045
130;179;04062021130045
131;180;04062021130045
132;175;04062021130045
133;180;04062021130045
134;173;04062021130045
135;172;04062021130045
136;173;04062021130045
137;168;04062021130045
138;172;04062021130045
139;168;04062021130045
140;165;04062021130045
141;168;04062021130045
142;166;04062021130045
143;164;04062021130045
144;166;04062021130045
145;161;04062021130045
146;163;04062021130045
147;164;04062021130045
148;158;04062021130045
149;160;04062021130045
150;160;04062021130045
151;159;04062021130045
152;159;04062021130045
153;156;04062021130045
154;158;04062021130045
155;157;04062021130045
156;155;04062021130045
157;155;04062021130045
158;154;04062021130045
159;154;04062021130045
160;154;04062021130045
161;153;04062021130045
162;155;04062021130045
163;155;04062021130045
164;153;04062021130045
165;155;04062021130045
166;152;04062021130045
167;153;04062021130045
168;154;04062021130045
169;150;04062021130045
170;153;04062021130045
171;152;04062021130045
172;150;04062021130045
173;154;04062021130045
174;151;04062021130045
175;151;04062021130045
176;152;04062021130045
177;149;04062021130045
178;153;04062021130045
179;152;04062021130045
180;149;04062021130045
181;151;04062021130045
182;151;04062021130045
183;150;04062021130045
184;151;04062021130045
185;147;04062021130045
186;152;04062021130045
187;150;04062021130045
188;149;04062021130045
189;151;04062021130045
190;149;04062021130045
191;150;04062021130045
192;153;04062021130045
193;149;04062021130045
194;154;04062021130045
195;149;04062021130045
196;149;04062021130045
197;149;04062021130045
198;150;04062021130045
199;147;04062021130045
200;0;04062021130045
0;0;04062021130046
1;170;04062021130046
2;166;04062021130046
3;163;04062021130046
4;165;04062021130046
5;166;04062021130046
6;162;04062021130046
7;165;04062021130046
8;167;04062021130046
9;164;04062021130046
10;168;04062021130046
11;164;04062021130046
12;163;04062021130046
13;169;04062021130046
14;167;04062021130046
15;171;04062021130046
16;173;04062021130046
17;177;04062021130046
18;192;04062021130046
19;215;04062021130046
20;274;04062021130046
21;427;04062021130046
22;822;04062021130046
23;1023;04062021130046
24;1023;04062021130046
25;1023;04062021130046
26;1023;04062021130046
27;1023;04062021130046
28;1023;04062021130046
29;1023;04062021130046
30;1023;04062021130046
31;1023;04062021130046
32;880;04062021130046
33;702;04062021130046
34;596;04062021130046
35;529;04062021130046
36;488;04062021130046
37;484;04062021130046
38;483;04062021130046
39;497;04062021130046
40;503;04062021130046
41;517;04062021130046
42;541;04062021130046
43;546;04062021130046
44;557;04062021130046
45;565;04062021130046
46;572;04062021130046
47;573;04062021130046
48;584;04062021130046
49;590;04062021130046
50;594;04062021130046
51;604;04062021130046
52;600;04062021130046
53;616;04062021130046
54;626;04062021130046
55;642;04062021130046
56;652;04062021130046
57;662;04062021130046
58;680;04062021130046
59;684;04062021130046
60;701;04062021130046
61;717;04062021130046
62;718;04062021130046
63;731;04062021130046
64;734;04062021130046
65;723;04062021130046
66;723;04062021130046
67;719;04062021130046
68;717;04062021130046
69;719;04062021130046
70;732;04062021130046
71;745;04062021130046
72;756;04062021130046
73;744;04062021130046
74;744;04062021130046
75;694;04062021130046
76;659;04062021130046
77;608;04062021130046
78;563;04062021130046
79;530;04062021130046
80;493;04062021130046
81;465;04062021130046
82;455;04062021130046
83;433;04062021130046
84;421;04062021130046
85;410;04062021130046
86;403;04062021130046
87;397;04062021130046
88;393;04062021130046
89;376;04062021130046
90;373;04062021130046
91;361;04062021130046
92;346;04062021130046
93;339;04062021130046
94;328;04062021130046
95;318;04062021130046
96;311;04062021130046
97;304;04062021130046
98;299;04062021130046
99;289;04062021130046
100;283;04062021130046
101;279;04062021130046
102;272;04062021130046
103;266;04062021130046
104;265;04062021130046
105;253;04062021130046
106;256;04062021130046
107;248;04062021130046
108;244;04062021130046
109;239;04062021130046
110;233;04062021130046
111;231;04062021130046
112;227;04062021130046
113;221;04062021130046
114;220;04062021130046
115;218;04062021130046
116;213;04062021130046
117;214;04062021130046
118;210;04062021130046
119;208;04062021130046
120;203;04062021130046
121;199;04062021130046
122;199;04062021130046
123;197;04062021130046
124;194;04062021130046
125;193;04062021130046
126;189;04062021130046
127;188;04062021130046
128;189;04062021130046
129;183;04062021130046
130;185;04062021130046
131;182;04062021130046
132;180;04062021130046
133;184;04062021130046
134;176;04062021130046
135;175;04062021130046
136;174;04062021130046
137;171;04062021130046
138;174;04062021130046
139;172;04062021130046
140;169;04062021130046
141;171;04062021130046
142;166;04062021130046
143;162;04062021130046
144;168;04062021130046
145;162;04062021130046
146;165;04062021130046
147;164;04062021130046
148;161;04062021130046
149;160;04062021130046
150;159;04062021130046
151;160;04062021130046
152;159;04062021130046
153;157;04062021130046
154;160;04062021130046
155;159;04062021130046
156;156;04062021130046
157;158;04062021130046
158;156;04062021130046
159;154;04062021130046
160;156;04062021130046
161;154;04062021130046
162;156;04062021130046
163;155;04062021130046
164;153;04062021130046
165;155;04062021130046
166;152;04062021130046
167;153;04062021130046
168;155;04062021130046
169;150;04062021130046
170;155;04062021130046
171;152;04062021130046
172;151;04062021130046
173;153;04062021130046
174;150;04062021130046
175;150;04062021130046
176;151;04062021130046
177;148;04062021130046
178;153;04062021130046
179;151;04062021130046
180;150;04062021130046
181;151;04062021130046
182;150;04062021130046
183;149;04062021130046
184;149;04062021130046
185;147;04062021130046
186;151;04062021130046
187;150;04062021130046
188;148;04062021130046
189;150;04062021130046
190;147;04062021130046
191;150;04062021130046
192;152;04062021130046
193;147;04062021130046
194;150;04062021130046
195;149;04062021130046
196;149;04062021130046
197;149;04062021130046
198;149;04062021130046
199;148;04062021130046
200;0;04062021130046
0;0;04062021130051
1;171;04062021130051
2;165;04062021130051
3;163;04062021130051
4;165;04062021130051
5;166;04062021130051
6;163;04062021130051
7;166;04062021130051
8;167;04062021130051
9;164;04062021130051
10;167;04062021130051
11;165;04062021130051
12;165;04062021130051
13;170;04062021130051
14;168;04062021130051
15;171;04062021130051
16;173;04062021130051
17;176;04062021130051
18;191;04062021130051
19;214;04062021130051
20;273;04062021130051
21;425;04062021130051
22;811;04062021130051
23;1023;04062021130051
24;1023;04062021130051
25;1023;04062021130051
26;1023;04062021130051
27;1023;04062021130051
28;1023;04062021130051
29;1023;04062021130051
30;1023;04062021130051
31;1023;04062021130051
32;877;04062021130051
33;691;04062021130051
34;588;04062021130051
35;527;04062021130051
36;487;04062021130051
37;478;04062021130051
38;482;04062021130051
39;492;04062021130051
40;504;04062021130051
41;520;04062021130051
42;536;04062021130051
43;543;04062021130051
44;554;04062021130051
45;562;04062021130051
46;568;04062021130051
47;574;04062021130051
48;581;04062021130051
49;584;04062021130051
50;589;04062021130051
51;599;04062021130051
52;602;04062021130051
53;614;04062021130051
54;626;04062021130051
55;632;04062021130051
56;647;04062021130051
57;654;04062021130051
58;672;04062021130051
59;684;04062021130051
60;700;04062021130051
61;713;04062021130051
62;711;04062021130051
63;720;04062021130051
64;729;04062021130051
65;721;04062021130051
66;722;04062021130051
67;720;04062021130051
68;711;04062021130051
69;713;04062021130051
70;725;04062021130051
71;738;04062021130051
72;756;04062021130051
73;742;04062021130051
74;736;04062021130051
75;692;04062021130051
76;648;04062021130051
77;606;04062021130051
78;563;04062021130051
79;529;04062021130051
80;496;04062021130051
81;464;04062021130051
82;450;04062021130051
83;431;04062021130051
84;418;04062021130051
85;409;04062021130051
86;402;04062021130051
87;394;04062021130051
88;389;04062021130051
89;372;04062021130051
90;370;04062021130051
91;355;04062021130051
92;346;04062021130051
93;336;04062021130051
94;330;04062021130051
95;321;04062021130051
96;309;04062021130051
97;302;04062021130051
98;295;04062021130051
99;289;04062021130051
100;281;04062021130051
101;280;04062021130051
102;274;04062021130051
103;265;04062021130051
104;262;04062021130051
105;255;04062021130051
106;252;04062021130051
107;246;04062021130051
108;240;04062021130051
109;240;04062021130051
110;234;04062021130051
111;228;04062021130051
112;226;04062021130051
113;220;04062021130051
114;220;04062021130051
115;219;04062021130051
116;212;04062021130051
117;216;04062021130051
118;210;04062021130051
119;207;04062021130051
120;203;04062021130051
121;201;04062021130051
122;199;04062021130051
123;196;04062021130051
124;195;04062021130051
125;194;04062021130051
126;187;04062021130051
127;190;04062021130051
128;189;04062021130051
129;185;04062021130051
130;184;04062021130051
131;181;04062021130051
132;177;04062021130051
133;184;04062021130051
134;176;04062021130051
135;175;04062021130051
136;176;04062021130051
137;171;04062021130051
138;171;04062021130051
139;170;04062021130051
140;169;04062021130051
141;169;04062021130051
142;167;04062021130051
143;165;04062021130051
144;167;04062021130051
145;163;04062021130051
146;166;04062021130051
147;164;04062021130051
148;160;04062021130051
149;161;04062021130051
150;160;04062021130051
151;161;04062021130051
152;158;04062021130051
153;156;04062021130051
154;160;04062021130051
155;157;04062021130051
156;155;04062021130051
157;157;04062021130051
158;156;04062021130051
159;156;04062021130051
160;155;04062021130051
161;153;04062021130051
162;155;04062021130051
163;155;04062021130051
164;154;04062021130051
165;156;04062021130051
166;153;04062021130051
167;153;04062021130051
168;154;04062021130051
169;151;04062021130051
170;153;04062021130051
171;152;04062021130051
172;151;04062021130051
173;154;04062021130051
174;150;04062021130051
175;151;04062021130051
176;153;04062021130051
177;150;04062021130051
178;153;04062021130051
179;150;04062021130051
180;150;04062021130051
181;151;04062021130051
182;152;04062021130051
183;150;04062021130051
184;151;04062021130051
185;148;04062021130051
186;152;04062021130051
187;150;04062021130051
188;148;04062021130051
189;152;04062021130051
190;149;04062021130051
191;151;04062021130051
192;154;04062021130051
193;148;04062021130051
194;152;04062021130051
195;149;04062021130051
196;149;04062021130051
197;149;04062021130051
198;150;04062021130051
199;148;04062021130051
200;0;04062021130051
0;0;04062021130052
1;171;04062021130052
2;167;04062021130052
3;165;04062021130052
4;164;04062021130052
5;165;04062021130052
6;162;04062021130052
7;165;04062021130052
8;167;04062021130052
9;163;04062021130052
10;168;04062021130052
11;165;04062021130052
12;164;04062021130052
13;169;04062021130052
14;166;04062021130052
15;171;04062021130052
16;172;04062021130052
17;175;04062021130052
18;191;04062021130052
19;213;04062021130052
20;268;04062021130052
21;425;04062021130052
22;810;04062021130052
23;1023;04062021130052
24;1023;04062021130052
25;1023;04062021130052
26;1023;04062021130052
27;1023;04062021130052
28;1023;04062021130052
29;1023;04062021130052
30;1023;04062021130052
31;1023;04062021130052
32;880;04062021130052
33;706;04062021130052
34;595;04062021130052
35;530;04062021130052
36;491;04062021130052
37;482;04062021130052
38;487;04062021130052
39;491;04062021130052
40;510;04062021130052
41;520;04062021130052
42;538;04062021130052
43;549;04062021130052
44;558;04062021130052
45;570;04062021130052
46;572;04062021130052
47;577;04062021130052
48;581;04062021130052
49;587;04062021130052
50;592;04062021130052
51;599;04062021130052
52;602;04062021130052
53;621;04062021130052
54;628;04062021130052
55;640;04062021130052
56;651;04062021130052
57;666;04062021130052
58;679;04062021130052
59;688;04062021130052
60;705;04062021130052
61;713;04062021130052
62;716;04062021130052
63;731;04062021130052
64;731;04062021130052
65;724;04062021130052
66;728;04062021130052
67;717;04062021130052
68;718;04062021130052
69;721;04062021130052
70;726;04062021130052
71;744;04062021130052
72;752;04062021130052
73;745;04062021130052
74;740;04062021130052
75;703;04062021130052
76;654;04062021130052
77;611;04062021130052
78;569;04062021130052
79;525;04062021130052
80;496;04062021130052
81;465;04062021130052
82;450;04062021130052
83;434;04062021130052
84;418;04062021130052
85;407;04062021130052
86;400;04062021130052
87;399;04062021130052
88;388;04062021130052
89;377;04062021130052
90;372;04062021130052
91;359;04062021130052
92;347;04062021130052
93;337;04062021130052
94;329;04062021130052
95;318;04062021130052
96;313;04062021130052
97;304;04062021130052
98;298;04062021130052
99;289;04062021130052
100;283;04062021130052
101;280;04062021130052
102;272;04062021130052
103;265;04062021130052
104;262;04062021130052
105;253;04062021130052
106;254;04062021130052
107;247;04062021130052
108;241;04062021130052
109;239;04062021130052
110;231;04062021130052
111;228;04062021130052
112;226;04062021130052
113;222;04062021130052
114;219;04062021130052
115;218;04062021130052
116;211;04062021130052
117;213;04062021130052
118;209;04062021130052
119;209;04062021130052
120;205;04062021130052
121;201;04062021130052
122;199;04062021130052
123;195;04062021130052
124;193;04062021130052
125;193;04062021130052
126;189;04062021130052
127;188;04062021130052
128;191;04062021130052
129;182;04062021130052
130;183;04062021130052
131;182;04062021130052
132;178;04062021130052
133;184;04062021130052
134;176;04062021130052
135;175;04062021130052
136;176;04062021130052
137;172;04062021130052
138;173;04062021130052
139;170;04062021130052
140;167;04062021130052
141;170;04062021130052
142;167;04062021130052
143;163;04062021130052
144;167;04062021130052
145;163;04062021130052
146;165;04062021130052
147;164;04062021130052
148;161;04062021130052
149;160;04062021130052
150;161;04062021130052
151;159;04062021130052
152;159;04062021130052
153;158;04062021130052
154;158;04062021130052
155;158;04062021130052
156;156;04062021130052
157;155;04062021130052
158;154;04062021130052
159;154;04062021130052
160;155;04062021130052
161;154;04062021130052
162;155;04062021130052
163;156;04062021130052
164;154;04062021130052
165;156;04062021130052
166;152;04062021130052
167;154;04062021130052
168;154;04062021130052
169;149;04062021130052
170;154;04062021130052
171;152;04062021130052
172;150;04062021130052
173;153;04062021130052
174;151;04062021130052
175;149;04062021130052
176;152;04062021130052
177;149;04062021130052
178;152;04062021130052
179;151;04062021130052
180;149;04062021130052
181;152;04062021130052
182;152;04062021130052
183;150;04062021130052
184;151;04062021130052
185;147;04062021130052
186;152;04062021130052
187;150;04062021130052
188;148;04062021130052
189;150;04062021130052
190;149;04062021130052
191;149;04062021130052
192;153;04062021130052
193;148;04062021130052
194;149;04062021130052
195;148;04062021130052
196;148;04062021130052
197;150;04062021130052
198;150;04062021130052
199;147;04062021130052
200;0;04062021130052
0;0;04062021130055
1;171;04062021130055
2;167;04062021130055
3;163;04062021130055
4;165;04062021130055
5;164;04062021130055
6;162;04062021130055
7;164;04062021130055
8;167;04062021130055
9;163;04062021130055
10;168;04062021130055
11;166;04062021130055
12;164;04062021130055
13;169;04062021130055
14;166;04062021130055
15;171;04062021130055
16;174;04062021130055
17;176;04062021130055
18;190;04062021130055
19;215;04062021130055
20;271;04062021130055
21;421;04062021130055
22;811;04062021130055
23;1023;04062021130055
24;1023;04062021130055
25;1023;04062021130055
26;1023;04062021130055
27;1023;04062021130055
28;1023;04062021130055
29;1023;04062021130055
30;1023;04062021130055
31;1023;04062021130055
32;878;04062021130055
33;697;04062021130055
34;594;04062021130055
35;526;04062021130055
36;489;04062021130055
37;481;04062021130055
38;483;04062021130055
39;494;04062021130055
40;513;04062021130055
41;518;04062021130055
42;537;04062021130055
43;545;04062021130055
44;559;04062021130055
45;566;04062021130055
46;569;04062021130055
47;575;04062021130055
48;579;04062021130055
49;582;04062021130055
50;587;04062021130055
51;599;04062021130055
52;603;04062021130055
53;616;04062021130055
54;626;04062021130055
55;631;04062021130055
56;647;04062021130055
57;663;04062021130055
58;680;04062021130055
59;687;04062021130055
60;701;04062021130055
61;714;04062021130055
62;713;04062021130055
63;723;04062021130055
64;732;04062021130055
65;722;04062021130055
66;721;04062021130055
67;716;04062021130055
68;713;04062021130055
69;717;04062021130055
70;727;04062021130055
71;743;04062021130055
72;753;04062021130055
73;746;04062021130055
74;738;04062021130055
75;703;04062021130055
76;653;04062021130055
77;610;04062021130055
78;564;04062021130055
79;531;04062021130055
80;491;04062021130055
81;465;04062021130055
82;452;04062021130055
83;432;04062021130055
84;420;04062021130055
85;409;04062021130055
86;402;04062021130055
87;395;04062021130055
88;384;04062021130055
89;375;04062021130055
90;368;04062021130055
91;361;04062021130055
92;346;04062021130055
93;336;04062021130055
94;329;04062021130055
95;317;04062021130055
96;311;04062021130055
97;301;04062021130055
98;294;04062021130055
99;292;04062021130055
100;279;04062021130055
101;281;04062021130055
102;269;04062021130055
103;266;04062021130055
104;261;04062021130055
105;254;04062021130055
106;255;04062021130055
107;244;04062021130055
108;242;04062021130055
109;237;04062021130055
110;232;04062021130055
111;229;04062021130055
112;227;04062021130055
113;222;04062021130055
114;219;04062021130055
115;220;04062021130055
116;214;04062021130055
117;215;04062021130055
118;208;04062021130055
119;206;04062021130055
120;203;04062021130055
121;199;04062021130055
122;200;04062021130055
123;196;04062021130055
124;193;04062021130055
125;192;04062021130055
126;188;04062021130055
127;188;04062021130055
128;191;04062021130055
129;184;04062021130055
130;183;04062021130055
131;182;04062021130055
132;177;04062021130055
133;184;04062021130055
134;175;04062021130055
135;174;04062021130055
136;175;04062021130055
137;172;04062021130055
138;173;04062021130055
139;171;04062021130055
140;167;04062021130055
141;170;04062021130055
142;166;04062021130055
143;165;04062021130055
144;165;04062021130055
145;162;04062021130055
146;164;04062021130055
147;164;04062021130055
148;162;04062021130055
149;161;04062021130055
150;158;04062021130055
151;160;04062021130055
152;158;04062021130055
153;156;04062021130055
154;159;04062021130055
155;158;04062021130055
156;155;04062021130055
157;156;04062021130055
158;155;04062021130055
159;154;04062021130055
160;155;04062021130055
161;154;04062021130055
162;155;04062021130055
163;154;04062021130055
164;154;04062021130055
165;155;04062021130055
166;152;04062021130055
167;153;04062021130055
168;155;04062021130055
169;149;04062021130055
170;153;04062021130055
171;152;04062021130055
172;150;04062021130055
173;152;04062021130055
174;151;04062021130055
175;150;04062021130055
176;152;04062021130055
177;148;04062021130055
178;153;04062021130055
179;150;04062021130055
180;150;04062021130055
181;151;04062021130055
182;151;04062021130055
183;149;04062021130055
184;150;04062021130055
185;147;04062021130055
186;152;04062021130055
187;150;04062021130055
188;148;04062021130055
189;150;04062021130055
190;147;04062021130055
191;149;04062021130055
192;152;04062021130055
193;148;04062021130055
194;150;04062021130055
195;149;04062021130055
196;148;04062021130055
197;150;04062021130055
198;148;04062021130055
199;147;04062021130055
200;0;04062021130055
0;0;04062021130056
1;171;04062021130056
2;167;04062021130056
3;161;04062021130056
4;164;04062021130056
5;166;04062021130056
6;163;04062021130056
7;164;04062021130056
8;167;04062021130056
9;163;04062021130056
10;168;04062021130056
11;165;04062021130056
12;165;04062021130056
13;170;04062021130056
14;167;04062021130056
15;172;04062021130056
16;173;04062021130056
17;177;04062021130056
18;192;04062021130056
19;216;04062021130056
20;270;04062021130056
21;422;04062021130056
22;812;04062021130056
23;1023;04062021130056
24;1023;04062021130056
25;1023;04062021130056
26;1023;04062021130056
27;1023;04062021130056
28;1023;04062021130056
29;1023;04062021130056
30;1023;04062021130056
31;1023;04062021130056
32;882;04062021130056
33;711;04062021130056
34;596;04062021130056
35;525;04062021130056
36;490;04062021130056
37;480;04062021130056
38;487;04062021130056
39;498;04062021130056
40;503;04062021130056
41;520;04062021130056
42;539;04062021130056
43;548;04062021130056
44;564;04062021130056
45;569;04062021130056
46;570;04062021130056
47;580;04062021130056
48;586;04062021130056
49;588;04062021130056
50;598;04062021130056
51;602;04062021130056
52;607;04062021130056
53;620;04062021130056
54;625;04062021130056
55;636;04062021130056
56;646;04062021130056
57;659;04062021130056
58;678;04062021130056
59;692;04062021130056
60;702;04062021130056
61;713;04062021130056
62;717;04062021130056
63;729;04062021130056
64;731;04062021130056
65;724;04062021130056
66;721;04062021130056
67;716;04062021130056
68;718;04062021130056
69;716;04062021130056
70;732;04062021130056
71;746;04062021130056
72;755;04062021130056
73;748;04062021130056
74;739;04062021130056
75;701;04062021130056
76;654;04062021130056
77;610;04062021130056
78;563;04062021130056
79;526;04062021130056
80;496;04062021130056
81;468;04062021130056
82;452;04062021130056
83;432;04062021130056
84;423;04062021130056
85;410;04062021130056
86;402;04062021130056
87;396;04062021130056
88;387;04062021130056
89;373;04062021130056
90;372;04062021130056
91;358;04062021130056
92;345;04062021130056
93;339;04062021130056
94;331;04062021130056
95;321;04062021130056
96;314;04062021130056
97;303;04062021130056
98;297;04062021130056
99;291;04062021130056
100;280;04062021130056
101;283;04062021130056
102;274;04062021130056
103;267;04062021130056
104;264;04062021130056
105;256;04062021130056
106;253;04062021130056
107;243;04062021130056
108;241;04062021130056
109;237;04062021130056
110;229;04062021130056
111;229;04062021130056
112;230;04062021130056
113;221;04062021130056
114;219;04062021130056
115;221;04062021130056
116;215;04062021130056
117;214;04062021130056
118;208;04062021130056
119;207;04062021130056
120;202;04062021130056
121;199;04062021130056
122;198;04062021130056
123;198;04062021130056
124;193;04062021130056
125;192;04062021130056
126;188;04062021130056
127;188;04062021130056
128;191;04062021130056
129;185;04062021130056
130;186;04062021130056
131;181;04062021130056
132;180;04062021130056
133;183;04062021130056
134;177;04062021130056
135;175;04062021130056
136;177;04062021130056
137;171;04062021130056
138;174;04062021130056
139;169;04062021130056
140;168;04062021130056
141;170;04062021130056
142;166;04062021130056
143;163;04062021130056
144;167;04062021130056
145;162;04062021130056
146;165;04062021130056
147;164;04062021130056
148;160;04062021130056
149;162;04062021130056
150;161;04062021130056
151;160;04062021130056
152;158;04062021130056
153;157;04062021130056
154;159;04062021130056
155;159;04062021130056
156;157;04062021130056
157;156;04062021130056
158;155;04062021130056
159;155;04062021130056
160;155;04062021130056
161;153;04062021130056
162;156;04062021130056
163;154;04062021130056
164;153;04062021130056
165;155;04062021130056
166;153;04062021130056
167;154;04062021130056
168;155;04062021130056
169;149;04062021130056
170;154;04062021130056
171;152;04062021130056
172;152;04062021130056
173;154;04062021130056
174;151;04062021130056
175;150;04062021130056
176;153;04062021130056
177;151;04062021130056
178;153;04062021130056
179;151;04062021130056
180;148;04062021130056
181;151;04062021130056
182;151;04062021130056
183;149;04062021130056
184;150;04062021130056
185;146;04062021130056
186;152;04062021130056
187;150;04062021130056
188;147;04062021130056
189;150;04062021130056
190;148;04062021130056
191;149;04062021130056
192;152;04062021130056
193;148;04062021130056
194;150;04062021130056
195;149;04062021130056
196;147;04062021130056
197;148;04062021130056
198;149;04062021130056
199;147;04062021130056
200;0;04062021130056
0;0;04062021130057
1;171;04062021130057
2;167;04062021130057
3;163;04062021130057
4;166;04062021130057
5;165;04062021130057
6;162;04062021130057
7;166;04062021130057
8;166;04062021130057
9;163;04062021130057
10;167;04062021130057
11;165;04062021130057
12;166;04062021130057
13;170;04062021130057
14;167;04062021130057
15;172;04062021130057
16;173;04062021130057
17;176;04062021130057
18;192;04062021130057
19;216;04062021130057
20;270;04062021130057
21;421;04062021130057
22;806;04062021130057
23;1023;04062021130057
24;1023;04062021130057
25;1023;04062021130057
26;1023;04062021130057
27;1023;04062021130057
28;1023;04062021130057
29;1023;04062021130057
30;1023;04062021130057
31;1023;04062021130057
32;888;04062021130057
33;707;04062021130057
34;600;04062021130057
35;533;04062021130057
36;491;04062021130057
37;481;04062021130057
38;484;04062021130057
39;500;04062021130057
40;508;04062021130057
41;524;04062021130057
42;542;04062021130057
43;546;04062021130057
44;561;04062021130057
45;570;04062021130057
46;571;04062021130057
47;578;04062021130057
48;587;04062021130057
49;588;04062021130057
50;597;04062021130057
51;605;04062021130057
52;608;04062021130057
53;625;04062021130057
54;628;04062021130057
55;640;04062021130057
56;648;04062021130057
57;666;04062021130057
58;684;04062021130057
59;688;04062021130057
60;704;04062021130057
61;712;04062021130057
62;719;04062021130057
63;732;04062021130057
64;731;04062021130057
65;727;04062021130057
66;732;04062021130057
67;722;04062021130057
68;719;04062021130057
69;724;04062021130057
70;729;04062021130057
71;744;04062021130057
72;756;04062021130057
73;750;04062021130057
74;745;04062021130057
75;700;04062021130057
76;658;04062021130057
77;616;04062021130057
78;564;04062021130057
79;527;04062021130057
80;496;04062021130057
81;468;04062021130057
82;451;04062021130057
83;432;04062021130057
84;419;04062021130057
85;407;04062021130057
86;404;04062021130057
87;396;04062021130057
88;391;04062021130057
89;375;04062021130057
90;371;04062021130057
91;357;04062021130057
92;349;04062021130057
93;340;04062021130057
94;331;04062021130057
95;320;04062021130057
96;313;04062021130057
97;303;04062021130057
98;296;04062021130057
99;290;04062021130057
100;280;04062021130057
101;280;04062021130057
102;272;04062021130057
103;266;04062021130057
104;261;04062021130057
105;257;04062021130057
106;253;04062021130057
107;244;04062021130057
108;241;04062021130057
109;240;04062021130057
110;231;04062021130057
111;230;04062021130057
112;228;04062021130057
113;220;04062021130057
114;219;04062021130057
115;218;04062021130057
116;216;04062021130057
117;217;04062021130057
118;209;04062021130057
119;207;04062021130057
120;206;04062021130057
121;199;04062021130057
122;201;04062021130057
123;197;04062021130057
124;195;04062021130057
125;195;04062021130057
126;191;04062021130057
127;189;04062021130057
128;190;04062021130057
129;185;04062021130057
130;184;04062021130057
131;182;04062021130057
132;179;04062021130057
133;183;04062021130057
134;175;04062021130057
135;175;04062021130057
136;176;04062021130057
137;172;04062021130057
138;174;04062021130057
139;170;04062021130057
140;169;04062021130057
141;171;04062021130057
142;166;04062021130057
143;163;04062021130057
144;167;04062021130057
145;163;04062021130057
146;165;04062021130057
147;164;04062021130057
148;160;04062021130057
149;161;04062021130057
150;161;04062021130057
151;160;04062021130057
152;160;04062021130057
153;158;04062021130057
154;159;04062021130057
155;159;04062021130057
156;156;04062021130057
157;156;04062021130057
158;154;04062021130057
159;154;04062021130057
160;155;04062021130057
161;154;04062021130057
162;156;04062021130057
163;155;04062021130057
164;154;04062021130057
165;155;04062021130057
166;152;04062021130057
167;154;04062021130057
168;155;04062021130057
169;151;04062021130057
170;153;04062021130057
171;151;04062021130057
172;150;04062021130057
173;154;04062021130057
174;151;04062021130057
175;150;04062021130057
176;152;04062021130057
177;149;04062021130057
178;153;04062021130057
179;151;04062021130057
180;149;04062021130057
181;152;04062021130057
182;152;04062021130057
183;149;04062021130057
184;152;04062021130057
185;148;04062021130057
186;153;04062021130057
187;149;04062021130057
188;148;04062021130057
189;150;04062021130057
190;148;04062021130057
191;149;04062021130057
192;152;04062021130057
193;148;04062021130057
194;151;04062021130057
195;149;04062021130057
196;148;04062021130057
197;149;04062021130057
198;150;04062021130057
199;147;04062021130057
200;0;04062021130057
0;0;04062021130057
1;171;04062021130057
2;166;04062021130057
3;163;04062021130057
4;166;04062021130057
5;165;04062021130057
6;163;04062021130057
7;166;04062021130057
8;167;04062021130057
9;163;04062021130057
10;166;04062021130057
11;166;04062021130057
12;165;04062021130057
13;170;04062021130057
14;167;04062021130057
15;171;04062021130057
16;173;04062021130057
17;176;04062021130057
18;191;04062021130057
19;216;04062021130057
20;272;04062021130057
21;422;04062021130057
22;810;04062021130057
23;1023;04062021130057
24;1023;04062021130057
25;1023;04062021130057
26;1023;04062021130057
27;1023;04062021130057
28;1023;04062021130057
29;1023;04062021130057
30;1023;04062021130057
31;1023;04062021130057
32;898;04062021130057
33;714;04062021130057
34;605;04062021130057
35;532;04062021130057
36;496;04062021130057
37;486;04062021130057
38;489;04062021130057
39;496;04062021130057
40;511;04062021130057
41;524;04062021130057
42;543;04062021130057
43;546;04062021130057
44;559;04062021130057
45;567;04062021130057
46;570;04062021130057
47;576;04062021130057
48;585;04062021130057
49;592;04062021130057
50;592;04062021130057
51;602;04062021130057
52;607;04062021130057
53;619;04062021130057
54;626;04062021130057
55;641;04062021130057
56;654;04062021130057
57;665;04062021130057
58;682;04062021130057
59;691;04062021130057
60;703;04062021130057
61;713;04062021130057
62;719;04062021130057
63;732;04062021130057
64;733;04062021130057
65;728;04062021130057
66;723;04062021130057
67;719;04062021130057
68;721;04062021130057
69;721;04062021130057
70;727;04062021130057
71;746;04062021130057
72;752;04062021130057
73;747;04062021130057
74;743;04062021130057
75;703;04062021130057
76;657;04062021130057
77;611;04062021130057
78;564;04062021130057
79;528;04062021130057
80;495;04062021130057
81;466;04062021130057
82;452;04062021130057
83;433;04062021130057
84;419;04062021130057
85;408;04062021130057
86;398;04062021130057
87;396;04062021130057
88;390;04062021130057
89;374;04062021130057
90;369;04062021130057
91;356;04062021130057
92;349;04062021130057
93;338;04062021130057
94;328;04062021130057
95;320;04062021130057
96;316;04062021130057
97;305;04062021130057
98;295;04062021130057
99;289;04062021130057
100;283;04062021130057
101;282;04062021130057
102;274;04062021130057
103;266;04062021130057
104;260;04062021130057
105;253;04062021130057
106;253;04062021130057
107;245;04062021130057
108;242;04062021130057
109;240;04062021130057
110;231;04062021130057
111;232;04062021130057
112;228;04062021130057
113;223;04062021130057
114;219;04062021130057
115;218;04062021130057
116;211;04062021130057
117;215;04062021130057
118;209;04062021130057
119;207;04062021130057
120;204;04062021130057
121;200;04062021130057
122;200;04062021130057
123;194;04062021130057
124;192;04062021130057
125;193;04062021130057
126;189;04062021130057
127;190;04062021130057
128;188;04062021130057
129;185;04062021130057
130;182;04062021130057
131;183;04062021130057
132;178;04062021130057
133;184;04062021130057
134;176;04062021130057
135;175;04062021130057
136;177;04062021130057
137;172;04062021130057
138;173;04062021130057
139;171;04062021130057
140;167;04062021130057
141;171;04062021130057
142;166;04062021130057
143;164;04062021130057
144;167;04062021130057
145;163;04062021130057
146;165;04062021130057
147;163;04062021130057
148;161;04062021130057
149;162;04062021130057
150;160;04062021130057
151;161;04062021130057
152;160;04062021130057
153;156;04062021130057
154;159;04062021130057
155;158;04062021130057
156;155;04062021130057
157;156;04062021130057
158;155;04062021130057
159;155;04062021130057
160;156;04062021130057
161;154;04062021130057
162;155;04062021130057
163;156;04062021130057
164;154;04062021130057
165;155;04062021130057
166;152;04062021130057
167;154;04062021130057
168;156;04062021130057
169;149;04062021130057
170;152;04062021130057
171;152;04062021130057
172;151;04062021130057
173;154;04062021130057
174;150;04062021130057
175;149;04062021130057
176;151;04062021130057
177;149;04062021130057
178;153;04062021130057
179;150;04062021130057
180;149;04062021130057
181;151;04062021130057
182;151;04062021130057
183;149;04062021130057
184;149;04062021130057
185;146;04062021130057
186;152;04062021130057
187;149;04062021130057
188;147;04062021130057
189;150;04062021130057
190;147;04062021130057
191;150;04062021130057
192;153;04062021130057
193;149;04062021130057
194;151;04062021130057
195;148;04062021130057
196;148;04062021130057
197;150;04062021130057
198;149;04062021130057
199;148;04062021130057
200;0;04062021130057
0;0;04062021130058
1;171;04062021130058
2;166;04062021130058
3;164;04062021130058
4;164;04062021130058
5;165;04062021130058
6;164;04062021130058
7;166;04062021130058
8;168;04062021130058
9;164;04062021130058
10;168;04062021130058
11;166;04062021130058
12;164;04062021130058
13;169;04062021130058
14;168;04062021130058
15;172;04062021130058
16;175;04062021130058
17;178;04062021130058
18;192;04062021130058
19;216;04062021130058
20;272;04062021130058
21;423;04062021130058
22;803;04062021130058
23;1023;04062021130058
24;1023;04062021130058
25;1023;04062021130058
26;1023;04062021130058
27;1023;04062021130058
28;1023;04062021130058
29;1023;04062021130058
30;1023;04062021130058
31;1023;04062021130058
32;899;04062021130058
33;718;04062021130058
34;606;04062021130058
35;536;04062021130058
36;494;04062021130058
37;485;04062021130058
38;486;04062021130058
39;500;04062021130058
40;511;04062021130058
41;523;04062021130058
42;540;04062021130058
43;548;04062021130058
44;559;04062021130058
45;569;04062021130058
46;573;04062021130058
47;578;04062021130058
48;588;04062021130058
49;591;04062021130058
50;597;04062021130058
51;604;04062021130058
52;608;04062021130058
53;623;04062021130058
54;628;04062021130058
55;636;04062021130058
56;649;04062021130058
57;663;04062021130058
58;680;04062021130058
59;686;04062021130058
60;702;04062021130058
61;716;04062021130058
62;723;04062021130058
63;730;04062021130058
64;734;04062021130058
65;728;04062021130058
66;726;04062021130058
67;724;04062021130058
68;719;04062021130058
69;721;04062021130058
70;726;04062021130058
71;742;04062021130058
72;753;04062021130058
73;751;04062021130058
74;742;04062021130058
75;695;04062021130058
76;661;04062021130058
77;611;04062021130058
78;565;04062021130058
79;526;04062021130058
80;497;04062021130058
81;470;04062021130058
82;455;04062021130058
83;435;04062021130058
84;421;04062021130058
85;409;04062021130058
86;402;04062021130058
87;394;04062021130058
88;387;04062021130058
89;375;04062021130058
90;373;04062021130058
91;358;04062021130058
92;350;04062021130058
93;343;04062021130058
94;329;04062021130058
95;319;04062021130058
96;313;04062021130058
97;305;04062021130058
98;297;04062021130058
99;294;04062021130058
100;283;04062021130058
101;283;04062021130058
102;274;04062021130058
103;265;04062021130058
104;261;04062021130058
105;254;04062021130058
106;254;04062021130058
107;246;04062021130058
108;243;04062021130058
109;241;04062021130058
110;233;04062021130058
111;227;04062021130058
112;228;04062021130058
113;220;04062021130058
114;221;04062021130058
115;220;04062021130058
116;217;04062021130058
117;215;04062021130058
118;211;04062021130058
119;207;04062021130058
120;202;04062021130058
121;201;04062021130058
122;201;04062021130058
123;197;04062021130058
124;194;04062021130058
125;194;04062021130058
126;188;04062021130058
127;189;04062021130058
128;189;04062021130058
129;183;04062021130058
130;184;04062021130058
131;183;04062021130058
132;179;04062021130058
133;184;04062021130058
134;175;04062021130058
135;175;04062021130058
136;176;04062021130058
137;172;04062021130058
138;174;04062021130058
139;170;04062021130058
140;168;04062021130058
141;171;04062021130058
142;168;04062021130058
143;165;04062021130058
144;168;04062021130058
145;162;04062021130058
146;164;04062021130058
147;164;04062021130058
148;161;04062021130058
149;161;04062021130058
150;161;04062021130058
151;161;04062021130058
152;159;04062021130058
153;157;04062021130058
154;161;04062021130058
155;158;04062021130058
156;156;04062021130058
157;156;04062021130058
158;155;04062021130058
159;154;04062021130058
160;155;04062021130058
161;153;04062021130058
162;156;04062021130058
163;156;04062021130058
164;154;04062021130058
165;155;04062021130058
166;152;04062021130058
167;152;04062021130058
168;155;04062021130058
169;150;04062021130058
170;155;04062021130058
171;151;04062021130058
172;150;04062021130058
173;154;04062021130058
174;150;04062021130058
175;150;04062021130058
176;152;04062021130058
177;148;04062021130058
178;153;04062021130058
179;151;04062021130058
180;150;04062021130058
181;152;04062021130058
182;152;04062021130058
183;149;04062021130058
184;151;04062021130058
185;146;04062021130058
186;151;04062021130058
187;150;04062021130058
188;147;04062021130058
189;149;04062021130058
190;148;04062021130058
191;148;04062021130058
192;152;04062021130058
193;148;04062021130058
194;151;04062021130058
195;148;04062021130058
196;148;04062021130058
197;149;04062021130058
198;150;04062021130058
199;147;04062021130058
200;0;04062021130058
0;0;04062021130059
1;171;04062021130059
2;166;04062021130059
3;165;04062021130059
4;166;04062021130059
5;165;04062021130059
6;164;04062021130059
7;166;04062021130059
8;167;04062021130059
9;163;04062021130059
10;168;04062021130059
11;164;04062021130059
12;165;04062021130059
13;170;04062021130059
14;167;04062021130059
15;172;04062021130059
16;173;04062021130059
17;175;04062021130059
18;191;04062021130059
19;215;04062021130059
20;271;04062021130059
21;423;04062021130059
22;805;04062021130059
23;1023;04062021130059
24;1023;04062021130059
25;1023;04062021130059
26;1023;04062021130059
27;1023;04062021130059
28;1023;04062021130059
29;1023;04062021130059
30;1023;04062021130059
31;1023;04062021130059
32;900;04062021130059
33;711;04062021130059
34;605;04062021130059
35;533;04062021130059
36;494;04062021130059
37;485;04062021130059
38;483;04062021130059
39;502;04062021130059
40;510;04062021130059
41;522;04062021130059
42;545;04062021130059
43;549;04062021130059
44;558;04062021130059
45;567;04062021130059
46;570;04062021130059
47;573;04062021130059
48;581;04062021130059
49;587;04062021130059
50;595;04062021130059
51;605;04062021130059
52;602;04062021130059
53;618;04062021130059
54;625;04062021130059
55;642;04062021130059
56;651;04062021130059
57;664;04062021130059
58;683;04062021130059
59;693;04062021130059
60;707;04062021130059
61;716;04062021130059
62;723;04062021130059
63;732;04062021130059
64;734;04062021130059
65;727;04062021130059
66;732;04062021130059
67;726;04062021130059
68;715;04062021130059
69;720;04062021130059
70;731;04062021130059
71;745;04062021130059
72;756;04062021130059
73;747;04062021130059
74;740;04062021130059
75;698;04062021130059
76;661;04062021130059
77;614;04062021130059
78;573;04062021130059
79;527;04062021130059
80;495;04062021130059
81;468;04062021130059
82;457;04062021130059
83;431;04062021130059
84;420;04062021130059
85;409;04062021130059
86;404;04062021130059
87;394;04062021130059
88;391;04062021130059
89;373;04062021130059
90;370;04062021130059
91;359;04062021130059
92;347;04062021130059
93;339;04062021130059
94;328;04062021130059
95;318;04062021130059
96;310;04062021130059
97;302;04062021130059
98;299;04062021130059
99;287;04062021130059
100;283;04062021130059
101;283;04062021130059
102;273;04062021130059
103;263;04062021130059
104;265;04062021130059
105;252;04062021130059
106;253;04062021130059
107;248;04062021130059
108;240;04062021130059
109;238;04062021130059
110;233;04062021130059
111;229;04062021130059
112;229;04062021130059
113;220;04062021130059
114;218;04062021130059
115;219;04062021130059
116;215;04062021130059
117;216;04062021130059
118;207;04062021130059
119;207;04062021130059
120;204;04062021130059
121;201;04062021130059
122;199;04062021130059
123;195;04062021130059
124;196;04062021130059
125;193;04062021130059
126;188;04062021130059
127;189;04062021130059
128;190;04062021130059
129;184;04062021130059
130;183;04062021130059
131;183;04062021130059
132;178;04062021130059
133;183;04062021130059
134;175;04062021130059
135;175;04062021130059
136;176;04062021130059
137;172;04062021130059
138;175;04062021130059
139;171;04062021130059
140;169;04062021130059
141;170;04062021130059
142;166;04062021130059
143;164;04062021130059
144;167;04062021130059
145;163;04062021130059
146;165;04062021130059
147;164;04062021130059
148;161;04062021130059
149;163;04062021130059
150;159;04062021130059
151;160;04062021130059
152;159;04062021130059
153;158;04062021130059
154;159;04062021130059
155;158;04062021130059
156;157;04062021130059
157;156;04062021130059
158;154;04062021130059
159;155;04062021130059
160;155;04062021130059
161;153;04062021130059
162;156;04062021130059
163;155;04062021130059
164;154;04062021130059
165;155;04062021130059
166;153;04062021130059
167;152;04062021130059
168;155;04062021130059
169;149;04062021130059
170;154;04062021130059
171;151;04062021130059
172;151;04062021130059
173;153;04062021130059
174;150;04062021130059
175;149;04062021130059
176;153;04062021130059
177;149;04062021130059
178;153;04062021130059
179;151;04062021130059
180;151;04062021130059
181;151;04062021130059
182;151;04062021130059
183;149;04062021130059
184;151;04062021130059
185;147;04062021130059
186;151;04062021130059
187;150;04062021130059
188;148;04062021130059
189;150;04062021130059
190;148;04062021130059
191;149;04062021130059
192;151;04062021130059
193;149;04062021130059
194;150;04062021130059
195;150;04062021130059
196;148;04062021130059
197;149;04062021130059
198;149;04062021130059
199;147;04062021130059
200;0;04062021130059
0;0;04062021130100
1;171;04062021130100
2;164;04062021130100
3;164;04062021130100
4;165;04062021130100
5;164;04062021130100
6;163;04062021130100
7;165;04062021130100
8;166;04062021130100
9;164;04062021130100
10;167;04062021130100
11;165;04062021130100
12;164;04062021130100
13;170;04062021130100
14;166;04062021130100
15;171;04062021130100
16;173;04062021130100
17;176;04062021130100
18;190;04062021130100
19;214;04062021130100
20;270;04062021130100
21;421;04062021130100
22;802;04062021130100
23;1023;04062021130100
24;1023;04062021130100
25;1023;04062021130100
26;1023;04062021130100
27;1023;04062021130100
28;1023;04062021130100
29;1023;04062021130100
30;1023;04062021130100
31;1023;04062021130100
32;906;04062021130100
33;714;04062021130100
34;604;04062021130100
35;536;04062021130100
36;493;04062021130100
37;483;04062021130100
38;488;04062021130100
39;496;04062021130100
40;512;04062021130100
41;525;04062021130100
42;539;04062021130100
43;548;04062021130100
44;553;04062021130100
45;571;04062021130100
46;573;04062021130100
47;577;04062021130100
48;584;04062021130100
49;587;04062021130100
50;592;04062021130100
51;603;04062021130100
52;608;04062021130100
53;621;04062021130100
54;629;04062021130100
55;635;04062021130100
56;649;04062021130100
57;659;04062021130100
58;676;04062021130100
59;690;04062021130100
60;705;04062021130100
61;721;04062021130100
62;713;04062021130100
63;728;04062021130100
64;731;04062021130100
65;727;04062021130100
66;729;04062021130100
67;723;04062021130100
68;717;04062021130100
69;721;04062021130100
70;727;04062021130100
71;744;04062021130100
72;755;04062021130100
73;745;04062021130100
74;743;04062021130100
75;699;04062021130100
76;659;04062021130100
77;612;04062021130100
78;566;04062021130100
79;527;04062021130100
80;490;04062021130100
81;466;04062021130100
82;452;04062021130100
83;431;04062021130100
84;422;04062021130100
85;411;04062021130100
86;401;04062021130100
87;395;04062021130100
88;389;04062021130100
89;377;04062021130100
90;373;04062021130100
91;361;04062021130100
92;346;04062021130100
93;340;04062021130100
94;329;04062021130100
95;317;04062021130100
96;312;04062021130100
97;303;04062021130100
98;292;04062021130100
99;288;04062021130100
100;282;04062021130100
101;281;04062021130100
102;271;04062021130100
103;266;04062021130100
104;260;04062021130100
105;257;04062021130100
106;256;04062021130100
107;245;04062021130100
108;242;04062021130100
109;238;04062021130100
110;232;04062021130100
111;229;04062021130100
112;226;04062021130100
113;219;04062021130100
114;219;04062021130100
115;220;04062021130100
116;215;04062021130100
117;216;04062021130100
118;207;04062021130100
119;208;04062021130100
120;204;04062021130100
121;199;04062021130100
122;199;04062021130100
123;195;04062021130100
124;194;04062021130100
125;192;04062021130100
126;189;04062021130100
127;188;04062021130100
128;190;04062021130100
129;185;04062021130100
130;182;04062021130100
131;182;04062021130100
132;178;04062021130100
133;183;04062021130100
134;176;04062021130100
135;175;04062021130100
136;175;04062021130100
137;171;04062021130100
138;173;04062021130100
139;170;04062021130100
140;168;04062021130100
141;170;04062021130100
142;166;04062021130100
143;165;04062021130100
144;166;04062021130100
145;162;04062021130100
146;165;04062021130100
147;163;04062021130100
148;161;04062021130100
149;161;04062021130100
150;159;04062021130100
151;161;04062021130100
152;159;04062021130100
153;157;04062021130100
154;160;04062021130100
155;158;04062021130100
156;155;04062021130100
157;157;04062021130100
158;154;04062021130100
159;155;04062021130100
160;155;04062021130100
161;153;04062021130100
162;155;04062021130100
163;154;04062021130100
164;155;04062021130100
165;155;04062021130100
166;152;04062021130100
167;152;04062021130100
168;155;04062021130100
169;149;04062021130100
170;154;04062021130100
171;151;04062021130100
172;151;04062021130100
173;153;04062021130100
174;151;04062021130100
175;149;04062021130100
176;150;04062021130100
177;148;04062021130100
178;154;04062021130100
179;150;04062021130100
180;150;04062021130100
181;151;04062021130100
182;152;04062021130100
183;148;04062021130100
184;150;04062021130100
185;148;04062021130100
186;151;04062021130100
187;150;04062021130100
188;147;04062021130100
189;149;04062021130100
190;147;04062021130100
191;148;04062021130100
192;152;04062021130100
193;148;04062021130100
194;150;04062021130100
195;150;04062021130100
196;148;04062021130100
197;149;04062021130100
198;149;04062021130100
199;148;04062021130100
200;0;04062021130100
