ind;val;datetime
0;0;29062021122027
1;145;29062021122027
2;130;29062021122027
3;128;29062021122027
4;129;29062021122027
5;131;29062021122027
6;129;29062021122027
7;132;29062021122027
8;132;29062021122027
9;130;29062021122027
10;134;29062021122027
11;133;29062021122027
12;134;29062021122027
13;139;29062021122027
14;139;29062021122027
15;145;29062021122027
16;150;29062021122027
17;162;29062021122027
18;192;29062021122027
19;247;29062021122027
20;370;29062021122027
21;678;29062021122027
22;1023;29062021122027
23;1023;29062021122027
24;1023;29062021122027
25;1023;29062021122027
26;1023;29062021122027
27;1023;29062021122027
28;1023;29062021122027
29;1023;29062021122027
30;1023;29062021122027
31;1023;29062021122027
32;1023;29062021122027
33;1023;29062021122027
34;977;29062021122027
35;765;29062021122027
36;577;29062021122027
37;455;29062021122027
38;374;29062021122027
39;311;29062021122027
40;276;29062021122027
41;248;29062021122027
42;235;29062021122027
43;222;29062021122027
44;217;29062021122027
45;212;29062021122027
46;210;29062021122027
47;207;29062021122027
48;208;29062021122027
49;204;29062021122027
50;204;29062021122027
51;203;29062021122027
52;202;29062021122027
53;205;29062021122027
54;206;29062021122027
55;206;29062021122027
56;209;29062021122027
57;209;29062021122027
58;218;29062021122027
59;215;29062021122027
60;219;29062021122027
61;222;29062021122027
62;222;29062021122027
63;225;29062021122027
64;226;29062021122027
65;223;29062021122027
66;227;29062021122027
67;225;29062021122027
68;222;29062021122027
69;222;29062021122027
70;218;29062021122027
71;215;29062021122027
72;214;29062021122027
73;208;29062021122027
74;206;29062021122027
75;202;29062021122027
76;197;29062021122027
77;198;29062021122027
78;192;29062021122027
79;189;29062021122027
80;188;29062021122027
81;182;29062021122027
82;181;29062021122027
83;177;29062021122027
84;177;29062021122027
85;177;29062021122027
86;174;29062021122027
87;174;29062021122027
88;172;29062021122027
89;168;29062021122027
90;170;29062021122027
91;169;29062021122027
92;164;29062021122027
93;165;29062021122027
94;162;29062021122027
95;160;29062021122027
96;160;29062021122027
97;155;29062021122027
98;154;29062021122027
99;154;29062021122027
100;151;29062021122027
101;154;29062021122027
102;150;29062021122027
103;149;29062021122027
104;149;29062021122027
105;145;29062021122027
106;148;29062021122027
107;146;29062021122027
108;144;29062021122027
109;144;29062021122027
110;142;29062021122027
111;142;29062021122027
112;143;29062021122027
113;139;29062021122027
114;140;29062021122027
115;141;29062021122027
116;138;29062021122027
117;140;29062021122027
118;137;29062021122027
119;138;29062021122027
120;136;29062021122027
121;135;29062021122027
122;135;29062021122027
123;136;29062021122027
124;134;29062021122027
125;134;29062021122027
126;132;29062021122027
127;133;29062021122027
128;135;29062021122027
129;133;29062021122027
130;133;29062021122027
131;132;29062021122027
132;130;29062021122027
133;134;29062021122027
134;130;29062021122027
135;129;29062021122027
136;130;29062021122027
137;128;29062021122027
138;132;29062021122027
139;130;29062021122027
140;127;29062021122027
141;130;29062021122027
142;128;29062021122027
143;127;29062021122027
144;128;29062021122027
145;125;29062021122027
146;129;29062021122027
147;128;29062021122027
148;127;29062021122027
149;127;29062021122027
150;126;29062021122027
151;128;29062021122027
152;126;29062021122027
153;125;29062021122027
154;127;29062021122027
155;126;29062021122027
156;124;29062021122027
157;126;29062021122027
158;125;29062021122027
159;125;29062021122027
160;126;29062021122027
161;124;29062021122027
162;126;29062021122027
163;125;29062021122027
164;125;29062021122027
165;127;29062021122027
166;125;29062021122027
167;125;29062021122027
168;125;29062021122027
169;123;29062021122027
170;125;29062021122027
171;125;29062021122027
172;124;29062021122027
173;125;29062021122027
174;123;29062021122027
175;124;29062021122027
176;125;29062021122027
177;123;29062021122027
178;126;29062021122027
179;124;29062021122027
180;122;29062021122027
181;126;29062021122027
182;125;29062021122027
183;124;29062021122027
184;125;29062021122027
185;123;29062021122027
186;126;29062021122027
187;125;29062021122027
188;122;29062021122027
189;124;29062021122027
190;123;29062021122027
191;123;29062021122027
192;127;29062021122027
193;124;29062021122027
194;126;29062021122027
195;124;29062021122027
196;123;29062021122027
197;125;29062021122027
198;125;29062021122027
199;124;29062021122027
200;0;29062021122027
0;0;29062021122028
1;145;29062021122028
2;129;29062021122028
3;128;29062021122028
4;129;29062021122028
5;130;29062021122028
6;129;29062021122028
7;131;29062021122028
8;132;29062021122028
9;130;29062021122028
10;133;29062021122028
11;133;29062021122028
12;134;29062021122028
13;138;29062021122028
14;139;29062021122028
15;144;29062021122028
16;152;29062021122028
17;162;29062021122028
18;190;29062021122028
19;246;29062021122028
20;369;29062021122028
21;670;29062021122028
22;1023;29062021122028
23;1023;29062021122028
24;1023;29062021122028
25;1023;29062021122028
26;1023;29062021122028
27;1023;29062021122028
28;1023;29062021122028
29;1023;29062021122028
30;1023;29062021122028
31;1023;29062021122028
32;1023;29062021122028
33;1023;29062021122028
34;979;29062021122028
35;772;29062021122028
36;587;29062021122028
37;461;29062021122028
38;371;29062021122028
39;315;29062021122028
40;278;29062021122028
41;250;29062021122028
42;234;29062021122028
43;222;29062021122028
44;215;29062021122028
45;214;29062021122028
46;208;29062021122028
47;208;29062021122028
48;207;29062021122028
49;204;29062021122028
50;208;29062021122028
51;204;29062021122028
52;202;29062021122028
53;205;29062021122028
54;206;29062021122028
55;206;29062021122028
56;209;29062021122028
57;209;29062021122028
58;215;29062021122028
59;213;29062021122028
60;220;29062021122028
61;219;29062021122028
62;221;29062021122028
63;224;29062021122028
64;227;29062021122028
65;225;29062021122028
66;228;29062021122028
67;225;29062021122028
68;223;29062021122028
69;223;29062021122028
70;216;29062021122028
71;212;29062021122028
72;213;29062021122028
73;206;29062021122028
74;207;29062021122028
75;201;29062021122028
76;198;29062021122028
77;196;29062021122028
78;190;29062021122028
79;188;29062021122028
80;187;29062021122028
81;180;29062021122028
82;183;29062021122028
83;177;29062021122028
84;175;29062021122028
85;177;29062021122028
86;172;29062021122028
87;172;29062021122028
88;173;29062021122028
89;167;29062021122028
90;170;29062021122028
91;166;29062021122028
92;164;29062021122028
93;166;29062021122028
94;162;29062021122028
95;158;29062021122028
96;160;29062021122028
97;155;29062021122028
98;155;29062021122028
99;154;29062021122028
100;151;29062021122028
101;154;29062021122028
102;150;29062021122028
103;149;29062021122028
104;148;29062021122028
105;145;29062021122028
106;146;29062021122028
107;145;29062021122028
108;143;29062021122028
109;145;29062021122028
110;141;29062021122028
111;142;29062021122028
112;142;29062021122028
113;138;29062021122028
114;138;29062021122028
115;140;29062021122028
116;137;29062021122028
117;142;29062021122028
118;137;29062021122028
119;136;29062021122028
120;136;29062021122028
121;134;29062021122028
122;135;29062021122028
123;135;29062021122028
124;133;29062021122028
125;135;29062021122028
126;133;29062021122028
127;133;29062021122028
128;134;29062021122028
129;132;29062021122028
130;132;29062021122028
131;131;29062021122028
132;128;29062021122028
133;134;29062021122028
134;129;29062021122028
135;129;29062021122028
136;130;29062021122028
137;128;29062021122028
138;130;29062021122028
139;128;29062021122028
140;128;29062021122028
141;129;29062021122028
142;126;29062021122028
143;126;29062021122028
144;129;29062021122028
145;125;29062021122028
146;128;29062021122028
147;128;29062021122028
148;126;29062021122028
149;126;29062021122028
150;125;29062021122028
151;127;29062021122028
152;127;29062021122028
153;124;29062021122028
154;127;29062021122028
155;126;29062021122028
156;125;29062021122028
157;126;29062021122028
158;124;29062021122028
159;124;29062021122028
160;125;29062021122028
161;123;29062021122028
162;126;29062021122028
163;126;29062021122028
164;124;29062021122028
165;125;29062021122028
166;124;29062021122028
167;125;29062021122028
168;126;29062021122028
169;122;29062021122028
170;124;29062021122028
171;125;29062021122028
172;123;29062021122028
173;125;29062021122028
174;124;29062021122028
175;123;29062021122028
176;124;29062021122028
177;123;29062021122028
178;125;29062021122028
179;124;29062021122028
180;124;29062021122028
181;125;29062021122028
182;124;29062021122028
183;123;29062021122028
184;124;29062021122028
185;121;29062021122028
186;125;29062021122028
187;124;29062021122028
188;122;29062021122028
189;123;29062021122028
190;123;29062021122028
191;124;29062021122028
192;127;29062021122028
193;122;29062021122028
194;123;29062021122028
195;124;29062021122028
196;123;29062021122028
197;124;29062021122028
198;124;29062021122028
199;122;29062021122028
200;0;29062021122028
0;0;29062021122029
1;146;29062021122029
2;130;29062021122029
3;129;29062021122029
4;129;29062021122029
5;130;29062021122029
6;129;29062021122029
7;132;29062021122029
8;133;29062021122029
9;131;29062021122029
10;134;29062021122029
11;134;29062021122029
12;134;29062021122029
13;138;29062021122029
14;140;29062021122029
15;146;29062021122029
16;152;29062021122029
17;161;29062021122029
18;191;29062021122029
19;244;29062021122029
20;367;29062021122029
21;667;29062021122029
22;1023;29062021122029
23;1023;29062021122029
24;1023;29062021122029
25;1023;29062021122029
26;1023;29062021122029
27;1023;29062021122029
28;1023;29062021122029
29;1023;29062021122029
30;1023;29062021122029
31;1023;29062021122029
32;1023;29062021122029
33;1023;29062021122029
34;981;29062021122029
35;772;29062021122029
36;582;29062021122029
37;456;29062021122029
38;372;29062021122029
39;314;29062021122029
40;276;29062021122029
41;249;29062021122029
42;234;29062021122029
43;223;29062021122029
44;216;29062021122029
45;213;29062021122029
46;208;29062021122029
47;209;29062021122029
48;207;29062021122029
49;203;29062021122029
50;206;29062021122029
51;202;29062021122029
52;201;29062021122029
53;206;29062021122029
54;204;29062021122029
55;206;29062021122029
56;210;29062021122029
57;210;29062021122029
58;215;29062021122029
59;216;29062021122029
60;219;29062021122029
61;222;29062021122029
62;222;29062021122029
63;224;29062021122029
64;228;29062021122029
65;223;29062021122029
66;227;29062021122029
67;225;29062021122029
68;220;29062021122029
69;220;29062021122029
70;218;29062021122029
71;214;29062021122029
72;214;29062021122029
73;208;29062021122029
74;206;29062021122029
75;204;29062021122029
76;200;29062021122029
77;198;29062021122029
78;192;29062021122029
79;189;29062021122029
80;186;29062021122029
81;180;29062021122029
82;183;29062021122029
83;178;29062021122029
84;175;29062021122029
85;175;29062021122029
86;173;29062021122029
87;174;29062021122029
88;173;29062021122029
89;168;29062021122029
90;169;29062021122029
91;167;29062021122029
92;163;29062021122029
93;166;29062021122029
94;162;29062021122029
95;158;29062021122029
96;160;29062021122029
97;156;29062021122029
98;156;29062021122029
99;155;29062021122029
100;152;29062021122029
101;154;29062021122029
102;151;29062021122029
103;148;29062021122029
104;149;29062021122029
105;145;29062021122029
106;147;29062021122029
107;145;29062021122029
108;144;29062021122029
109;145;29062021122029
110;142;29062021122029
111;143;29062021122029
112;144;29062021122029
113;138;29062021122029
114;139;29062021122029
115;140;29062021122029
116;138;29062021122029
117;140;29062021122029
118;137;29062021122029
119;138;29062021122029
120;137;29062021122029
121;135;29062021122029
122;136;29062021122029
123;135;29062021122029
124;133;29062021122029
125;135;29062021122029
126;132;29062021122029
127;133;29062021122029
128;135;29062021122029
129;132;29062021122029
130;132;29062021122029
131;132;29062021122029
132;128;29062021122029
133;133;29062021122029
134;130;29062021122029
135;129;29062021122029
136;131;29062021122029
137;128;29062021122029
138;130;29062021122029
139;130;29062021122029
140;128;29062021122029
141;129;29062021122029
142;127;29062021122029
143;127;29062021122029
144;130;29062021122029
145;127;29062021122029
146;130;29062021122029
147;127;29062021122029
148;125;29062021122029
149;126;29062021122029
150;126;29062021122029
151;127;29062021122029
152;127;29062021122029
153;124;29062021122029
154;127;29062021122029
155;126;29062021122029
156;125;29062021122029
157;126;29062021122029
158;124;29062021122029
159;124;29062021122029
160;126;29062021122029
161;125;29062021122029
162;126;29062021122029
163;126;29062021122029
164;124;29062021122029
165;127;29062021122029
166;125;29062021122029
167;125;29062021122029
168;126;29062021122029
169;123;29062021122029
170;126;29062021122029
171;124;29062021122029
172;124;29062021122029
173;126;29062021122029
174;125;29062021122029
175;124;29062021122029
176;125;29062021122029
177;122;29062021122029
178;125;29062021122029
179;124;29062021122029
180;124;29062021122029
181;125;29062021122029
182;125;29062021122029
183;123;29062021122029
184;124;29062021122029
185;122;29062021122029
186;126;29062021122029
187;125;29062021122029
188;123;29062021122029
189;124;29062021122029
190;123;29062021122029
191;124;29062021122029
192;127;29062021122029
193;124;29062021122029
194;124;29062021122029
195;123;29062021122029
196;123;29062021122029
197;125;29062021122029
198;125;29062021122029
199;122;29062021122029
200;0;29062021122029
0;0;29062021122030
1;145;29062021122030
2;130;29062021122030
3;129;29062021122030
4;130;29062021122030
5;132;29062021122030
6;129;29062021122030
7;131;29062021122030
8;132;29062021122030
9;130;29062021122030
10;134;29062021122030
11;134;29062021122030
12;134;29062021122030
13;140;29062021122030
14;139;29062021122030
15;146;29062021122030
16;152;29062021122030
17;164;29062021122030
18;192;29062021122030
19;247;29062021122030
20;364;29062021122030
21;665;29062021122030
22;1023;29062021122030
23;1023;29062021122030
24;1023;29062021122030
25;1023;29062021122030
26;1023;29062021122030
27;1023;29062021122030
28;1023;29062021122030
29;1023;29062021122030
30;1023;29062021122030
31;1023;29062021122030
32;1023;29062021122030
33;1023;29062021122030
34;986;29062021122030
35;772;29062021122030
36;585;29062021122030
37;457;29062021122030
38;372;29062021122030
39;316;29062021122030
40;277;29062021122030
41;247;29062021122030
42;234;29062021122030
43;222;29062021122030
44;215;29062021122030
45;212;29062021122030
46;207;29062021122030
47;207;29062021122030
48;207;29062021122030
49;203;29062021122030
50;204;29062021122030
51;204;29062021122030
52;201;29062021122030
53;204;29062021122030
54;203;29062021122030
55;206;29062021122030
56;207;29062021122030
57;209;29062021122030
58;216;29062021122030
59;213;29062021122030
60;219;29062021122030
61;220;29062021122030
62;222;29062021122030
63;225;29062021122030
64;228;29062021122030
65;223;29062021122030
66;226;29062021122030
67;225;29062021122030
68;222;29062021122030
69;221;29062021122030
70;217;29062021122030
71;217;29062021122030
72;215;29062021122030
73;205;29062021122030
74;208;29062021122030
75;200;29062021122030
76;197;29062021122030
77;197;29062021122030
78;192;29062021122030
79;190;29062021122030
80;186;29062021122030
81;183;29062021122030
82;183;29062021122030
83;178;29062021122030
84;177;29062021122030
85;175;29062021122030
86;172;29062021122030
87;173;29062021122030
88;174;29062021122030
89;168;29062021122030
90;170;29062021122030
91;169;29062021122030
92;165;29062021122030
93;164;29062021122030
94;162;29062021122030
95;160;29062021122030
96;160;29062021122030
97;157;29062021122030
98;156;29062021122030
99;155;29062021122030
100;152;29062021122030
101;155;29062021122030
102;149;29062021122030
103;148;29062021122030
104;148;29062021122030
105;147;29062021122030
106;149;29062021122030
107;145;29062021122030
108;144;29062021122030
109;144;29062021122030
110;141;29062021122030
111;142;29062021122030
112;143;29062021122030
113;139;29062021122030
114;140;29062021122030
115;140;29062021122030
116;139;29062021122030
117;141;29062021122030
118;137;29062021122030
119;137;29062021122030
120;136;29062021122030
121;133;29062021122030
122;136;29062021122030
123;136;29062021122030
124;134;29062021122030
125;135;29062021122030
126;132;29062021122030
127;133;29062021122030
128;135;29062021122030
129;132;29062021122030
130;133;29062021122030
131;132;29062021122030
132;130;29062021122030
133;134;29062021122030
134;129;29062021122030
135;130;29062021122030
136;131;29062021122030
137;129;29062021122030
138;131;29062021122030
139;129;29062021122030
140;127;29062021122030
141;131;29062021122030
142;128;29062021122030
143;128;29062021122030
144;128;29062021122030
145;125;29062021122030
146;129;29062021122030
147;128;29062021122030
148;126;29062021122030
149;126;29062021122030
150;127;29062021122030
151;127;29062021122030
152;127;29062021122030
153;125;29062021122030
154;127;29062021122030
155;126;29062021122030
156;125;29062021122030
157;126;29062021122030
158;125;29062021122030
159;124;29062021122030
160;126;29062021122030
161;125;29062021122030
162;126;29062021122030
163;126;29062021122030
164;124;29062021122030
165;127;29062021122030
166;124;29062021122030
167;125;29062021122030
168;126;29062021122030
169;123;29062021122030
170;126;29062021122030
171;125;29062021122030
172;124;29062021122030
173;125;29062021122030
174;124;29062021122030
175;124;29062021122030
176;126;29062021122030
177;124;29062021122030
178;126;29062021122030
179;124;29062021122030
180;123;29062021122030
181;125;29062021122030
182;125;29062021122030
183;123;29062021122030
184;124;29062021122030
185;123;29062021122030
186;125;29062021122030
187;125;29062021122030
188;123;29062021122030
189;124;29062021122030
190;123;29062021122030
191;124;29062021122030
192;127;29062021122030
193;124;29062021122030
194;125;29062021122030
195;124;29062021122030
196;123;29062021122030
197;125;29062021122030
198;123;29062021122030
199;123;29062021122030
200;0;29062021122030
0;0;29062021122030
1;145;29062021122030
2;130;29062021122030
3;128;29062021122030
4;128;29062021122030
5;131;29062021122030
6;129;29062021122030
7;131;29062021122030
8;133;29062021122030
9;130;29062021122030
10;134;29062021122030
11;133;29062021122030
12;134;29062021122030
13;139;29062021122030
14;138;29062021122030
15;144;29062021122030
16;151;29062021122030
17;161;29062021122030
18;190;29062021122030
19;243;29062021122030
20;366;29062021122030
21;661;29062021122030
22;1023;29062021122030
23;1023;29062021122030
24;1023;29062021122030
25;1023;29062021122030
26;1023;29062021122030
27;1023;29062021122030
28;1023;29062021122030
29;1023;29062021122030
30;1023;29062021122030
31;1023;29062021122030
32;1023;29062021122030
33;1023;29062021122030
34;990;29062021122030
35;783;29062021122030
36;589;29062021122030
37;461;29062021122030
38;374;29062021122030
39;319;29062021122030
40;278;29062021122030
41;248;29062021122030
42;233;29062021122030
43;220;29062021122030
44;217;29062021122030
45;213;29062021122030
46;208;29062021122030
47;207;29062021122030
48;206;29062021122030
49;203;29062021122030
50;204;29062021122030
51;202;29062021122030
52;202;29062021122030
53;206;29062021122030
54;204;29062021122030
55;205;29062021122030
56;208;29062021122030
57;209;29062021122030
58;213;29062021122030
59;214;29062021122030
60;218;29062021122030
61;220;29062021122030
62;222;29062021122030
63;225;29062021122030
64;227;29062021122030
65;223;29062021122030
66;227;29062021122030
67;222;29062021122030
68;223;29062021122030
69;222;29062021122030
70;215;29062021122030
71;215;29062021122030
72;212;29062021122030
73;206;29062021122030
74;208;29062021122030
75;200;29062021122030
76;197;29062021122030
77;195;29062021122030
78;192;29062021122030
79;189;29062021122030
80;186;29062021122030
81;180;29062021122030
82;182;29062021122030
83;178;29062021122030
84;175;29062021122030
85;174;29062021122030
86;173;29062021122030
87;171;29062021122030
88;172;29062021122030
89;167;29062021122030
90;169;29062021122030
91;167;29062021122030
92;161;29062021122030
93;164;29062021122030
94;160;29062021122030
95;159;29062021122030
96;159;29062021122030
97;155;29062021122030
98;156;29062021122030
99;154;29062021122030
100;151;29062021122030
101;153;29062021122030
102;150;29062021122030
103;148;29062021122030
104;148;29062021122030
105;144;29062021122030
106;148;29062021122030
107;146;29062021122030
108;143;29062021122030
109;144;29062021122030
110;142;29062021122030
111;142;29062021122030
112;142;29062021122030
113;138;29062021122030
114;139;29062021122030
115;141;29062021122030
116;138;29062021122030
117;139;29062021122030
118;136;29062021122030
119;138;29062021122030
120;136;29062021122030
121;133;29062021122030
122;135;29062021122030
123;135;29062021122030
124;133;29062021122030
125;135;29062021122030
126;134;29062021122030
127;133;29062021122030
128;135;29062021122030
129;131;29062021122030
130;131;29062021122030
131;132;29062021122030
132;128;29062021122030
133;133;29062021122030
134;129;29062021122030
135;129;29062021122030
136;130;29062021122030
137;128;29062021122030
138;129;29062021122030
139;128;29062021122030
140;127;29062021122030
141;129;29062021122030
142;127;29062021122030
143;127;29062021122030
144;128;29062021122030
145;125;29062021122030
146;129;29062021122030
147;128;29062021122030
148;126;29062021122030
149;126;29062021122030
150;125;29062021122030
151;126;29062021122030
152;126;29062021122030
153;125;29062021122030
154;126;29062021122030
155;125;29062021122030
156;124;29062021122030
157;125;29062021122030
158;124;29062021122030
159;124;29062021122030
160;125;29062021122030
161;123;29062021122030
162;125;29062021122030
163;125;29062021122030
164;124;29062021122030
165;127;29062021122030
166;124;29062021122030
167;124;29062021122030
168;125;29062021122030
169;122;29062021122030
170;125;29062021122030
171;124;29062021122030
172;123;29062021122030
173;124;29062021122030
174;124;29062021122030
175;124;29062021122030
176;125;29062021122030
177;122;29062021122030
178;125;29062021122030
179;123;29062021122030
180;123;29062021122030
181;125;29062021122030
182;124;29062021122030
183;123;29062021122030
184;125;29062021122030
185;121;29062021122030
186;126;29062021122030
187;124;29062021122030
188;122;29062021122030
189;124;29062021122030
190;122;29062021122030
191;122;29062021122030
192;126;29062021122030
193;123;29062021122030
194;124;29062021122030
195;123;29062021122030
196;122;29062021122030
197;124;29062021122030
198;124;29062021122030
199;122;29062021122030
200;0;29062021122030
0;0;29062021122030
1;145;29062021122030
2;130;29062021122030
3;127;29062021122030
4;129;29062021122030
5;130;29062021122030
6;129;29062021122030
7;130;29062021122030
8;132;29062021122030
9;130;29062021122030
10;134;29062021122030
11;134;29062021122030
12;134;29062021122030
13;138;29062021122030
14;139;29062021122030
15;145;29062021122030
16;150;29062021122030
17;161;29062021122030
18;190;29062021122030
19;244;29062021122030
20;368;29062021122030
21;663;29062021122030
22;1023;29062021122030
23;1023;29062021122030
24;1023;29062021122030
25;1023;29062021122030
26;1023;29062021122030
27;1023;29062021122030
28;1023;29062021122030
29;1023;29062021122030
30;1023;29062021122030
31;1023;29062021122030
32;1023;29062021122030
33;1023;29062021122030
34;989;29062021122030
35;783;29062021122030
36;592;29062021122030
37;463;29062021122030
38;372;29062021122030
39;317;29062021122030
40;275;29062021122030
41;248;29062021122030
42;235;29062021122030
43;222;29062021122030
44;215;29062021122030
45;212;29062021122030
46;209;29062021122030
47;207;29062021122030
48;205;29062021122030
49;203;29062021122030
50;205;29062021122030
51;204;29062021122030
52;201;29062021122030
53;205;29062021122030
54;204;29062021122030
55;206;29062021122030
56;210;29062021122030
57;208;29062021122030
58;213;29062021122030
59;216;29062021122030
60;218;29062021122030
61;222;29062021122030
62;222;29062021122030
63;224;29062021122030
64;227;29062021122030
65;222;29062021122030
66;228;29062021122030
67;224;29062021122030
68;221;29062021122030
69;221;29062021122030
70;217;29062021122030
71;213;29062021122030
72;215;29062021122030
73;206;29062021122030
74;205;29062021122030
75;200;29062021122030
76;198;29062021122030
77;196;29062021122030
78;192;29062021122030
79;191;29062021122030
80;185;29062021122030
81;181;29062021122030
82;182;29062021122030
83;178;29062021122030
84;175;29062021122030
85;175;29062021122030
86;173;29062021122030
87;171;29062021122030
88;173;29062021122030
89;168;29062021122030
90;170;29062021122030
91;167;29062021122030
92;162;29062021122030
93;165;29062021122030
94;161;29062021122030
95;159;29062021122030
96;160;29062021122030
97;155;29062021122030
98;155;29062021122030
99;155;29062021122030
100;151;29062021122030
101;152;29062021122030
102;150;29062021122030
103;149;29062021122030
104;147;29062021122030
105;146;29062021122030
106;147;29062021122030
107;145;29062021122030
108;144;29062021122030
109;144;29062021122030
110;140;29062021122030
111;140;29062021122030
112;142;29062021122030
113;139;29062021122030
114;140;29062021122030
115;139;29062021122030
116;137;29062021122030
117;140;29062021122030
118;137;29062021122030
119;136;29062021122030
120;137;29062021122030
121;135;29062021122030
122;135;29062021122030
123;135;29062021122030
124;133;29062021122030
125;135;29062021122030
126;133;29062021122030
127;133;29062021122030
128;134;29062021122030
129;131;29062021122030
130;132;29062021122030
131;132;29062021122030
132;130;29062021122030
133;134;29062021122030
134;128;29062021122030
135;129;29062021122030
136;131;29062021122030
137;128;29062021122030
138;129;29062021122030
139;128;29062021122030
140;127;29062021122030
141;129;29062021122030
142;127;29062021122030
143;127;29062021122030
144;128;29062021122030
145;126;29062021122030
146;128;29062021122030
147;126;29062021122030
148;126;29062021122030
149;126;29062021122030
150;126;29062021122030
151;126;29062021122030
152;126;29062021122030
153;124;29062021122030
154;127;29062021122030
155;126;29062021122030
156;124;29062021122030
157;126;29062021122030
158;124;29062021122030
159;124;29062021122030
160;126;29062021122030
161;125;29062021122030
162;125;29062021122030
163;125;29062021122030
164;124;29062021122030
165;127;29062021122030
166;124;29062021122030
167;125;29062021122030
168;126;29062021122030
169;122;29062021122030
170;125;29062021122030
171;124;29062021122030
172;124;29062021122030
173;125;29062021122030
174;123;29062021122030
175;122;29062021122030
176;125;29062021122030
177;123;29062021122030
178;126;29062021122030
179;124;29062021122030
180;122;29062021122030
181;125;29062021122030
182;124;29062021122030
183;123;29062021122030
184;125;29062021122030
185;122;29062021122030
186;125;29062021122030
187;124;29062021122030
188;122;29062021122030
189;124;29062021122030
190;123;29062021122030
191;123;29062021122030
192;126;29062021122030
193;123;29062021122030
194;124;29062021122030
195;123;29062021122030
196;123;29062021122030
197;124;29062021122030
198;123;29062021122030
199;123;29062021122030
200;0;29062021122030
0;0;29062021122031
1;145;29062021122031
2;130;29062021122031
3;127;29062021122031
4;129;29062021122031
5;130;29062021122031
6;128;29062021122031
7;131;29062021122031
8;132;29062021122031
9;130;29062021122031
10;134;29062021122031
11;132;29062021122031
12;132;29062021122031
13;139;29062021122031
14;140;29062021122031
15;145;29062021122031
16;152;29062021122031
17;162;29062021122031
18;191;29062021122031
19;244;29062021122031
20;366;29062021122031
21;666;29062021122031
22;1023;29062021122031
23;1023;29062021122031
24;1023;29062021122031
25;1023;29062021122031
26;1023;29062021122031
27;1023;29062021122031
28;1023;29062021122031
29;1023;29062021122031
30;1023;29062021122031
31;1023;29062021122031
32;1023;29062021122031
33;1023;29062021122031
34;988;29062021122031
35;783;29062021122031
36;591;29062021122031
37;466;29062021122031
38;378;29062021122031
39;316;29062021122031
40;278;29062021122031
41;248;29062021122031
42;235;29062021122031
43;222;29062021122031
44;216;29062021122031
45;212;29062021122031
46;207;29062021122031
47;207;29062021122031
48;209;29062021122031
49;201;29062021122031
50;205;29062021122031
51;203;29062021122031
52;201;29062021122031
53;205;29062021122031
54;206;29062021122031
55;206;29062021122031
56;209;29062021122031
57;209;29062021122031
58;215;29062021122031
59;215;29062021122031
60;218;29062021122031
61;221;29062021122031
62;223;29062021122031
63;227;29062021122031
64;226;29062021122031
65;224;29062021122031
66;225;29062021122031
67;224;29062021122031
68;223;29062021122031
69;221;29062021122031
70;217;29062021122031
71;214;29062021122031
72;215;29062021122031
73;208;29062021122031
74;205;29062021122031
75;198;29062021122031
76;198;29062021122031
77;195;29062021122031
78;191;29062021122031
79;190;29062021122031
80;188;29062021122031
81;181;29062021122031
82;183;29062021122031
83;178;29062021122031
84;178;29062021122031
85;176;29062021122031
86;172;29062021122031
87;173;29062021122031
88;174;29062021122031
89;168;29062021122031
90;170;29062021122031
91;168;29062021122031
92;164;29062021122031
93;163;29062021122031
94;162;29062021122031
95;159;29062021122031
96;159;29062021122031
97;155;29062021122031
98;155;29062021122031
99;153;29062021122031
100;151;29062021122031
101;153;29062021122031
102;150;29062021122031
103;147;29062021122031
104;147;29062021122031
105;145;29062021122031
106;149;29062021122031
107;144;29062021122031
108;144;29062021122031
109;144;29062021122031
110;141;29062021122031
111;140;29062021122031
112;142;29062021122031
113;139;29062021122031
114;139;29062021122031
115;139;29062021122031
116;138;29062021122031
117;140;29062021122031
118;137;29062021122031
119;137;29062021122031
120;136;29062021122031
121;134;29062021122031
122;136;29062021122031
123;134;29062021122031
124;134;29062021122031
125;135;29062021122031
126;133;29062021122031
127;132;29062021122031
128;134;29062021122031
129;130;29062021122031
130;132;29062021122031
131;131;29062021122031
132;130;29062021122031
133;134;29062021122031
134;129;29062021122031
135;130;29062021122031
136;131;29062021122031
137;127;29062021122031
138;130;29062021122031
139;128;29062021122031
140;127;29062021122031
141;129;29062021122031
142;127;29062021122031
143;127;29062021122031
144;128;29062021122031
145;125;29062021122031
146;128;29062021122031
147;127;29062021122031
148;126;29062021122031
149;126;29062021122031
150;126;29062021122031
151;126;29062021122031
152;127;29062021122031
153;125;29062021122031
154;126;29062021122031
155;125;29062021122031
156;124;29062021122031
157;125;29062021122031
158;125;29062021122031
159;124;29062021122031
160;127;29062021122031
161;125;29062021122031
162;125;29062021122031
163;125;29062021122031
164;124;29062021122031
165;126;29062021122031
166;124;29062021122031
167;124;29062021122031
168;126;29062021122031
169;122;29062021122031
170;126;29062021122031
171;125;29062021122031
172;124;29062021122031
173;125;29062021122031
174;123;29062021122031
175;123;29062021122031
176;124;29062021122031
177;122;29062021122031
178;125;29062021122031
179;124;29062021122031
180;122;29062021122031
181;125;29062021122031
182;124;29062021122031
183;123;29062021122031
184;124;29062021122031
185;121;29062021122031
186;125;29062021122031
187;124;29062021122031
188;122;29062021122031
189;124;29062021122031
190;122;29062021122031
191;123;29062021122031
192;125;29062021122031
193;123;29062021122031
194;125;29062021122031
195;124;29062021122031
196;123;29062021122031
197;124;29062021122031
198;124;29062021122031
199;122;29062021122031
200;0;29062021122031
0;0;29062021122032
1;145;29062021122032
2;130;29062021122032
3;129;29062021122032
4;130;29062021122032
5;130;29062021122032
6;129;29062021122032
7;131;29062021122032
8;132;29062021122032
9;131;29062021122032
10;134;29062021122032
11;134;29062021122032
12;134;29062021122032
13;140;29062021122032
14;140;29062021122032
15;143;29062021122032
16;152;29062021122032
17;162;29062021122032
18;190;29062021122032
19;244;29062021122032
20;366;29062021122032
21;660;29062021122032
22;1023;29062021122032
23;1023;29062021122032
24;1023;29062021122032
25;1023;29062021122032
26;1023;29062021122032
27;1023;29062021122032
28;1023;29062021122032
29;1023;29062021122032
30;1023;29062021122032
31;1023;29062021122032
32;1023;29062021122032
33;1023;29062021122032
34;989;29062021122032
35;781;29062021122032
36;587;29062021122032
37;460;29062021122032
38;376;29062021122032
39;316;29062021122032
40;277;29062021122032
41;249;29062021122032
42;234;29062021122032
43;221;29062021122032
44;217;29062021122032
45;212;29062021122032
46;210;29062021122032
47;209;29062021122032
48;206;29062021122032
49;203;29062021122032
50;205;29062021122032
51;202;29062021122032
52;202;29062021122032
53;206;29062021122032
54;204;29062021122032
55;205;29062021122032
56;209;29062021122032
57;208;29062021122032
58;215;29062021122032
59;214;29062021122032
60;217;29062021122032
61;221;29062021122032
62;219;29062021122032
63;224;29062021122032
64;228;29062021122032
65;221;29062021122032
66;226;29062021122032
67;225;29062021122032
68;221;29062021122032
69;220;29062021122032
70;218;29062021122032
71;216;29062021122032
72;213;29062021122032
73;206;29062021122032
74;205;29062021122032
75;200;29062021122032
76;196;29062021122032
77;195;29062021122032
78;192;29062021122032
79;190;29062021122032
80;187;29062021122032
81;182;29062021122032
82;182;29062021122032
83;178;29062021122032
84;175;29062021122032
85;176;29062021122032
86;174;29062021122032
87;175;29062021122032
88;174;29062021122032
89;167;29062021122032
90;171;29062021122032
91;168;29062021122032
92;163;29062021122032
93;163;29062021122032
94;162;29062021122032
95;158;29062021122032
96;160;29062021122032
97;155;29062021122032
98;156;29062021122032
99;154;29062021122032
100;151;29062021122032
101;154;29062021122032
102;151;29062021122032
103;148;29062021122032
104;149;29062021122032
105;145;29062021122032
106;148;29062021122032
107;145;29062021122032
108;144;29062021122032
109;145;29062021122032
110;142;29062021122032
111;141;29062021122032
112;144;29062021122032
113;139;29062021122032
114;139;29062021122032
115;140;29062021122032
116;138;29062021122032
117;141;29062021122032
118;137;29062021122032
119;138;29062021122032
120;136;29062021122032
121;134;29062021122032
122;135;29062021122032
123;135;29062021122032
124;134;29062021122032
125;135;29062021122032
126;134;29062021122032
127;134;29062021122032
128;134;29062021122032
129;132;29062021122032
130;132;29062021122032
131;132;29062021122032
132;131;29062021122032
133;134;29062021122032
134;130;29062021122032
135;129;29062021122032
136;132;29062021122032
137;129;29062021122032
138;130;29062021122032
139;129;29062021122032
140;127;29062021122032
141;129;29062021122032
142;128;29062021122032
143;126;29062021122032
144;129;29062021122032
145;126;29062021122032
146;129;29062021122032
147;127;29062021122032
148;125;29062021122032
149;127;29062021122032
150;127;29062021122032
151;126;29062021122032
152;127;29062021122032
153;126;29062021122032
154;127;29062021122032
155;126;29062021122032
156;125;29062021122032
157;126;29062021122032
158;124;29062021122032
159;125;29062021122032
160;126;29062021122032
161;124;29062021122032
162;127;29062021122032
163;125;29062021122032
164;124;29062021122032
165;126;29062021122032
166;125;29062021122032
167;124;29062021122032
168;126;29062021122032
169;123;29062021122032
170;127;29062021122032
171;125;29062021122032
172;124;29062021122032
173;125;29062021122032
174;123;29062021122032
175;123;29062021122032
176;125;29062021122032
177;123;29062021122032
178;126;29062021122032
179;124;29062021122032
180;124;29062021122032
181;125;29062021122032
182;124;29062021122032
183;123;29062021122032
184;125;29062021122032
185;122;29062021122032
186;126;29062021122032
187;125;29062021122032
188;123;29062021122032
189;125;29062021122032
190;123;29062021122032
191;124;29062021122032
192;127;29062021122032
193;124;29062021122032
194;125;29062021122032
195;124;29062021122032
196;123;29062021122032
197;124;29062021122032
198;125;29062021122032
199;123;29062021122032
200;0;29062021122032
0;0;29062021122032
1;144;29062021122032
2;129;29062021122032
3;128;29062021122032
4;129;29062021122032
5;130;29062021122032
6;129;29062021122032
7;130;29062021122032
8;132;29062021122032
9;130;29062021122032
10;135;29062021122032
11;133;29062021122032
12;134;29062021122032
13;138;29062021122032
14;137;29062021122032
15;143;29062021122032
16;150;29062021122032
17;162;29062021122032
18;191;29062021122032
19;242;29062021122032
20;362;29062021122032
21;654;29062021122032
22;1023;29062021122032
23;1023;29062021122032
24;1023;29062021122032
25;1023;29062021122032
26;1023;29062021122032
27;1023;29062021122032
28;1023;29062021122032
29;1023;29062021122032
30;1023;29062021122032
31;1023;29062021122032
32;1023;29062021122032
33;1023;29062021122032
34;996;29062021122032
35;792;29062021122032
36;594;29062021122032
37;473;29062021122032
38;381;29062021122032
39;320;29062021122032
40;281;29062021122032
41;250;29062021122032
42;236;29062021122032
43;223;29062021122032
44;217;29062021122032
45;212;29062021122032
46;208;29062021122032
47;207;29062021122032
48;208;29062021122032
49;204;29062021122032
50;203;29062021122032
51;204;29062021122032
52;202;29062021122032
53;207;29062021122032
54;203;29062021122032
55;205;29062021122032
56;206;29062021122032
57;208;29062021122032
58;214;29062021122032
59;214;29062021122032
60;215;29062021122032
61;221;29062021122032
62;221;29062021122032
63;223;29062021122032
64;225;29062021122032
65;222;29062021122032
66;227;29062021122032
67;224;29062021122032
68;222;29062021122032
69;221;29062021122032
70;217;29062021122032
71;216;29062021122032
72;214;29062021122032
73;208;29062021122032
74;207;29062021122032
75;202;29062021122032
76;199;29062021122032
77;198;29062021122032
78;191;29062021122032
79;190;29062021122032
80;185;29062021122032
81;181;29062021122032
82;183;29062021122032
83;177;29062021122032
84;176;29062021122032
85;175;29062021122032
86;173;29062021122032
87;172;29062021122032
88;172;29062021122032
89;166;29062021122032
90;170;29062021122032
91;166;29062021122032
92;162;29062021122032
93;164;29062021122032
94;160;29062021122032
95;157;29062021122032
96;159;29062021122032
97;155;29062021122032
98;154;29062021122032
99;154;29062021122032
100;150;29062021122032
101;153;29062021122032
102;150;29062021122032
103;148;29062021122032
104;148;29062021122032
105;146;29062021122032
106;148;29062021122032
107;144;29062021122032
108;143;29062021122032
109;145;29062021122032
110;141;29062021122032
111;141;29062021122032
112;143;29062021122032
113;139;29062021122032
114;140;29062021122032
115;140;29062021122032
116;138;29062021122032
117;142;29062021122032
118;137;29062021122032
119;136;29062021122032
120;136;29062021122032
121;134;29062021122032
122;136;29062021122032
123;135;29062021122032
124;134;29062021122032
125;135;29062021122032
126;131;29062021122032
127;132;29062021122032
128;133;29062021122032
129;131;29062021122032
130;132;29062021122032
131;131;29062021122032
132;129;29062021122032
133;133;29062021122032
134;129;29062021122032
135;130;29062021122032
136;130;29062021122032
137;128;29062021122032
138;130;29062021122032
139;128;29062021122032
140;128;29062021122032
141;130;29062021122032
142;126;29062021122032
143;127;29062021122032
144;129;29062021122032
145;125;29062021122032
146;128;29062021122032
147;127;29062021122032
148;126;29062021122032
149;126;29062021122032
150;126;29062021122032
151;127;29062021122032
152;127;29062021122032
153;124;29062021122032
154;127;29062021122032
155;125;29062021122032
156;125;29062021122032
157;126;29062021122032
158;125;29062021122032
159;125;29062021122032
160;126;29062021122032
161;125;29062021122032
162;126;29062021122032
163;124;29062021122032
164;124;29062021122032
165;126;29062021122032
166;124;29062021122032
167;124;29062021122032
168;126;29062021122032
169;123;29062021122032
170;126;29062021122032
171;124;29062021122032
172;124;29062021122032
173;125;29062021122032
174;123;29062021122032
175;123;29062021122032
176;124;29062021122032
177;123;29062021122032
178;126;29062021122032
179;124;29062021122032
180;124;29062021122032
181;124;29062021122032
182;125;29062021122032
183;123;29062021122032
184;124;29062021122032
185;121;29062021122032
186;125;29062021122032
187;124;29062021122032
188;122;29062021122032
189;125;29062021122032
190;123;29062021122032
191;122;29062021122032
192;126;29062021122032
193;123;29062021122032
194;124;29062021122032
195;123;29062021122032
196;123;29062021122032
197;124;29062021122032
198;124;29062021122032
199;123;29062021122032
200;0;29062021122032
0;0;29062021122033
1;145;29062021122033
2;130;29062021122033
3;128;29062021122033
4;129;29062021122033
5;131;29062021122033
6;128;29062021122033
7;130;29062021122033
8;132;29062021122033
9;130;29062021122033
10;133;29062021122033
11;132;29062021122033
12;133;29062021122033
13;139;29062021122033
14;140;29062021122033
15;144;29062021122033
16;152;29062021122033
17;161;29062021122033
18;191;29062021122033
19;245;29062021122033
20;362;29062021122033
21;662;29062021122033
22;1023;29062021122033
23;1023;29062021122033
24;1023;29062021122033
25;1023;29062021122033
26;1023;29062021122033
27;1023;29062021122033
28;1023;29062021122033
29;1023;29062021122033
30;1023;29062021122033
31;1023;29062021122033
32;1023;29062021122033
33;1023;29062021122033
34;991;29062021122033
35;780;29062021122033
36;590;29062021122033
37;463;29062021122033
38;373;29062021122033
39;318;29062021122033
40;275;29062021122033
41;252;29062021122033
42;235;29062021122033
43;223;29062021122033
44;215;29062021122033
45;214;29062021122033
46;208;29062021122033
47;208;29062021122033
48;207;29062021122033
49;204;29062021122033
50;205;29062021122033
51;204;29062021122033
52;203;29062021122033
53;204;29062021122033
54;205;29062021122033
55;207;29062021122033
56;208;29062021122033
57;207;29062021122033
58;214;29062021122033
59;215;29062021122033
60;219;29062021122033
61;221;29062021122033
62;221;29062021122033
63;223;29062021122033
64;226;29062021122033
65;222;29062021122033
66;226;29062021122033
67;222;29062021122033
68;221;29062021122033
69;220;29062021122033
70;217;29062021122033
71;212;29062021122033
72;215;29062021122033
73;207;29062021122033
74;207;29062021122033
75;201;29062021122033
76;200;29062021122033
77;196;29062021122033
78;192;29062021122033
79;189;29062021122033
80;186;29062021122033
81;181;29062021122033
82;181;29062021122033
83;177;29062021122033
84;175;29062021122033
85;173;29062021122033
86;174;29062021122033
87;172;29062021122033
88;173;29062021122033
89;168;29062021122033
90;169;29062021122033
91;168;29062021122033
92;163;29062021122033
93;163;29062021122033
94;162;29062021122033
95;158;29062021122033
96;160;29062021122033
97;155;29062021122033
98;153;29062021122033
99;152;29062021122033
100;151;29062021122033
101;152;29062021122033
102;149;29062021122033
103;149;29062021122033
104;148;29062021122033
105;145;29062021122033
106;147;29062021122033
107;144;29062021122033
108;142;29062021122033
109;144;29062021122033
110;141;29062021122033
111;140;29062021122033
112;142;29062021122033
113;137;29062021122033
114;139;29062021122033
115;140;29062021122033
116;138;29062021122033
117;139;29062021122033
118;137;29062021122033
119;137;29062021122033
120;136;29062021122033
121;134;29062021122033
122;136;29062021122033
123;134;29062021122033
124;132;29062021122033
125;136;29062021122033
126;132;29062021122033
127;131;29062021122033
128;133;29062021122033
129;132;29062021122033
130;132;29062021122033
131;133;29062021122033
132;129;29062021122033
133;133;29062021122033
134;129;29062021122033
135;129;29062021122033
136;132;29062021122033
137;128;29062021122033
138;129;29062021122033
139;128;29062021122033
140;127;29062021122033
141;128;29062021122033
142;127;29062021122033
143;126;29062021122033
144;127;29062021122033
145;125;29062021122033
146;129;29062021122033
147;127;29062021122033
148;126;29062021122033
149;126;29062021122033
150;126;29062021122033
151;126;29062021122033
152;127;29062021122033
153;125;29062021122033
154;126;29062021122033
155;124;29062021122033
156;123;29062021122033
157;124;29062021122033
158;124;29062021122033
159;125;29062021122033
160;125;29062021122033
161;124;29062021122033
162;126;29062021122033
163;124;29062021122033
164;124;29062021122033
165;126;29062021122033
166;124;29062021122033
167;124;29062021122033
168;125;29062021122033
169;122;29062021122033
170;125;29062021122033
171;124;29062021122033
172;123;29062021122033
173;124;29062021122033
174;124;29062021122033
175;122;29062021122033
176;124;29062021122033
177;122;29062021122033
178;125;29062021122033
179;123;29062021122033
180;123;29062021122033
181;124;29062021122033
182;125;29062021122033
183;123;29062021122033
184;124;29062021122033
185;121;29062021122033
186;126;29062021122033
187;123;29062021122033
188;123;29062021122033
189;125;29062021122033
190;123;29062021122033
191;123;29062021122033
192;126;29062021122033
193;122;29062021122033
194;124;29062021122033
195;124;29062021122033
196;123;29062021122033
197;123;29062021122033
198;124;29062021122033
199;122;29062021122033
200;0;29062021122033
0;0;29062021122033
1;145;29062021122033
2;131;29062021122033
3;129;29062021122033
4;129;29062021122033
5;131;29062021122033
6;130;29062021122033
7;132;29062021122033
8;133;29062021122033
9;130;29062021122033
10;135;29062021122033
11;133;29062021122033
12;134;29062021122033
13;139;29062021122033
14;139;29062021122033
15;146;29062021122033
16;151;29062021122033
17;162;29062021122033
18;191;29062021122033
19;244;29062021122033
20;365;29062021122033
21;657;29062021122033
22;1023;29062021122033
23;1023;29062021122033
24;1023;29062021122033
25;1023;29062021122033
26;1023;29062021122033
27;1023;29062021122033
28;1023;29062021122033
29;1023;29062021122033
30;1023;29062021122033
31;1023;29062021122033
32;1023;29062021122033
33;1023;29062021122033
34;987;29062021122033
35;783;29062021122033
36;593;29062021122033
37;461;29062021122033
38;375;29062021122033
39;318;29062021122033
40;280;29062021122033
41;251;29062021122033
42;235;29062021122033
43;220;29062021122033
44;213;29062021122033
45;211;29062021122033
46;209;29062021122033
47;207;29062021122033
48;208;29062021122033
49;204;29062021122033
50;204;29062021122033
51;204;29062021122033
52;201;29062021122033
53;203;29062021122033
54;205;29062021122033
55;205;29062021122033
56;208;29062021122033
57;208;29062021122033
58;216;29062021122033
59;216;29062021122033
60;218;29062021122033
61;221;29062021122033
62;220;29062021122033
63;224;29062021122033
64;228;29062021122033
65;221;29062021122033
66;224;29062021122033
67;223;29062021122033
68;219;29062021122033
69;221;29062021122033
70;216;29062021122033
71;214;29062021122033
72;213;29062021122033
73;205;29062021122033
74;206;29062021122033
75;200;29062021122033
76;199;29062021122033
77;196;29062021122033
78;193;29062021122033
79;190;29062021122033
80;187;29062021122033
81;182;29062021122033
82;181;29062021122033
83;178;29062021122033
84;177;29062021122033
85;177;29062021122033
86;172;29062021122033
87;173;29062021122033
88;173;29062021122033
89;168;29062021122033
90;170;29062021122033
91;167;29062021122033
92;163;29062021122033
93;166;29062021122033
94;162;29062021122033
95;160;29062021122033
96;159;29062021122033
97;156;29062021122033
98;155;29062021122033
99;153;29062021122033
100;151;29062021122033
101;154;29062021122033
102;151;29062021122033
103;149;29062021122033
104;148;29062021122033
105;145;29062021122033
106;149;29062021122033
107;145;29062021122033
108;143;29062021122033
109;145;29062021122033
110;142;29062021122033
111;142;29062021122033
112;143;29062021122033
113;138;29062021122033
114;140;29062021122033
115;140;29062021122033
116;138;29062021122033
117;141;29062021122033
118;137;29062021122033
119;138;29062021122033
120;135;29062021122033
121;135;29062021122033
122;136;29062021122033
123;136;29062021122033
124;133;29062021122033
125;135;29062021122033
126;132;29062021122033
127;133;29062021122033
128;136;29062021122033
129;131;29062021122033
130;133;29062021122033
131;133;29062021122033
132;130;29062021122033
133;134;29062021122033
134;129;29062021122033
135;129;29062021122033
136;132;29062021122033
137;129;29062021122033
138;130;29062021122033
139;128;29062021122033
140;128;29062021122033
141;130;29062021122033
142;128;29062021122033
143;127;29062021122033
144;129;29062021122033
145;126;29062021122033
146;129;29062021122033
147;128;29062021122033
148;126;29062021122033
149;127;29062021122033
150;127;29062021122033
151;126;29062021122033
152;126;29062021122033
153;125;29062021122033
154;128;29062021122033
155;126;29062021122033
156;125;29062021122033
157;125;29062021122033
158;125;29062021122033
159;125;29062021122033
160;126;29062021122033
161;124;29062021122033
162;125;29062021122033
163;126;29062021122033
164;124;29062021122033
165;127;29062021122033
166;124;29062021122033
167;124;29062021122033
168;126;29062021122033
169;123;29062021122033
170;126;29062021122033
171;124;29062021122033
172;124;29062021122033
173;126;29062021122033
174;124;29062021122033
175;123;29062021122033
176;125;29062021122033
177;123;29062021122033
178;126;29062021122033
179;123;29062021122033
180;124;29062021122033
181;126;29062021122033
182;125;29062021122033
183;123;29062021122033
184;125;29062021122033
185;123;29062021122033
186;125;29062021122033
187;124;29062021122033
188;123;29062021122033
189;125;29062021122033
190;123;29062021122033
191;124;29062021122033
192;126;29062021122033
193;124;29062021122033
194;124;29062021122033
195;124;29062021122033
196;123;29062021122033
197;124;29062021122033
198;125;29062021122033
199;123;29062021122033
200;0;29062021122033
0;0;29062021122034
1;144;29062021122034
2;130;29062021122034
3;128;29062021122034
4;129;29062021122034
5;131;29062021122034
6;129;29062021122034
7;132;29062021122034
8;133;29062021122034
9;131;29062021122034
10;134;29062021122034
11;132;29062021122034
12;133;29062021122034
13;138;29062021122034
14;139;29062021122034
15;144;29062021122034
16;150;29062021122034
17;162;29062021122034
18;192;29062021122034
19;243;29062021122034
20;362;29062021122034
21;648;29062021122034
22;1023;29062021122034
23;1023;29062021122034
24;1023;29062021122034
25;1023;29062021122034
26;1023;29062021122034
27;1023;29062021122034
28;1023;29062021122034
29;1023;29062021122034
30;1023;29062021122034
31;1023;29062021122034
32;1023;29062021122034
33;1023;29062021122034
34;996;29062021122034
35;790;29062021122034
36;596;29062021122034
37;464;29062021122034
38;377;29062021122034
39;319;29062021122034
40;281;29062021122034
41;248;29062021122034
42;234;29062021122034
43;223;29062021122034
44;216;29062021122034
45;211;29062021122034
46;207;29062021122034
47;205;29062021122034
48;207;29062021122034
49;203;29062021122034
50;206;29062021122034
51;201;29062021122034
52;201;29062021122034
53;206;29062021122034
54;203;29062021122034
55;205;29062021122034
56;208;29062021122034
57;209;29062021122034
58;213;29062021122034
59;216;29062021122034
60;216;29062021122034
61;218;29062021122034
62;220;29062021122034
63;223;29062021122034
64;226;29062021122034
65;222;29062021122034
66;226;29062021122034
67;222;29062021122034
68;221;29062021122034
69;220;29062021122034
70;216;29062021122034
71;213;29062021122034
72;212;29062021122034
73;207;29062021122034
74;205;29062021122034
75;198;29062021122034
76;199;29062021122034
77;196;29062021122034
78;189;29062021122034
79;189;29062021122034
80;186;29062021122034
81;181;29062021122034
82;180;29062021122034
83;177;29062021122034
84;175;29062021122034
85;175;29062021122034
86;172;29062021122034
87;173;29062021122034
88;172;29062021122034
89;168;29062021122034
90;168;29062021122034
91;168;29062021122034
92;163;29062021122034
93;164;29062021122034
94;160;29062021122034
95;157;29062021122034
96;158;29062021122034
97;156;29062021122034
98;155;29062021122034
99;153;29062021122034
100;150;29062021122034
101;152;29062021122034
102;149;29062021122034
103;149;29062021122034
104;146;29062021122034
105;146;29062021122034
106;149;29062021122034
107;145;29062021122034
108;144;29062021122034
109;144;29062021122034
110;141;29062021122034
111;142;29062021122034
112;142;29062021122034
113;138;29062021122034
114;140;29062021122034
115;140;29062021122034
116;138;29062021122034
117;140;29062021122034
118;137;29062021122034
119;136;29062021122034
120;136;29062021122034
121;134;29062021122034
122;135;29062021122034
123;134;29062021122034
124;133;29062021122034
125;135;29062021122034
126;132;29062021122034
127;132;29062021122034
128;134;29062021122034
129;132;29062021122034
130;132;29062021122034
131;132;29062021122034
132;129;29062021122034
133;133;29062021122034
134;130;29062021122034
135;130;29062021122034
136;131;29062021122034
137;128;29062021122034
138;129;29062021122034
139;128;29062021122034
140;127;29062021122034
141;130;29062021122034
142;127;29062021122034
143;126;29062021122034
144;128;29062021122034
145;125;29062021122034
146;128;29062021122034
147;126;29062021122034
148;126;29062021122034
149;126;29062021122034
150;127;29062021122034
151;126;29062021122034
152;127;29062021122034
153;124;29062021122034
154;127;29062021122034
155;125;29062021122034
156;124;29062021122034
157;125;29062021122034
158;124;29062021122034
159;125;29062021122034
160;125;29062021122034
161;124;29062021122034
162;125;29062021122034
163;125;29062021122034
164;124;29062021122034
165;126;29062021122034
166;124;29062021122034
167;124;29062021122034
168;126;29062021122034
169;124;29062021122034
170;125;29062021122034
171;124;29062021122034
172;123;29062021122034
173;125;29062021122034
174;123;29062021122034
175;122;29062021122034
176;125;29062021122034
177;122;29062021122034
178;125;29062021122034
179;125;29062021122034
180;124;29062021122034
181;125;29062021122034
182;124;29062021122034
183;122;29062021122034
184;124;29062021122034
185;122;29062021122034
186;125;29062021122034
187;124;29062021122034
188;121;29062021122034
189;123;29062021122034
190;123;29062021122034
191;122;29062021122034
192;126;29062021122034
193;124;29062021122034
194;124;29062021122034
195;124;29062021122034
196;122;29062021122034
197;124;29062021122034
198;124;29062021122034
199;122;29062021122034
200;0;29062021122034
0;0;29062021122034
1;145;29062021122034
2;129;29062021122034
3;128;29062021122034
4;130;29062021122034
5;131;29062021122034
6;128;29062021122034
7;131;29062021122034
8;132;29062021122034
9;130;29062021122034
10;134;29062021122034
11;133;29062021122034
12;135;29062021122034
13;137;29062021122034
14;138;29062021122034
15;146;29062021122034
16;151;29062021122034
17;161;29062021122034
18;190;29062021122034
19;245;29062021122034
20;363;29062021122034
21;653;29062021122034
22;1023;29062021122034
23;1023;29062021122034
24;1023;29062021122034
25;1023;29062021122034
26;1023;29062021122034
27;1023;29062021122034
28;1023;29062021122034
29;1023;29062021122034
30;1023;29062021122034
31;1023;29062021122034
32;1023;29062021122034
33;1023;29062021122034
34;996;29062021122034
35;788;29062021122034
36;594;29062021122034
37;467;29062021122034
38;378;29062021122034
39;317;29062021122034
40;277;29062021122034
41;250;29062021122034
42;233;29062021122034
43;221;29062021122034
44;217;29062021122034
45;213;29062021122034
46;206;29062021122034
47;203;29062021122034
48;206;29062021122034
49;203;29062021122034
50;204;29062021122034
51;202;29062021122034
52;199;29062021122034
53;202;29062021122034
54;203;29062021122034
55;203;29062021122034
56;209;29062021122034
57;207;29062021122034
58;215;29062021122034
59;214;29062021122034
60;216;29062021122034
61;220;29062021122034
62;220;29062021122034
63;223;29062021122034
64;227;29062021122034
65;221;29062021122034
66;225;29062021122034
67;222;29062021122034
68;220;29062021122034
69;219;29062021122034
70;217;29062021122034
71;215;29062021122034
72;214;29062021122034
73;207;29062021122034
74;207;29062021122034
75;199;29062021122034
76;199;29062021122034
77;195;29062021122034
78;191;29062021122034
79;188;29062021122034
80;187;29062021122034
81;180;29062021122034
82;181;29062021122034
83;177;29062021122034
84;176;29062021122034
85;175;29062021122034
86;173;29062021122034
87;171;29062021122034
88;172;29062021122034
89;167;29062021122034
90;170;29062021122034
91;167;29062021122034
92;163;29062021122034
93;165;29062021122034
94;161;29062021122034
95;158;29062021122034
96;158;29062021122034
97;155;29062021122034
98;155;29062021122034
99;154;29062021122034
100;151;29062021122034
101;152;29062021122034
102;150;29062021122034
103;148;29062021122034
104;149;29062021122034
105;144;29062021122034
106;148;29062021122034
107;144;29062021122034
108;145;29062021122034
109;145;29062021122034
110;141;29062021122034
111;141;29062021122034
112;144;29062021122034
113;139;29062021122034
114;139;29062021122034
115;139;29062021122034
116;137;29062021122034
117;140;29062021122034
118;136;29062021122034
119;137;29062021122034
120;135;29062021122034
121;133;29062021122034
122;134;29062021122034
123;136;29062021122034
124;134;29062021122034
125;133;29062021122034
126;133;29062021122034
127;133;29062021122034
128;134;29062021122034
129;131;29062021122034
130;131;29062021122034
131;131;29062021122034
132;129;29062021122034
133;133;29062021122034
134;129;29062021122034
135;129;29062021122034
136;131;29062021122034
137;128;29062021122034
138;129;29062021122034
139;128;29062021122034
140;127;29062021122034
141;129;29062021122034
142;127;29062021122034
143;127;29062021122034
144;128;29062021122034
145;126;29062021122034
146;129;29062021122034
147;127;29062021122034
148;125;29062021122034
149;126;29062021122034
150;125;29062021122034
151;126;29062021122034
152;126;29062021122034
153;125;29062021122034
154;127;29062021122034
155;126;29062021122034
156;124;29062021122034
157;124;29062021122034
158;123;29062021122034
159;124;29062021122034
160;126;29062021122034
161;124;29062021122034
162;125;29062021122034
163;125;29062021122034
164;124;29062021122034
165;127;29062021122034
166;124;29062021122034
167;125;29062021122034
168;126;29062021122034
169;123;29062021122034
170;125;29062021122034
171;125;29062021122034
172;124;29062021122034
173;125;29062021122034
174;124;29062021122034
175;123;29062021122034
176;124;29062021122034
177;123;29062021122034
178;125;29062021122034
179;123;29062021122034
180;123;29062021122034
181;125;29062021122034
182;125;29062021122034
183;123;29062021122034
184;124;29062021122034
185;121;29062021122034
186;125;29062021122034
187;123;29062021122034
188;122;29062021122034
189;124;29062021122034
190;124;29062021122034
191;123;29062021122034
192;126;29062021122034
193;123;29062021122034
194;123;29062021122034
195;124;29062021122034
196;122;29062021122034
197;124;29062021122034
198;124;29062021122034
199;123;29062021122034
200;0;29062021122034
