ind;val;datetime
0;0;17062021180722
1;159;17062021180722
2;213;17062021180722
3;192;17062021180722
4;205;17062021180722
5;195;17062021180722
6;204;17062021180722
7;213;17062021180722
8;213;17062021180722
9;201;17062021180722
10;211;17062021180722
11;215;17062021180722
12;209;17062021180722
13;219;17062021180722
14;217;17062021180722
15;231;17062021180722
16;238;17062021180722
17;252;17062021180722
18;301;17062021180722
19;398;17062021180722
20;583;17062021180722
21;1014;17062021180722
22;1023;17062021180722
23;1023;17062021180722
24;1023;17062021180722
25;1023;17062021180722
26;1023;17062021180722
27;1023;17062021180722
28;1023;17062021180722
29;1023;17062021180722
30;1023;17062021180722
31;1023;17062021180722
32;1023;17062021180722
33;1023;17062021180722
34;1023;17062021180722
35;1023;17062021180722
36;1023;17062021180722
37;1013;17062021180722
38;962;17062021180722
39;949;17062021180722
40;947;17062021180722
41;959;17062021180722
42;984;17062021180722
43;1000;17062021180722
44;1023;17062021180722
45;1023;17062021180722
46;1023;17062021180722
47;1023;17062021180722
48;1023;17062021180722
49;1023;17062021180722
50;1023;17062021180722
51;1023;17062021180722
52;1023;17062021180722
53;1023;17062021180722
54;1023;17062021180722
55;1023;17062021180722
56;1023;17062021180722
57;1023;17062021180722
58;1023;17062021180722
59;1023;17062021180722
60;1023;17062021180722
61;1023;17062021180722
62;1023;17062021180722
63;1023;17062021180722
64;1023;17062021180722
65;1023;17062021180722
66;1023;17062021180722
67;1023;17062021180722
68;1023;17062021180722
69;1023;17062021180722
70;1023;17062021180722
71;1023;17062021180722
72;1023;17062021180722
73;1023;17062021180722
74;1023;17062021180722
75;1023;17062021180722
76;1010;17062021180722
77;974;17062021180722
78;940;17062021180722
79;920;17062021180722
80;868;17062021180722
81;824;17062021180722
82;803;17062021180722
83;773;17062021180722
84;762;17062021180722
85;741;17062021180722
86;745;17062021180722
87;734;17062021180722
88;705;17062021180722
89;678;17062021180722
90;682;17062021180722
91;647;17062021180722
92;630;17062021180722
93;627;17062021180722
94;598;17062021180722
95;561;17062021180722
96;551;17062021180722
97;528;17062021180722
98;511;17062021180722
99;502;17062021180722
100;478;17062021180722
101;494;17062021180722
102;485;17062021180722
103;448;17062021180722
104;440;17062021180722
105;426;17062021180722
106;411;17062021180722
107;402;17062021180722
108;406;17062021180722
109;387;17062021180722
110;373;17062021180722
111;357;17062021180722
112;346;17062021180722
113;346;17062021180722
114;335;17062021180722
115;334;17062021180722
116;345;17062021180722
117;326;17062021180722
118;318;17062021180722
119;323;17062021180722
120;307;17062021180722
121;299;17062021180722
122;299;17062021180722
123;285;17062021180722
124;294;17062021180722
125;273;17062021180722
126;268;17062021180722
127;280;17062021180722
128;283;17062021180722
129;273;17062021180722
130;262;17062021180722
131;256;17062021180722
132;245;17062021180722
133;276;17062021180722
134;244;17062021180722
135;244;17062021180722
136;240;17062021180722
137;235;17062021180722
138;244;17062021180722
139;232;17062021180722
140;236;17062021180722
141;237;17062021180722
142;229;17062021180722
143;213;17062021180722
144;227;17062021180722
145;223;17062021180722
146;216;17062021180722
147;231;17062021180722
148;213;17062021180722
149;219;17062021180722
150;225;17062021180722
151;223;17062021180722
152;203;17062021180722
153;208;17062021180722
154;208;17062021180722
155;222;17062021180722
156;208;17062021180722
157;199;17062021180722
158;197;17062021180722
159;195;17062021180722
160;192;17062021180722
161;197;17062021180722
162;195;17062021180722
163;202;17062021180722
164;206;17062021180722
165;202;17062021180722
166;192;17062021180722
167;201;17062021180722
168;204;17062021180722
169;183;17062021180722
170;196;17062021180722
171;186;17062021180722
172;187;17062021180722
173;204;17062021180722
174;186;17062021180722
175;189;17062021180722
176;194;17062021180722
177;186;17062021180722
178;202;17062021180722
179;193;17062021180722
180;189;17062021180722
181;184;17062021180722
182;203;17062021180722
183;186;17062021180722
184;188;17062021180722
185;177;17062021180722
186;194;17062021180722
187;187;17062021180722
188;193;17062021180722
189;195;17062021180722
190;181;17062021180722
191;198;17062021180722
192;192;17062021180722
193;181;17062021180722
194;204;17062021180722
195;190;17062021180722
196;186;17062021180722
197;179;17062021180722
198;191;17062021180722
199;181;17062021180722
200;0;17062021180722
0;0;17062021180724
1;158;17062021180724
2;210;17062021180724
3;191;17062021180724
4;204;17062021180724
5;196;17062021180724
6;202;17062021180724
7;213;17062021180724
8;211;17062021180724
9;198;17062021180724
10;209;17062021180724
11;217;17062021180724
12;208;17062021180724
13;219;17062021180724
14;217;17062021180724
15;231;17062021180724
16;236;17062021180724
17;250;17062021180724
18;300;17062021180724
19;394;17062021180724
20;584;17062021180724
21;1005;17062021180724
22;1023;17062021180724
23;1023;17062021180724
24;1023;17062021180724
25;1023;17062021180724
26;1023;17062021180724
27;1023;17062021180724
28;1023;17062021180724
29;1023;17062021180724
30;1023;17062021180724
31;1023;17062021180724
32;1023;17062021180724
33;1023;17062021180724
34;1023;17062021180724
35;1023;17062021180724
36;1023;17062021180724
37;1020;17062021180724
38;964;17062021180724
39;960;17062021180724
40;950;17062021180724
41;961;17062021180724
42;987;17062021180724
43;1006;17062021180724
44;1023;17062021180724
45;1023;17062021180724
46;1023;17062021180724
47;1023;17062021180724
48;1023;17062021180724
49;1023;17062021180724
50;1023;17062021180724
51;1023;17062021180724
52;1023;17062021180724
53;1023;17062021180724
54;1023;17062021180724
55;1023;17062021180724
56;1023;17062021180724
57;1023;17062021180724
58;1023;17062021180724
59;1023;17062021180724
60;1023;17062021180724
61;1023;17062021180724
62;1023;17062021180724
63;1023;17062021180724
64;1023;17062021180724
65;1023;17062021180724
66;1023;17062021180724
67;1023;17062021180724
68;1023;17062021180724
69;1023;17062021180724
70;1023;17062021180724
71;1023;17062021180724
72;1023;17062021180724
73;1023;17062021180724
74;1023;17062021180724
75;1023;17062021180724
76;1009;17062021180724
77;969;17062021180724
78;946;17062021180724
79;929;17062021180724
80;870;17062021180724
81;827;17062021180724
82;812;17062021180724
83;783;17062021180724
84;763;17062021180724
85;743;17062021180724
86;746;17062021180724
87;736;17062021180724
88;710;17062021180724
89;681;17062021180724
90;687;17062021180724
91;650;17062021180724
92;631;17062021180724
93;631;17062021180724
94;597;17062021180724
95;571;17062021180724
96;548;17062021180724
97;536;17062021180724
98;511;17062021180724
99;503;17062021180724
100;483;17062021180724
101;495;17062021180724
102;481;17062021180724
103;449;17062021180724
104;442;17062021180724
105;425;17062021180724
106;417;17062021180724
107;403;17062021180724
108;403;17062021180724
109;387;17062021180724
110;371;17062021180724
111;356;17062021180724
112;350;17062021180724
113;348;17062021180724
114;335;17062021180724
115;336;17062021180724
116;342;17062021180724
117;328;17062021180724
118;316;17062021180724
119;323;17062021180724
120;305;17062021180724
121;298;17062021180724
122;297;17062021180724
123;285;17062021180724
124;296;17062021180724
125;276;17062021180724
126;271;17062021180724
127;281;17062021180724
128;283;17062021180724
129;271;17062021180724
130;262;17062021180724
131;254;17062021180724
132;247;17062021180724
133;274;17062021180724
134;242;17062021180724
135;244;17062021180724
136;241;17062021180724
137;234;17062021180724
138;245;17062021180724
139;229;17062021180724
140;233;17062021180724
141;235;17062021180724
142;227;17062021180724
143;212;17062021180724
144;227;17062021180724
145;221;17062021180724
146;215;17062021180724
147;230;17062021180724
148;212;17062021180724
149;220;17062021180724
150;226;17062021180724
151;217;17062021180724
152;204;17062021180724
153;205;17062021180724
154;208;17062021180724
155;220;17062021180724
156;209;17062021180724
157;196;17062021180724
158;196;17062021180724
159;194;17062021180724
160;192;17062021180724
161;195;17062021180724
162;192;17062021180724
163;200;17062021180724
164;203;17062021180724
165;200;17062021180724
166;188;17062021180724
167;199;17062021180724
168;203;17062021180724
169;183;17062021180724
170;194;17062021180724
171;186;17062021180724
172;185;17062021180724
173;202;17062021180724
174;183;17062021180724
175;187;17062021180724
176;191;17062021180724
177;185;17062021180724
178;199;17062021180724
179;190;17062021180724
180;187;17062021180724
181;183;17062021180724
182;201;17062021180724
183;185;17062021180724
184;186;17062021180724
185;178;17062021180724
186;190;17062021180724
187;185;17062021180724
188;191;17062021180724
189;192;17062021180724
190;182;17062021180724
191;196;17062021180724
192;191;17062021180724
193;180;17062021180724
194;201;17062021180724
195;188;17062021180724
196;185;17062021180724
197;178;17062021180724
198;189;17062021180724
199;181;17062021180724
200;0;17062021180724
0;0;17062021180726
1;158;17062021180726
2;208;17062021180726
3;193;17062021180726
4;202;17062021180726
5;193;17062021180726
6;204;17062021180726
7;210;17062021180726
8;213;17062021180726
9;195;17062021180726
10;211;17062021180726
11;216;17062021180726
12;207;17062021180726
13;218;17062021180726
14;217;17062021180726
15;229;17062021180726
16;238;17062021180726
17;250;17062021180726
18;300;17062021180726
19;396;17062021180726
20;578;17062021180726
21;999;17062021180726
22;1023;17062021180726
23;1023;17062021180726
24;1023;17062021180726
25;1023;17062021180726
26;1023;17062021180726
27;1023;17062021180726
28;1023;17062021180726
29;1023;17062021180726
30;1023;17062021180726
31;1023;17062021180726
32;1023;17062021180726
33;1023;17062021180726
34;1023;17062021180726
35;1023;17062021180726
36;1023;17062021180726
37;1013;17062021180726
38;967;17062021180726
39;955;17062021180726
40;953;17062021180726
41;959;17062021180726
42;980;17062021180726
43;998;17062021180726
44;1023;17062021180726
45;1023;17062021180726
46;1023;17062021180726
47;1023;17062021180726
48;1023;17062021180726
49;1023;17062021180726
50;1023;17062021180726
51;1023;17062021180726
52;1023;17062021180726
53;1023;17062021180726
54;1023;17062021180726
55;1023;17062021180726
56;1023;17062021180726
57;1023;17062021180726
58;1023;17062021180726
59;1023;17062021180726
60;1023;17062021180726
61;1023;17062021180726
62;1023;17062021180726
63;1023;17062021180726
64;1023;17062021180726
65;1023;17062021180726
66;1023;17062021180726
67;1023;17062021180726
68;1023;17062021180726
69;1023;17062021180726
70;1023;17062021180726
71;1023;17062021180726
72;1023;17062021180726
73;1023;17062021180726
74;1023;17062021180726
75;1023;17062021180726
76;1009;17062021180726
77;977;17062021180726
78;941;17062021180726
79;924;17062021180726
80;869;17062021180726
81;820;17062021180726
82;806;17062021180726
83;780;17062021180726
84;759;17062021180726
85;744;17062021180726
86;745;17062021180726
87;732;17062021180726
88;702;17062021180726
89;682;17062021180726
90;682;17062021180726
91;645;17062021180726
92;632;17062021180726
93;625;17062021180726
94;597;17062021180726
95;569;17062021180726
96;550;17062021180726
97;529;17062021180726
98;506;17062021180726
99;503;17062021180726
100;478;17062021180726
101;497;17062021180726
102;482;17062021180726
103;446;17062021180726
104;441;17062021180726
105;423;17062021180726
106;413;17062021180726
107;401;17062021180726
108;402;17062021180726
109;385;17062021180726
110;372;17062021180726
111;360;17062021180726
112;354;17062021180726
113;345;17062021180726
114;332;17062021180726
115;336;17062021180726
116;339;17062021180726
117;325;17062021180726
118;314;17062021180726
119;326;17062021180726
120;307;17062021180726
121;296;17062021180726
122;298;17062021180726
123;287;17062021180726
124;294;17062021180726
125;277;17062021180726
126;271;17062021180726
127;283;17062021180726
128;282;17062021180726
129;267;17062021180726
130;259;17062021180726
131;255;17062021180726
132;247;17062021180726
133;274;17062021180726
134;241;17062021180726
135;246;17062021180726
136;238;17062021180726
137;233;17062021180726
138;247;17062021180726
139;227;17062021180726
140;235;17062021180726
141;237;17062021180726
142;225;17062021180726
143;214;17062021180726
144;225;17062021180726
145;219;17062021180726
146;217;17062021180726
147;231;17062021180726
148;211;17062021180726
149;219;17062021180726
150;221;17062021180726
151;218;17062021180726
152;204;17062021180726
153;206;17062021180726
154;208;17062021180726
155;223;17062021180726
156;210;17062021180726
157;201;17062021180726
158;199;17062021180726
159;195;17062021180726
160;191;17062021180726
161;197;17062021180726
162;194;17062021180726
163;201;17062021180726
164;204;17062021180726
165;201;17062021180726
166;189;17062021180726
167;199;17062021180726
168;205;17062021180726
169;182;17062021180726
170;195;17062021180726
171;186;17062021180726
172;185;17062021180726
173;201;17062021180726
174;184;17062021180726
175;188;17062021180726
176;191;17062021180726
177;184;17062021180726
178;200;17062021180726
179;194;17062021180726
180;186;17062021180726
181;185;17062021180726
182;203;17062021180726
183;182;17062021180726
184;186;17062021180726
185;177;17062021180726
186;192;17062021180726
187;185;17062021180726
188;190;17062021180726
189;192;17062021180726
190;180;17062021180726
191;198;17062021180726
192;192;17062021180726
193;181;17062021180726
194;202;17062021180726
195;188;17062021180726
196;185;17062021180726
197;181;17062021180726
198;188;17062021180726
199;183;17062021180726
200;0;17062021180726
0;0;17062021180727
1;159;17062021180727
2;212;17062021180727
3;195;17062021180727
4;205;17062021180727
5;194;17062021180727
6;203;17062021180727
7;215;17062021180727
8;215;17062021180727
9;197;17062021180727
10;211;17062021180727
11;215;17062021180727
12;208;17062021180727
13;219;17062021180727
14;216;17062021180727
15;229;17062021180727
16;236;17062021180727
17;250;17062021180727
18;297;17062021180727
19;397;17062021180727
20;579;17062021180727
21;998;17062021180727
22;1023;17062021180727
23;1023;17062021180727
24;1023;17062021180727
25;1023;17062021180727
26;1023;17062021180727
27;1023;17062021180727
28;1023;17062021180727
29;1023;17062021180727
30;1023;17062021180727
31;1023;17062021180727
32;1023;17062021180727
33;1023;17062021180727
34;1023;17062021180727
35;1023;17062021180727
36;1023;17062021180727
37;1023;17062021180727
38;975;17062021180727
39;969;17062021180727
40;959;17062021180727
41;969;17062021180727
42;994;17062021180727
43;1008;17062021180727
44;1023;17062021180727
45;1023;17062021180727
46;1023;17062021180727
47;1023;17062021180727
48;1023;17062021180727
49;1023;17062021180727
50;1023;17062021180727
51;1023;17062021180727
52;1023;17062021180727
53;1023;17062021180727
54;1023;17062021180727
55;1023;17062021180727
56;1023;17062021180727
57;1023;17062021180727
58;1023;17062021180727
59;1023;17062021180727
60;1023;17062021180727
61;1023;17062021180727
62;1023;17062021180727
63;1023;17062021180727
64;1023;17062021180727
65;1023;17062021180727
66;1023;17062021180727
67;1023;17062021180727
68;1023;17062021180727
69;1023;17062021180727
70;1023;17062021180727
71;1023;17062021180727
72;1023;17062021180727
73;1023;17062021180727
74;1023;17062021180727
75;1023;17062021180727
76;1013;17062021180727
77;986;17062021180727
78;956;17062021180727
79;930;17062021180727
80;884;17062021180727
81;837;17062021180727
82;815;17062021180727
83;789;17062021180727
84;768;17062021180727
85;750;17062021180727
86;759;17062021180727
87;743;17062021180727
88;714;17062021180727
89;686;17062021180727
90;690;17062021180727
91;659;17062021180727
92;639;17062021180727
93;632;17062021180727
94;598;17062021180727
95;573;17062021180727
96;557;17062021180727
97;532;17062021180727
98;517;17062021180727
99;506;17062021180727
100;485;17062021180727
101;502;17062021180727
102;486;17062021180727
103;454;17062021180727
104;446;17062021180727
105;430;17062021180727
106;417;17062021180727
107;408;17062021180727
108;408;17062021180727
109;389;17062021180727
110;375;17062021180727
111;359;17062021180727
112;355;17062021180727
113;347;17062021180727
114;339;17062021180727
115;340;17062021180727
116;344;17062021180727
117;335;17062021180727
118;323;17062021180727
119;325;17062021180727
120;310;17062021180727
121;301;17062021180727
122;299;17062021180727
123;286;17062021180727
124;295;17062021180727
125;276;17062021180727
126;273;17062021180727
127;283;17062021180727
128;284;17062021180727
129;274;17062021180727
130;264;17062021180727
131;259;17062021180727
132;249;17062021180727
133;278;17062021180727
134;246;17062021180727
135;247;17062021180727
136;242;17062021180727
137;236;17062021180727
138;247;17062021180727
139;231;17062021180727
140;238;17062021180727
141;236;17062021180727
142;230;17062021180727
143;216;17062021180727
144;229;17062021180727
145;223;17062021180727
146;218;17062021180727
147;231;17062021180727
148;214;17062021180727
149;220;17062021180727
150;224;17062021180727
151;221;17062021180727
152;205;17062021180727
153;208;17062021180727
154;207;17062021180727
155;225;17062021180727
156;211;17062021180727
157;199;17062021180727
158;201;17062021180727
159;196;17062021180727
160;192;17062021180727
161;198;17062021180727
162;196;17062021180727
163;204;17062021180727
164;203;17062021180727
165;201;17062021180727
166;189;17062021180727
167;201;17062021180727
168;205;17062021180727
169;183;17062021180727
170;197;17062021180727
171;185;17062021180727
172;186;17062021180727
173;203;17062021180727
174;185;17062021180727
175;191;17062021180727
176;193;17062021180727
177;187;17062021180727
178;201;17062021180727
179;193;17062021180727
180;188;17062021180727
181;184;17062021180727
182;201;17062021180727
183;186;17062021180727
184;188;17062021180727
185;179;17062021180727
186;194;17062021180727
187;187;17062021180727
188;191;17062021180727
189;194;17062021180727
190;182;17062021180727
191;198;17062021180727
192;195;17062021180727
193;183;17062021180727
194;204;17062021180727
195;189;17062021180727
196;187;17062021180727
197;182;17062021180727
198;189;17062021180727
199;184;17062021180727
200;0;17062021180727
0;0;17062021180728
1;157;17062021180728
2;209;17062021180728
3;191;17062021180728
4;201;17062021180728
5;192;17062021180728
6;202;17062021180728
7;211;17062021180728
8;211;17062021180728
9;196;17062021180728
10;208;17062021180728
11;211;17062021180728
12;204;17062021180728
13;217;17062021180728
14;216;17062021180728
15;229;17062021180728
16;233;17062021180728
17;246;17062021180728
18;295;17062021180728
19;393;17062021180728
20;576;17062021180728
21;983;17062021180728
22;1023;17062021180728
23;1023;17062021180728
24;1023;17062021180728
25;1023;17062021180728
26;1023;17062021180728
27;1023;17062021180728
28;1023;17062021180728
29;1023;17062021180728
30;1023;17062021180728
31;1023;17062021180728
32;1023;17062021180728
33;1023;17062021180728
34;1023;17062021180728
35;1023;17062021180728
36;1023;17062021180728
37;1021;17062021180728
38;965;17062021180728
39;954;17062021180728
40;939;17062021180728
41;948;17062021180728
42;974;17062021180728
43;993;17062021180728
44;1022;17062021180728
45;1023;17062021180728
46;1023;17062021180728
47;1023;17062021180728
48;1023;17062021180728
49;1023;17062021180728
50;1023;17062021180728
51;1023;17062021180728
52;1023;17062021180728
53;1023;17062021180728
54;1023;17062021180728
55;1023;17062021180728
56;1023;17062021180728
57;1023;17062021180728
58;1023;17062021180728
59;1023;17062021180728
60;1023;17062021180728
61;1023;17062021180728
62;1023;17062021180728
63;1023;17062021180728
64;1023;17062021180728
65;1023;17062021180728
66;1023;17062021180728
67;1023;17062021180728
68;1023;17062021180728
69;1023;17062021180728
70;1023;17062021180728
71;1023;17062021180728
72;1023;17062021180728
73;1023;17062021180728
74;1023;17062021180728
75;1023;17062021180728
76;999;17062021180728
77;964;17062021180728
78;936;17062021180728
79;916;17062021180728
80;867;17062021180728
81;820;17062021180728
82;798;17062021180728
83;779;17062021180728
84;753;17062021180728
85;736;17062021180728
86;742;17062021180728
87;730;17062021180728
88;696;17062021180728
89;675;17062021180728
90;680;17062021180728
91;644;17062021180728
92;627;17062021180728
93;623;17062021180728
94;592;17062021180728
95;564;17062021180728
96;549;17062021180728
97;527;17062021180728
98;504;17062021180728
99;497;17062021180728
100;473;17062021180728
101;491;17062021180728
102;479;17062021180728
103;443;17062021180728
104;437;17062021180728
105;422;17062021180728
106;411;17062021180728
107;397;17062021180728
108;399;17062021180728
109;384;17062021180728
110;370;17062021180728
111;354;17062021180728
112;346;17062021180728
113;340;17062021180728
114;329;17062021180728
115;335;17062021180728
116;339;17062021180728
117;323;17062021180728
118;315;17062021180728
119;322;17062021180728
120;306;17062021180728
121;295;17062021180728
122;298;17062021180728
123;285;17062021180728
124;295;17062021180728
125;274;17062021180728
126;269;17062021180728
127;280;17062021180728
128;280;17062021180728
129;266;17062021180728
130;258;17062021180728
131;250;17062021180728
132;244;17062021180728
133;274;17062021180728
134;241;17062021180728
135;242;17062021180728
136;235;17062021180728
137;233;17062021180728
138;243;17062021180728
139;224;17062021180728
140;232;17062021180728
141;232;17062021180728
142;224;17062021180728
143;213;17062021180728
144;224;17062021180728
145;219;17062021180728
146;214;17062021180728
147;228;17062021180728
148;209;17062021180728
149;218;17062021180728
150;221;17062021180728
151;216;17062021180728
152;200;17062021180728
153;203;17062021180728
154;205;17062021180728
155;220;17062021180728
156;208;17062021180728
157;195;17062021180728
158;195;17062021180728
159;193;17062021180728
160;191;17062021180728
161;193;17062021180728
162;192;17062021180728
163;197;17062021180728
164;202;17062021180728
165;198;17062021180728
166;187;17062021180728
167;199;17062021180728
168;201;17062021180728
169;182;17062021180728
170;194;17062021180728
171;186;17062021180728
172;183;17062021180728
173;200;17062021180728
174;182;17062021180728
175;188;17062021180728
176;192;17062021180728
177;183;17062021180728
178;198;17062021180728
179;190;17062021180728
180;185;17062021180728
181;182;17062021180728
182;201;17062021180728
183;183;17062021180728
184;185;17062021180728
185;177;17062021180728
186;190;17062021180728
187;183;17062021180728
188;188;17062021180728
189;193;17062021180728
190;180;17062021180728
191;195;17062021180728
192;190;17062021180728
193;178;17062021180728
194;201;17062021180728
195;188;17062021180728
196;183;17062021180728
197;179;17062021180728
198;188;17062021180728
199;178;17062021180728
200;0;17062021180728
0;0;17062021180730
1;158;17062021180730
2;207;17062021180730
3;191;17062021180730
4;203;17062021180730
5;192;17062021180730
6;202;17062021180730
7;210;17062021180730
8;212;17062021180730
9;198;17062021180730
10;206;17062021180730
11;213;17062021180730
12;206;17062021180730
13;217;17062021180730
14;216;17062021180730
15;229;17062021180730
16;234;17062021180730
17;252;17062021180730
18;298;17062021180730
19;398;17062021180730
20;575;17062021180730
21;995;17062021180730
22;1023;17062021180730
23;1023;17062021180730
24;1023;17062021180730
25;1023;17062021180730
26;1023;17062021180730
27;1023;17062021180730
28;1023;17062021180730
29;1023;17062021180730
30;1023;17062021180730
31;1023;17062021180730
32;1023;17062021180730
33;1023;17062021180730
34;1023;17062021180730
35;1023;17062021180730
36;1023;17062021180730
37;1023;17062021180730
38;972;17062021180730
39;958;17062021180730
40;942;17062021180730
41;954;17062021180730
42;981;17062021180730
43;996;17062021180730
44;1023;17062021180730
45;1023;17062021180730
46;1023;17062021180730
47;1023;17062021180730
48;1023;17062021180730
49;1023;17062021180730
50;1023;17062021180730
51;1023;17062021180730
52;1023;17062021180730
53;1023;17062021180730
54;1023;17062021180730
55;1023;17062021180730
56;1023;17062021180730
57;1023;17062021180730
58;1023;17062021180730
59;1023;17062021180730
60;1023;17062021180730
61;1023;17062021180730
62;1023;17062021180730
63;1023;17062021180730
64;1023;17062021180730
65;1023;17062021180730
66;1023;17062021180730
67;1023;17062021180730
68;1023;17062021180730
69;1023;17062021180730
70;1023;17062021180730
71;1023;17062021180730
72;1023;17062021180730
73;1023;17062021180730
74;1023;17062021180730
75;1023;17062021180730
76;1012;17062021180730
77;975;17062021180730
78;946;17062021180730
79;930;17062021180730
80;869;17062021180730
81;824;17062021180730
82;804;17062021180730
83;779;17062021180730
84;764;17062021180730
85;740;17062021180730
86;747;17062021180730
87;735;17062021180730
88;706;17062021180730
89;680;17062021180730
90;679;17062021180730
91;650;17062021180730
92;627;17062021180730
93;623;17062021180730
94;595;17062021180730
95;563;17062021180730
96;547;17062021180730
97;529;17062021180730
98;507;17062021180730
99;501;17062021180730
100;478;17062021180730
101;490;17062021180730
102;483;17062021180730
103;445;17062021180730
104;437;17062021180730
105;421;17062021180730
106;409;17062021180730
107;401;17062021180730
108;399;17062021180730
109;386;17062021180730
110;373;17062021180730
111;361;17062021180730
112;350;17062021180730
113;344;17062021180730
114;335;17062021180730
115;337;17062021180730
116;340;17062021180730
117;326;17062021180730
118;315;17062021180730
119;326;17062021180730
120;306;17062021180730
121;297;17062021180730
122;296;17062021180730
123;284;17062021180730
124;294;17062021180730
125;275;17062021180730
126;272;17062021180730
127;277;17062021180730
128;281;17062021180730
129;269;17062021180730
130;260;17062021180730
131;254;17062021180730
132;246;17062021180730
133;273;17062021180730
134;242;17062021180730
135;242;17062021180730
136;235;17062021180730
137;234;17062021180730
138;242;17062021180730
139;226;17062021180730
140;234;17062021180730
141;235;17062021180730
142;224;17062021180730
143;214;17062021180730
144;224;17062021180730
145;218;17062021180730
146;213;17062021180730
147;229;17062021180730
148;210;17062021180730
149;218;17062021180730
150;221;17062021180730
151;219;17062021180730
152;201;17062021180730
153;204;17062021180730
154;206;17062021180730
155;221;17062021180730
156;206;17062021180730
157;197;17062021180730
158;197;17062021180730
159;193;17062021180730
160;189;17062021180730
161;195;17062021180730
162;192;17062021180730
163;198;17062021180730
164;203;17062021180730
165;201;17062021180730
166;187;17062021180730
167;197;17062021180730
168;202;17062021180730
169;181;17062021180730
170;193;17062021180730
171;186;17062021180730
172;184;17062021180730
173;202;17062021180730
174;183;17062021180730
175;187;17062021180730
176;190;17062021180730
177;182;17062021180730
178;200;17062021180730
179;193;17062021180730
180;185;17062021180730
181;181;17062021180730
182;199;17062021180730
183;181;17062021180730
184;186;17062021180730
185;175;17062021180730
186;192;17062021180730
187;185;17062021180730
188;190;17062021180730
189;190;17062021180730
190;180;17062021180730
191;197;17062021180730
192;192;17062021180730
193;179;17062021180730
194;202;17062021180730
195;187;17062021180730
196;184;17062021180730
197;178;17062021180730
198;189;17062021180730
199;181;17062021180730
200;0;17062021180730
0;0;17062021180731
1;159;17062021180731
2;209;17062021180731
3;191;17062021180731
4;201;17062021180731
5;193;17062021180731
6;201;17062021180731
7;215;17062021180731
8;212;17062021180731
9;197;17062021180731
10;210;17062021180731
11;213;17062021180731
12;206;17062021180731
13;218;17062021180731
14;216;17062021180731
15;228;17062021180731
16;236;17062021180731
17;251;17062021180731
18;301;17062021180731
19;400;17062021180731
20;583;17062021180731
21;1001;17062021180731
22;1023;17062021180731
23;1023;17062021180731
24;1023;17062021180731
25;1023;17062021180731
26;1023;17062021180731
27;1023;17062021180731
28;1023;17062021180731
29;1023;17062021180731
30;1023;17062021180731
31;1023;17062021180731
32;1023;17062021180731
33;1023;17062021180731
34;1023;17062021180731
35;1023;17062021180731
36;1023;17062021180731
37;1023;17062021180731
38;977;17062021180731
39;960;17062021180731
40;948;17062021180731
41;960;17062021180731
42;981;17062021180731
43;999;17062021180731
44;1023;17062021180731
45;1023;17062021180731
46;1023;17062021180731
47;1023;17062021180731
48;1023;17062021180731
49;1023;17062021180731
50;1023;17062021180731
51;1023;17062021180731
52;1023;17062021180731
53;1023;17062021180731
54;1023;17062021180731
55;1023;17062021180731
56;1023;17062021180731
57;1023;17062021180731
58;1023;17062021180731
59;1023;17062021180731
60;1023;17062021180731
61;1023;17062021180731
62;1023;17062021180731
63;1023;17062021180731
64;1023;17062021180731
65;1023;17062021180731
66;1023;17062021180731
67;1023;17062021180731
68;1023;17062021180731
69;1023;17062021180731
70;1023;17062021180731
71;1023;17062021180731
72;1023;17062021180731
73;1023;17062021180731
74;1023;17062021180731
75;1023;17062021180731
76;1004;17062021180731
77;975;17062021180731
78;946;17062021180731
79;923;17062021180731
80;871;17062021180731
81;823;17062021180731
82;806;17062021180731
83;782;17062021180731
84;759;17062021180731
85;742;17062021180731
86;743;17062021180731
87;741;17062021180731
88;706;17062021180731
89;678;17062021180731
90;680;17062021180731
91;653;17062021180731
92;626;17062021180731
93;628;17062021180731
94;597;17062021180731
95;565;17062021180731
96;547;17062021180731
97;527;17062021180731
98;508;17062021180731
99;500;17062021180731
100;480;17062021180731
101;498;17062021180731
102;482;17062021180731
103;448;17062021180731
104;440;17062021180731
105;424;17062021180731
106;412;17062021180731
107;403;17062021180731
108;405;17062021180731
109;385;17062021180731
110;371;17062021180731
111;360;17062021180731
112;351;17062021180731
113;344;17062021180731
114;336;17062021180731
115;335;17062021180731
116;340;17062021180731
117;324;17062021180731
118;317;17062021180731
119;321;17062021180731
120;307;17062021180731
121;297;17062021180731
122;296;17062021180731
123;285;17062021180731
124;295;17062021180731
125;276;17062021180731
126;269;17062021180731
127;283;17062021180731
128;283;17062021180731
129;269;17062021180731
130;260;17062021180731
131;253;17062021180731
132;245;17062021180731
133;272;17062021180731
134;244;17062021180731
135;244;17062021180731
136;240;17062021180731
137;233;17062021180731
138;243;17062021180731
139;229;17062021180731
140;236;17062021180731
141;233;17062021180731
142;227;17062021180731
143;211;17062021180731
144;227;17062021180731
145;219;17062021180731
146;214;17062021180731
147;230;17062021180731
148;210;17062021180731
149;219;17062021180731
150;223;17062021180731
151;217;17062021180731
152;204;17062021180731
153;205;17062021180731
154;206;17062021180731
155;221;17062021180731
156;209;17062021180731
157;196;17062021180731
158;199;17062021180731
159;195;17062021180731
160;191;17062021180731
161;196;17062021180731
162;194;17062021180731
163;201;17062021180731
164;202;17062021180731
165;200;17062021180731
166;188;17062021180731
167;198;17062021180731
168;201;17062021180731
169;181;17062021180731
170;195;17062021180731
171;186;17062021180731
172;185;17062021180731
173;200;17062021180731
174;184;17062021180731
175;187;17062021180731
176;190;17062021180731
177;183;17062021180731
178;200;17062021180731
179;194;17062021180731
180;187;17062021180731
181;182;17062021180731
182;200;17062021180731
183;184;17062021180731
184;186;17062021180731
185;176;17062021180731
186;192;17062021180731
187;185;17062021180731
188;188;17062021180731
189;193;17062021180731
190;179;17062021180731
191;197;17062021180731
192;192;17062021180731
193;180;17062021180731
194;202;17062021180731
195;187;17062021180731
196;186;17062021180731
197;181;17062021180731
198;188;17062021180731
199;180;17062021180731
200;0;17062021180731
