ind;val;datetime
0;0;02082021173214
1;153;02082021173214
2;151;02082021173214
3;148;02082021173214
4;150;02082021173214
5;154;02082021173214
6;151;02082021173214
7;154;02082021173214
8;158;02082021173214
9;159;02082021173214
10;165;02082021173214
11;166;02082021173214
12;168;02082021173214
13;180;02082021173214
14;188;02082021173214
15;200;02082021173214
16;221;02082021173214
17;249;02082021173214
18;313;02082021173214
19;446;02082021173214
20;736;02082021173214
21;1023;02082021173214
22;1023;02082021173214
23;1023;02082021173214
24;1023;02082021173214
25;1023;02082021173214
26;781;02082021173214
27;638;02082021173214
28;935;02082021173214
29;1023;02082021173214
30;1023;02082021173214
31;1023;02082021173214
32;1023;02082021173214
33;1023;02082021173214
34;1023;02082021173214
35;1023;02082021173214
36;1023;02082021173214
37;1023;02082021173214
38;1023;02082021173214
39;1012;02082021173214
40;796;02082021173214
41;621;02082021173214
42;504;02082021173214
43;406;02082021173214
44;343;02082021173214
45;295;02082021173214
46;261;02082021173214
47;236;02082021173214
48;221;02082021173214
49;204;02082021173214
50;198;02082021173214
51;187;02082021173214
52;178;02082021173214
53;174;02082021173214
54;170;02082021173214
55;166;02082021173214
56;166;02082021173214
57;161;02082021173214
58;162;02082021173214
59;160;02082021173214
60;159;02082021173214
61;159;02082021173214
62;156;02082021173214
63;157;02082021173214
64;158;02082021173214
65;153;02082021173214
66;155;02082021173214
67;151;02082021173214
68;149;02082021173214
69;152;02082021173214
70;147;02082021173214
71;149;02082021173214
72;150;02082021173214
73;145;02082021173214
74;150;02082021173214
75;147;02082021173214
76;145;02082021173214
77;148;02082021173214
78;143;02082021173214
79;145;02082021173214
80;144;02082021173214
81;142;02082021173214
82;144;02082021173214
83;142;02082021173214
84;140;02082021173214
85;142;02082021173214
86;138;02082021173214
87;139;02082021173214
88;140;02082021173214
89;137;02082021173214
90;140;02082021173214
91;139;02082021173214
92;137;02082021173214
93;141;02082021173214
94;138;02082021173214
95;136;02082021173214
96;140;02082021173214
97;138;02082021173214
98;140;02082021173214
99;138;02082021173214
100;138;02082021173214
101;140;02082021173214
102;137;02082021173214
103;136;02082021173214
104;137;02082021173214
105;135;02082021173214
106;139;02082021173214
107;135;02082021173214
108;135;02082021173214
109;138;02082021173214
110;133;02082021173214
111;136;02082021173214
112;138;02082021173214
113;134;02082021173214
114;135;02082021173214
115;136;02082021173214
116;135;02082021173214
117;138;02082021173214
118;134;02082021173214
119;136;02082021173214
120;134;02082021173214
121;133;02082021173214
122;133;02082021173214
123;133;02082021173214
124;133;02082021173214
125;134;02082021173214
126;132;02082021173214
127;133;02082021173214
128;135;02082021173214
129;132;02082021173214
130;133;02082021173214
131;132;02082021173214
132;132;02082021173214
133;136;02082021173214
134;130;02082021173214
135;130;02082021173214
136;132;02082021173214
137;130;02082021173214
138;131;02082021173214
139;130;02082021173214
140;129;02082021173214
141;133;02082021173214
142;130;02082021173214
143;130;02082021173214
144;131;02082021173214
145;128;02082021173214
146;133;02082021173214
147;130;02082021173214
148;130;02082021173214
149;130;02082021173214
150;129;02082021173214
151;130;02082021173214
152;130;02082021173214
153;128;02082021173214
154;130;02082021173214
155;128;02082021173214
156;128;02082021173214
157;129;02082021173214
158;128;02082021173214
159;130;02082021173214
160;130;02082021173214
161;129;02082021173214
162;131;02082021173214
163;130;02082021173214
164;130;02082021173214
165;132;02082021173214
166;131;02082021173214
167;130;02082021173214
168;131;02082021173214
169;127;02082021173214
170;130;02082021173214
171;129;02082021173214
172;129;02082021173214
173;130;02082021173214
174;128;02082021173214
175;128;02082021173214
176;130;02082021173214
177;127;02082021173214
178;130;02082021173214
179;129;02082021173214
180;127;02082021173214
181;130;02082021173214
182;128;02082021173214
183;127;02082021173214
184;129;02082021173214
185;126;02082021173214
186;130;02082021173214
187;128;02082021173214
188;127;02082021173214
189;130;02082021173214
190;128;02082021173214
191;128;02082021173214
192;132;02082021173214
193;129;02082021173214
194;130;02082021173214
195;130;02082021173214
196;127;02082021173214
197;128;02082021173214
198;130;02082021173214
199;128;02082021173214
200;0;02082021173214
0;0;02082021173215
1;152;02082021173215
2;149;02082021173215
3;149;02082021173215
4;149;02082021173215
5;151;02082021173215
6;151;02082021173215
7;154;02082021173215
8;158;02082021173215
9;158;02082021173215
10;165;02082021173215
11;164;02082021173215
12;171;02082021173215
13;181;02082021173215
14;187;02082021173215
15;201;02082021173215
16;219;02082021173215
17;248;02082021173215
18;317;02082021173215
19;451;02082021173215
20;748;02082021173215
21;1023;02082021173215
22;1023;02082021173215
23;1023;02082021173215
24;1023;02082021173215
25;1023;02082021173215
26;751;02082021173215
27;626;02082021173215
28;901;02082021173215
29;1023;02082021173215
30;1023;02082021173215
31;1023;02082021173215
32;1023;02082021173215
33;1023;02082021173215
34;1023;02082021173215
35;1023;02082021173215
36;1023;02082021173215
37;1023;02082021173215
38;1023;02082021173215
39;1020;02082021173215
40;809;02082021173215
41;631;02082021173215
42;506;02082021173215
43;414;02082021173215
44;346;02082021173215
45;300;02082021173215
46;267;02082021173215
47;240;02082021173215
48;222;02082021173215
49;205;02082021173215
50;195;02082021173215
51;187;02082021173215
52;179;02082021173215
53;176;02082021173215
54;170;02082021173215
55;167;02082021173215
56;165;02082021173215
57;163;02082021173215
58;162;02082021173215
59;160;02082021173215
60;158;02082021173215
61;158;02082021173215
62;155;02082021173215
63;157;02082021173215
64;158;02082021173215
65;152;02082021173215
66;154;02082021173215
67;152;02082021173215
68;150;02082021173215
69;153;02082021173215
70;149;02082021173215
71;149;02082021173215
72;151;02082021173215
73;146;02082021173215
74;149;02082021173215
75;145;02082021173215
76;146;02082021173215
77;146;02082021173215
78;144;02082021173215
79;144;02082021173215
80;145;02082021173215
81;142;02082021173215
82;143;02082021173215
83;141;02082021173215
84;139;02082021173215
85;141;02082021173215
86;138;02082021173215
87;139;02082021173215
88;141;02082021173215
89;136;02082021173215
90;140;02082021173215
91;137;02082021173215
92;136;02082021173215
93;138;02082021173215
94;136;02082021173215
95;136;02082021173215
96;138;02082021173215
97;137;02082021173215
98;136;02082021173215
99;137;02082021173215
100;136;02082021173215
101;138;02082021173215
102;136;02082021173215
103;136;02082021173215
104;136;02082021173215
105;133;02082021173215
106;138;02082021173215
107;135;02082021173215
108;134;02082021173215
109;136;02082021173215
110;133;02082021173215
111;133;02082021173215
112;137;02082021173215
113;132;02082021173215
114;135;02082021173215
115;136;02082021173215
116;133;02082021173215
117;137;02082021173215
118;133;02082021173215
119;133;02082021173215
120;133;02082021173215
121;132;02082021173215
122;133;02082021173215
123;134;02082021173215
124;131;02082021173215
125;133;02082021173215
126;131;02082021173215
127;132;02082021173215
128;133;02082021173215
129;130;02082021173215
130;132;02082021173215
131;131;02082021173215
132;130;02082021173215
133;135;02082021173215
134;129;02082021173215
135;129;02082021173215
136;132;02082021173215
137;129;02082021173215
138;131;02082021173215
139;130;02082021173215
140;129;02082021173215
141;130;02082021173215
142;129;02082021173215
143;129;02082021173215
144;130;02082021173215
145;127;02082021173215
146;130;02082021173215
147;129;02082021173215
148;128;02082021173215
149;129;02082021173215
150;129;02082021173215
151;129;02082021173215
152;129;02082021173215
153;127;02082021173215
154;130;02082021173215
155;129;02082021173215
156;126;02082021173215
157;129;02082021173215
158;127;02082021173215
159;127;02082021173215
160;129;02082021173215
161;127;02082021173215
162;129;02082021173215
163;130;02082021173215
164;129;02082021173215
165;132;02082021173215
166;129;02082021173215
167;130;02082021173215
168;130;02082021173215
169;128;02082021173215
170;130;02082021173215
171;128;02082021173215
172;128;02082021173215
173;128;02082021173215
174;128;02082021173215
175;127;02082021173215
176;129;02082021173215
177;127;02082021173215
178;129;02082021173215
179;128;02082021173215
180;127;02082021173215
181;129;02082021173215
182;129;02082021173215
183;126;02082021173215
184;130;02082021173215
185;126;02082021173215
186;129;02082021173215
187;128;02082021173215
188;126;02082021173215
189;128;02082021173215
190;126;02082021173215
191;127;02082021173215
192;131;02082021173215
193;127;02082021173215
194;127;02082021173215
195;128;02082021173215
196;128;02082021173215
197;129;02082021173215
198;129;02082021173215
199;127;02082021173215
200;0;02082021173215
0;0;02082021173216
1;153;02082021173216
2;149;02082021173216
3;147;02082021173216
4;149;02082021173216
5;151;02082021173216
6;150;02082021173216
7;154;02082021173216
8;156;02082021173216
9;156;02082021173216
10;162;02082021173216
11;164;02082021173216
12;168;02082021173216
13;178;02082021173216
14;185;02082021173216
15;196;02082021173216
16;217;02082021173216
17;243;02082021173216
18;308;02082021173216
19;433;02082021173216
20;719;02082021173216
21;1023;02082021173216
22;1023;02082021173216
23;1023;02082021173216
24;1023;02082021173216
25;1023;02082021173216
26;649;02082021173216
27;417;02082021173216
28;881;02082021173216
29;1023;02082021173216
30;1023;02082021173216
31;1023;02082021173216
32;1023;02082021173216
33;1023;02082021173216
34;1023;02082021173216
35;1023;02082021173216
36;1023;02082021173216
37;1023;02082021173216
38;1023;02082021173216
39;987;02082021173216
40;775;02082021173216
41;605;02082021173216
42;490;02082021173216
43;399;02082021173216
44;340;02082021173216
45;291;02082021173216
46;256;02082021173216
47;232;02082021173216
48;215;02082021173216
49;199;02082021173216
50;194;02082021173216
51;183;02082021173216
52;178;02082021173216
53;173;02082021173216
54;167;02082021173216
55;165;02082021173216
56;162;02082021173216
57;160;02082021173216
58;162;02082021173216
59;159;02082021173216
60;158;02082021173216
61;158;02082021173216
62;155;02082021173216
63;156;02082021173216
64;155;02082021173216
65;151;02082021173216
66;153;02082021173216
67;152;02082021173216
68;149;02082021173216
69;151;02082021173216
70;148;02082021173216
71;148;02082021173216
72;150;02082021173216
73;146;02082021173216
74;146;02082021173216
75;145;02082021173216
76;144;02082021173216
77;146;02082021173216
78;143;02082021173216
79;143;02082021173216
80;144;02082021173216
81;140;02082021173216
82;142;02082021173216
83;140;02082021173216
84;139;02082021173216
85;140;02082021173216
86;137;02082021173216
87;138;02082021173216
88;140;02082021173216
89;136;02082021173216
90;138;02082021173216
91;137;02082021173216
92;134;02082021173216
93;137;02082021173216
94;138;02082021173216
95;135;02082021173216
96;138;02082021173216
97;135;02082021173216
98;136;02082021173216
99;138;02082021173216
100;135;02082021173216
101;138;02082021173216
102;135;02082021173216
103;136;02082021173216
104;136;02082021173216
105;134;02082021173216
106;137;02082021173216
107;135;02082021173216
108;135;02082021173216
109;136;02082021173216
110;133;02082021173216
111;135;02082021173216
112;137;02082021173216
113;132;02082021173216
114;135;02082021173216
115;136;02082021173216
116;133;02082021173216
117;137;02082021173216
118;132;02082021173216
119;133;02082021173216
120;134;02082021173216
121;133;02082021173216
122;134;02082021173216
123;133;02082021173216
124;131;02082021173216
125;134;02082021173216
126;131;02082021173216
127;132;02082021173216
128;134;02082021173216
129;131;02082021173216
130;131;02082021173216
131;133;02082021173216
132;130;02082021173216
133;134;02082021173216
134;129;02082021173216
135;129;02082021173216
136;132;02082021173216
137;129;02082021173216
138;132;02082021173216
139;130;02082021173216
140;129;02082021173216
141;132;02082021173216
142;129;02082021173216
143;130;02082021173216
144;131;02082021173216
145;128;02082021173216
146;131;02082021173216
147;129;02082021173216
148;128;02082021173216
149;128;02082021173216
150;129;02082021173216
151;129;02082021173216
152;129;02082021173216
153;127;02082021173216
154;130;02082021173216
155;127;02082021173216
156;128;02082021173216
157;129;02082021173216
158;127;02082021173216
159;127;02082021173216
160;128;02082021173216
161;128;02082021173216
162;130;02082021173216
163;129;02082021173216
164;129;02082021173216
165;132;02082021173216
166;130;02082021173216
167;130;02082021173216
168;131;02082021173216
169;127;02082021173216
170;129;02082021173216
171;129;02082021173216
172;127;02082021173216
173;130;02082021173216
174;127;02082021173216
175;126;02082021173216
176;129;02082021173216
177;126;02082021173216
178;129;02082021173216
179;128;02082021173216
180;127;02082021173216
181;130;02082021173216
182;127;02082021173216
183;128;02082021173216
184;129;02082021173216
185;125;02082021173216
186;129;02082021173216
187;128;02082021173216
188;127;02082021173216
189;129;02082021173216
190;127;02082021173216
191;127;02082021173216
192;131;02082021173216
193;127;02082021173216
194;127;02082021173216
195;128;02082021173216
196;127;02082021173216
197;129;02082021173216
198;128;02082021173216
199;127;02082021173216
200;0;02082021173216
0;0;02082021173217
1;152;02082021173217
2;148;02082021173217
3;147;02082021173217
4;148;02082021173217
5;150;02082021173217
6;149;02082021173217
7;154;02082021173217
8;156;02082021173217
9;156;02082021173217
10;163;02082021173217
11;165;02082021173217
12;166;02082021173217
13;176;02082021173217
14;184;02082021173217
15;198;02082021173217
16;216;02082021173217
17;245;02082021173217
18;305;02082021173217
19;434;02082021173217
20;723;02082021173217
21;1023;02082021173217
22;1023;02082021173217
23;1023;02082021173217
24;1023;02082021173217
25;1023;02082021173217
26;716;02082021173217
27;560;02082021173217
28;891;02082021173217
29;1023;02082021173217
30;1023;02082021173217
31;1023;02082021173217
32;1023;02082021173217
33;1023;02082021173217
34;1023;02082021173217
35;1023;02082021173217
36;1023;02082021173217
37;1023;02082021173217
38;1023;02082021173217
39;988;02082021173217
40;775;02082021173217
41;610;02082021173217
42;491;02082021173217
43;401;02082021173217
44;336;02082021173217
45;290;02082021173217
46;256;02082021173217
47;232;02082021173217
48;217;02082021173217
49;198;02082021173217
50;194;02082021173217
51;183;02082021173217
52;176;02082021173217
53;176;02082021173217
54;168;02082021173217
55;164;02082021173217
56;164;02082021173217
57;160;02082021173217
58;160;02082021173217
59;158;02082021173217
60;157;02082021173217
61;157;02082021173217
62;154;02082021173217
63;156;02082021173217
64;155;02082021173217
65;151;02082021173217
66;153;02082021173217
67;151;02082021173217
68;150;02082021173217
69;150;02082021173217
70;148;02082021173217
71;147;02082021173217
72;150;02082021173217
73;144;02082021173217
74;147;02082021173217
75;144;02082021173217
76;143;02082021173217
77;146;02082021173217
78;144;02082021173217
79;144;02082021173217
80;143;02082021173217
81;141;02082021173217
82;143;02082021173217
83;139;02082021173217
84;139;02082021173217
85;140;02082021173217
86;138;02082021173217
87;138;02082021173217
88;140;02082021173217
89;135;02082021173217
90;138;02082021173217
91;136;02082021173217
92;134;02082021173217
93;138;02082021173217
94;137;02082021173217
95;135;02082021173217
96;139;02082021173217
97;136;02082021173217
98;136;02082021173217
99;136;02082021173217
100;135;02082021173217
101;139;02082021173217
102;136;02082021173217
103;136;02082021173217
104;136;02082021173217
105;135;02082021173217
106;137;02082021173217
107;134;02082021173217
108;134;02082021173217
109;135;02082021173217
110;134;02082021173217
111;134;02082021173217
112;138;02082021173217
113;134;02082021173217
114;135;02082021173217
115;136;02082021173217
116;132;02082021173217
117;136;02082021173217
118;133;02082021173217
119;135;02082021173217
120;134;02082021173217
121;131;02082021173217
122;134;02082021173217
123;133;02082021173217
124;130;02082021173217
125;134;02082021173217
126;131;02082021173217
127;132;02082021173217
128;134;02082021173217
129;130;02082021173217
130;132;02082021173217
131;132;02082021173217
132;130;02082021173217
133;134;02082021173217
134;131;02082021173217
135;131;02082021173217
136;132;02082021173217
137;130;02082021173217
138;131;02082021173217
139;130;02082021173217
140;129;02082021173217
141;131;02082021173217
142;129;02082021173217
143;129;02082021173217
144;131;02082021173217
145;127;02082021173217
146;132;02082021173217
147;130;02082021173217
148;129;02082021173217
149;129;02082021173217
150;129;02082021173217
151;130;02082021173217
152;130;02082021173217
153;127;02082021173217
154;131;02082021173217
155;128;02082021173217
156;128;02082021173217
157;128;02082021173217
158;128;02082021173217
159;128;02082021173217
160;130;02082021173217
161;128;02082021173217
162;129;02082021173217
163;129;02082021173217
164;128;02082021173217
165;130;02082021173217
166;129;02082021173217
167;131;02082021173217
168;130;02082021173217
169;127;02082021173217
170;130;02082021173217
171;129;02082021173217
172;127;02082021173217
173;128;02082021173217
174;127;02082021173217
175;126;02082021173217
176;129;02082021173217
177;127;02082021173217
178;129;02082021173217
179;128;02082021173217
180;127;02082021173217
181;129;02082021173217
182;128;02082021173217
183;127;02082021173217
184;130;02082021173217
185;126;02082021173217
186;130;02082021173217
187;129;02082021173217
188;126;02082021173217
189;128;02082021173217
190;126;02082021173217
191;127;02082021173217
192;129;02082021173217
193;128;02082021173217
194;128;02082021173217
195;128;02082021173217
196;128;02082021173217
197;129;02082021173217
198;128;02082021173217
199;126;02082021173217
200;0;02082021173217
0;0;02082021173217
1;152;02082021173217
2;149;02082021173217
3;148;02082021173217
4;149;02082021173217
5;152;02082021173217
6;150;02082021173217
7;155;02082021173217
8;159;02082021173217
9;160;02082021173217
10;164;02082021173217
11;166;02082021173217
12;171;02082021173217
13;179;02082021173217
14;187;02082021173217
15;201;02082021173217
16;219;02082021173217
17;252;02082021173217
18;315;02082021173217
19;450;02082021173217
20;749;02082021173217
21;1023;02082021173217
22;1023;02082021173217
23;1023;02082021173217
24;1023;02082021173217
25;1023;02082021173217
26;723;02082021173217
27;577;02082021173217
28;890;02082021173217
29;1023;02082021173217
30;1023;02082021173217
31;1023;02082021173217
32;1023;02082021173217
33;1023;02082021173217
34;1023;02082021173217
35;1023;02082021173217
36;1023;02082021173217
37;1023;02082021173217
38;1023;02082021173217
39;1018;02082021173217
40;810;02082021173217
41;631;02082021173217
42;508;02082021173217
43;415;02082021173217
44;349;02082021173217
45;299;02082021173217
46;263;02082021173217
47;238;02082021173217
48;222;02082021173217
49;205;02082021173217
50;197;02082021173217
51;187;02082021173217
52;179;02082021173217
53;176;02082021173217
54;169;02082021173217
55;167;02082021173217
56;167;02082021173217
57;160;02082021173217
58;164;02082021173217
59;159;02082021173217
60;157;02082021173217
61;159;02082021173217
62;156;02082021173217
63;157;02082021173217
64;157;02082021173217
65;151;02082021173217
66;155;02082021173217
67;153;02082021173217
68;149;02082021173217
69;152;02082021173217
70;147;02082021173217
71;148;02082021173217
72;150;02082021173217
73;146;02082021173217
74;149;02082021173217
75;146;02082021173217
76;145;02082021173217
77;146;02082021173217
78;143;02082021173217
79;144;02082021173217
80;143;02082021173217
81;140;02082021173217
82;143;02082021173217
83;139;02082021173217
84;139;02082021173217
85;140;02082021173217
86;138;02082021173217
87;138;02082021173217
88;141;02082021173217
89;136;02082021173217
90;139;02082021173217
91;137;02082021173217
92;135;02082021173217
93;138;02082021173217
94;136;02082021173217
95;135;02082021173217
96;138;02082021173217
97;136;02082021173217
98;136;02082021173217
99;137;02082021173217
100;136;02082021173217
101;138;02082021173217
102;136;02082021173217
103;136;02082021173217
104;136;02082021173217
105;134;02082021173217
106;137;02082021173217
107;134;02082021173217
108;134;02082021173217
109;136;02082021173217
110;133;02082021173217
111;134;02082021173217
112;137;02082021173217
113;133;02082021173217
114;135;02082021173217
115;134;02082021173217
116;135;02082021173217
117;137;02082021173217
118;133;02082021173217
119;133;02082021173217
120;133;02082021173217
121;132;02082021173217
122;132;02082021173217
123;134;02082021173217
124;133;02082021173217
125;134;02082021173217
126;130;02082021173217
127;131;02082021173217
128;133;02082021173217
129;130;02082021173217
130;131;02082021173217
131;131;02082021173217
132;130;02082021173217
133;134;02082021173217
134;129;02082021173217
135;129;02082021173217
136;132;02082021173217
137;128;02082021173217
138;131;02082021173217
139;130;02082021173217
140;128;02082021173217
141;132;02082021173217
142;129;02082021173217
143;129;02082021173217
144;130;02082021173217
145;128;02082021173217
146;130;02082021173217
147;129;02082021173217
148;128;02082021173217
149;129;02082021173217
150;129;02082021173217
151;129;02082021173217
152;129;02082021173217
153;127;02082021173217
154;130;02082021173217
155;127;02082021173217
156;127;02082021173217
157;128;02082021173217
158;128;02082021173217
159;128;02082021173217
160;128;02082021173217
161;128;02082021173217
162;129;02082021173217
163;129;02082021173217
164;129;02082021173217
165;130;02082021173217
166;128;02082021173217
167;129;02082021173217
168;131;02082021173217
169;127;02082021173217
170;128;02082021173217
171;128;02082021173217
172;127;02082021173217
173;128;02082021173217
174;128;02082021173217
175;127;02082021173217
176;128;02082021173217
177;127;02082021173217
178;129;02082021173217
179;128;02082021173217
180;127;02082021173217
181;129;02082021173217
182;128;02082021173217
183;127;02082021173217
184;129;02082021173217
185;125;02082021173217
186;130;02082021173217
187;128;02082021173217
188;125;02082021173217
189;127;02082021173217
190;126;02082021173217
191;127;02082021173217
192;132;02082021173217
193;128;02082021173217
194;128;02082021173217
195;127;02082021173217
196;127;02082021173217
197;129;02082021173217
198;128;02082021173217
199;127;02082021173217
200;0;02082021173217
0;0;02082021173218
1;154;02082021173218
2;146;02082021173218
3;147;02082021173218
4;148;02082021173218
5;150;02082021173218
6;150;02082021173218
7;153;02082021173218
8;155;02082021173218
9;157;02082021173218
10;164;02082021173218
11;164;02082021173218
12;168;02082021173218
13;178;02082021173218
14;184;02082021173218
15;197;02082021173218
16;215;02082021173218
17;245;02082021173218
18;306;02082021173218
19;435;02082021173218
20;723;02082021173218
21;1023;02082021173218
22;1023;02082021173218
23;1023;02082021173218
24;1023;02082021173218
25;1023;02082021173218
26;710;02082021173218
27;504;02082021173218
28;910;02082021173218
29;1023;02082021173218
30;1023;02082021173218
31;1023;02082021173218
32;1023;02082021173218
33;1023;02082021173218
34;1023;02082021173218
35;1023;02082021173218
36;1023;02082021173218
37;1023;02082021173218
38;1023;02082021173218
39;991;02082021173218
40;778;02082021173218
41;609;02082021173218
42;494;02082021173218
43;400;02082021173218
44;338;02082021173218
45;292;02082021173218
46;254;02082021173218
47;232;02082021173218
48;216;02082021173218
49;201;02082021173218
50;194;02082021173218
51;185;02082021173218
52;177;02082021173218
53;174;02082021173218
54;167;02082021173218
55;165;02082021173218
56;163;02082021173218
57;159;02082021173218
58;161;02082021173218
59;157;02082021173218
60;156;02082021173218
61;157;02082021173218
62;153;02082021173218
63;154;02082021173218
64;156;02082021173218
65;151;02082021173218
66;152;02082021173218
67;151;02082021173218
68;149;02082021173218
69;150;02082021173218
70;145;02082021173218
71;147;02082021173218
72;148;02082021173218
73;144;02082021173218
74;147;02082021173218
75;144;02082021173218
76;144;02082021173218
77;146;02082021173218
78;142;02082021173218
79;144;02082021173218
80;145;02082021173218
81;141;02082021173218
82;143;02082021173218
83;140;02082021173218
84;138;02082021173218
85;140;02082021173218
86;136;02082021173218
87;138;02082021173218
88;139;02082021173218
89;136;02082021173218
90;139;02082021173218
91;137;02082021173218
92;135;02082021173218
93;138;02082021173218
94;136;02082021173218
95;136;02082021173218
96;138;02082021173218
97;137;02082021173218
98;137;02082021173218
99;137;02082021173218
100;136;02082021173218
101;138;02082021173218
102;135;02082021173218
103;135;02082021173218
104;136;02082021173218
105;134;02082021173218
106;138;02082021173218
107;135;02082021173218
108;135;02082021173218
109;137;02082021173218
110;133;02082021173218
111;134;02082021173218
112;136;02082021173218
113;134;02082021173218
114;135;02082021173218
115;136;02082021173218
116;134;02082021173218
117;137;02082021173218
118;133;02082021173218
119;133;02082021173218
120;131;02082021173218
121;132;02082021173218
122;134;02082021173218
123;133;02082021173218
124;131;02082021173218
125;133;02082021173218
126;132;02082021173218
127;132;02082021173218
128;133;02082021173218
129;131;02082021173218
130;131;02082021173218
131;132;02082021173218
132;130;02082021173218
133;134;02082021173218
134;130;02082021173218
135;129;02082021173218
136;132;02082021173218
137;129;02082021173218
138;131;02082021173218
139;130;02082021173218
140;128;02082021173218
141;131;02082021173218
142;129;02082021173218
143;128;02082021173218
144;131;02082021173218
145;127;02082021173218
146;131;02082021173218
147;130;02082021173218
148;127;02082021173218
149;129;02082021173218
150;128;02082021173218
151;128;02082021173218
152;130;02082021173218
153;127;02082021173218
154;129;02082021173218
155;129;02082021173218
156;127;02082021173218
157;129;02082021173218
158;128;02082021173218
159;127;02082021173218
160;131;02082021173218
161;128;02082021173218
162;130;02082021173218
163;130;02082021173218
164;129;02082021173218
165;131;02082021173218
166;130;02082021173218
167;130;02082021173218
168;130;02082021173218
169;127;02082021173218
170;129;02082021173218
171;128;02082021173218
172;127;02082021173218
173;129;02082021173218
174;128;02082021173218
175;127;02082021173218
176;129;02082021173218
177;127;02082021173218
178;129;02082021173218
179;128;02082021173218
180;127;02082021173218
181;130;02082021173218
182;129;02082021173218
183;127;02082021173218
184;128;02082021173218
185;126;02082021173218
186;129;02082021173218
187;129;02082021173218
188;125;02082021173218
189;128;02082021173218
190;127;02082021173218
191;126;02082021173218
192;131;02082021173218
193;127;02082021173218
194;128;02082021173218
195;127;02082021173218
196;127;02082021173218
197;129;02082021173218
198;129;02082021173218
199;127;02082021173218
200;0;02082021173218
0;0;02082021173219
1;153;02082021173219
2;149;02082021173219
3;147;02082021173219
4;148;02082021173219
5;151;02082021173219
6;150;02082021173219
7;154;02082021173219
8;159;02082021173219
9;157;02082021173219
10;161;02082021173219
11;164;02082021173219
12;169;02082021173219
13;178;02082021173219
14;185;02082021173219
15;197;02082021173219
16;215;02082021173219
17;242;02082021173219
18;307;02082021173219
19;433;02082021173219
20;728;02082021173219
21;1023;02082021173219
22;1023;02082021173219
23;1023;02082021173219
24;1023;02082021173219
25;1023;02082021173219
26;650;02082021173219
27;430;02082021173219
28;879;02082021173219
29;1023;02082021173219
30;1023;02082021173219
31;1023;02082021173219
32;1023;02082021173219
33;1023;02082021173219
34;1023;02082021173219
35;1023;02082021173219
36;1023;02082021173219
37;1023;02082021173219
38;1023;02082021173219
39;987;02082021173219
40;775;02082021173219
41;601;02082021173219
42;490;02082021173219
43;400;02082021173219
44;340;02082021173219
45;291;02082021173219
46;258;02082021173219
47;231;02082021173219
48;217;02082021173219
49;201;02082021173219
50;192;02082021173219
51;184;02082021173219
52;177;02082021173219
53;174;02082021173219
54;167;02082021173219
55;164;02082021173219
56;164;02082021173219
57;161;02082021173219
58;160;02082021173219
59;158;02082021173219
60;159;02082021173219
61;158;02082021173219
62;155;02082021173219
63;155;02082021173219
64;155;02082021173219
65;151;02082021173219
66;152;02082021173219
67;151;02082021173219
68;149;02082021173219
69;151;02082021173219
70;147;02082021173219
71;148;02082021173219
72;148;02082021173219
73;145;02082021173219
74;147;02082021173219
75;143;02082021173219
76;144;02082021173219
77;146;02082021173219
78;142;02082021173219
79;144;02082021173219
80;145;02082021173219
81;140;02082021173219
82;144;02082021173219
83;141;02082021173219
84;139;02082021173219
85;139;02082021173219
86;137;02082021173219
87;139;02082021173219
88;140;02082021173219
89;136;02082021173219
90;140;02082021173219
91;137;02082021173219
92;135;02082021173219
93;139;02082021173219
94;138;02082021173219
95;135;02082021173219
96;138;02082021173219
97;136;02082021173219
98;136;02082021173219
99;136;02082021173219
100;135;02082021173219
101;138;02082021173219
102;136;02082021173219
103;136;02082021173219
104;136;02082021173219
105;135;02082021173219
106;137;02082021173219
107;136;02082021173219
108;134;02082021173219
109;137;02082021173219
110;133;02082021173219
111;134;02082021173219
112;136;02082021173219
113;132;02082021173219
114;134;02082021173219
115;135;02082021173219
116;134;02082021173219
117;137;02082021173219
118;133;02082021173219
119;134;02082021173219
120;133;02082021173219
121;132;02082021173219
122;132;02082021173219
123;133;02082021173219
124;132;02082021173219
125;134;02082021173219
126;131;02082021173219
127;130;02082021173219
128;133;02082021173219
129;130;02082021173219
130;132;02082021173219
131;132;02082021173219
132;130;02082021173219
133;134;02082021173219
134;130;02082021173219
135;130;02082021173219
136;132;02082021173219
137;129;02082021173219
138;131;02082021173219
139;131;02082021173219
140;129;02082021173219
141;132;02082021173219
142;130;02082021173219
143;129;02082021173219
144;130;02082021173219
145;126;02082021173219
146;131;02082021173219
147;129;02082021173219
148;129;02082021173219
149;128;02082021173219
150;128;02082021173219
151;130;02082021173219
152;130;02082021173219
153;128;02082021173219
154;129;02082021173219
155;129;02082021173219
156;128;02082021173219
157;129;02082021173219
158;128;02082021173219
159;127;02082021173219
160;129;02082021173219
161;128;02082021173219
162;130;02082021173219
163;130;02082021173219
164;129;02082021173219
165;131;02082021173219
166;130;02082021173219
167;130;02082021173219
168;131;02082021173219
169;127;02082021173219
170;130;02082021173219
171;128;02082021173219
172;128;02082021173219
173;129;02082021173219
174;128;02082021173219
175;127;02082021173219
176;130;02082021173219
177;127;02082021173219
178;129;02082021173219
179;128;02082021173219
180;127;02082021173219
181;129;02082021173219
182;128;02082021173219
183;126;02082021173219
184;129;02082021173219
185;126;02082021173219
186;129;02082021173219
187;128;02082021173219
188;125;02082021173219
189;128;02082021173219
190;127;02082021173219
191;127;02082021173219
192;131;02082021173219
193;127;02082021173219
194;127;02082021173219
195;127;02082021173219
196;128;02082021173219
197;129;02082021173219
198;128;02082021173219
199;127;02082021173219
200;0;02082021173219
0;0;02082021173219
1;153;02082021173219
2;149;02082021173219
3;147;02082021173219
4;149;02082021173219
5;151;02082021173219
6;149;02082021173219
7;153;02082021173219
8;156;02082021173219
9;155;02082021173219
10;164;02082021173219
11;164;02082021173219
12;167;02082021173219
13;178;02082021173219
14;184;02082021173219
15;198;02082021173219
16;215;02082021173219
17;243;02082021173219
18;307;02082021173219
19;433;02082021173219
20;722;02082021173219
21;1023;02082021173219
22;1023;02082021173219
23;1023;02082021173219
24;1023;02082021173219
25;1023;02082021173219
26;694;02082021173219
27;515;02082021173219
28;890;02082021173219
29;1023;02082021173219
30;1023;02082021173219
31;1023;02082021173219
32;1023;02082021173219
33;1023;02082021173219
34;1023;02082021173219
35;1023;02082021173219
36;1023;02082021173219
37;1023;02082021173219
38;1023;02082021173219
39;983;02082021173219
40;775;02082021173219
41;608;02082021173219
42;495;02082021173219
43;398;02082021173219
44;339;02082021173219
45;290;02082021173219
46;257;02082021173219
47;232;02082021173219
48;218;02082021173219
49;201;02082021173219
50;195;02082021173219
51;184;02082021173219
52;176;02082021173219
53;173;02082021173219
54;166;02082021173219
55;164;02082021173219
56;164;02082021173219
57;158;02082021173219
58;161;02082021173219
59;159;02082021173219
60;158;02082021173219
61;157;02082021173219
62;155;02082021173219
63;154;02082021173219
64;156;02082021173219
65;150;02082021173219
66;153;02082021173219
67;150;02082021173219
68;148;02082021173219
69;152;02082021173219
70;148;02082021173219
71;146;02082021173219
72;148;02082021173219
73;145;02082021173219
74;148;02082021173219
75;145;02082021173219
76;145;02082021173219
77;147;02082021173219
78;143;02082021173219
79;144;02082021173219
80;144;02082021173219
81;141;02082021173219
82;143;02082021173219
83;139;02082021173219
84;140;02082021173219
85;140;02082021173219
86;136;02082021173219
87;138;02082021173219
88;139;02082021173219
89;136;02082021173219
90;139;02082021173219
91;138;02082021173219
92;136;02082021173219
93;138;02082021173219
94;137;02082021173219
95;136;02082021173219
96;137;02082021173219
97;135;02082021173219
98;136;02082021173219
99;137;02082021173219
100;134;02082021173219
101;137;02082021173219
102;136;02082021173219
103;135;02082021173219
104;136;02082021173219
105;135;02082021173219
106;138;02082021173219
107;136;02082021173219
108;134;02082021173219
109;137;02082021173219
110;133;02082021173219
111;135;02082021173219
112;138;02082021173219
113;132;02082021173219
114;135;02082021173219
115;136;02082021173219
116;133;02082021173219
117;135;02082021173219
118;133;02082021173219
119;134;02082021173219
120;134;02082021173219
121;131;02082021173219
122;132;02082021173219
123;134;02082021173219
124;132;02082021173219
125;134;02082021173219
126;132;02082021173219
127;132;02082021173219
128;134;02082021173219
129;130;02082021173219
130;131;02082021173219
131;132;02082021173219
132;129;02082021173219
133;134;02082021173219
134;129;02082021173219
135;130;02082021173219
136;133;02082021173219
137;130;02082021173219
138;131;02082021173219
139;130;02082021173219
140;128;02082021173219
141;132;02082021173219
142;128;02082021173219
143;130;02082021173219
144;131;02082021173219
145;128;02082021173219
146;131;02082021173219
147;129;02082021173219
148;129;02082021173219
149;129;02082021173219
150;128;02082021173219
151;129;02082021173219
152;129;02082021173219
153;127;02082021173219
154;130;02082021173219
155;128;02082021173219
156;127;02082021173219
157;128;02082021173219
158;128;02082021173219
159;128;02082021173219
160;130;02082021173219
161;128;02082021173219
162;129;02082021173219
163;129;02082021173219
164;129;02082021173219
165;130;02082021173219
166;129;02082021173219
167;130;02082021173219
168;130;02082021173219
169;127;02082021173219
170;130;02082021173219
171;129;02082021173219
172;128;02082021173219
173;129;02082021173219
174;127;02082021173219
175;127;02082021173219
176;129;02082021173219
177;128;02082021173219
178;130;02082021173219
179;128;02082021173219
180;128;02082021173219
181;129;02082021173219
182;128;02082021173219
183;127;02082021173219
184;129;02082021173219
185;126;02082021173219
186;130;02082021173219
187;129;02082021173219
188;126;02082021173219
189;128;02082021173219
190;126;02082021173219
191;126;02082021173219
192;130;02082021173219
193;128;02082021173219
194;128;02082021173219
195;128;02082021173219
196;127;02082021173219
197;130;02082021173219
198;128;02082021173219
199;127;02082021173219
200;0;02082021173219
