31052021184542
ind;val
0;130
1;129
2;959
3;975
4;972
5;970
6;975
7;976
8;971
9;971
10;966
11;976
12;969
13;975
14;976
15;977
16;979
17;970
18;975
19;968
20;964
21;976
22;975
23;968
24;972
25;967
26;973
27;980
28;971
29;973
30;974
31;969
32;978
33;969
34;973
35;977
36;971
37;966
38;964
39;959
40;960
41;949
42;946
43;949
44;952
45;950
46;944
47;949
48;945
49;958
50;948
51;953
52;949
53;944
54;950
55;951
56;946
57;945
58;947
59;947
60;949
61;948
62;943
63;947
64;950
65;937
66;940
67;944
68;943
69;948
70;945
71;945
72;951
73;950
74;952
75;945
76;952
77;950
78;947
79;963
80;957
81;955
82;959
83;957
84;960
85;951
86;953
87;959
88;953
89;955
90;955
91;959
92;956
93;961
94;959
95;959
96;962
97;959
98;960
99;965
