ind;val;datetime
0;0;29062021124913
1;141;29062021124913
2;143;29062021124913
3;141;29062021124913
4;143;29062021124913
5;144;29062021124913
6;145;29062021124913
7;147;29062021124913
8;150;29062021124913
9;151;29062021124913
10;157;29062021124913
11;159;29062021124913
12;160;29062021124913
13;174;29062021124913
14;178;29062021124913
15;194;29062021124913
16;218;29062021124913
17;261;29062021124913
18;351;29062021124913
19;541;29062021124913
20;911;29062021124913
21;1023;29062021124913
22;1023;29062021124913
23;1023;29062021124913
24;1023;29062021124913
25;1012;29062021124913
26;953;29062021124913
27;961;29062021124913
28;1017;29062021124913
29;1023;29062021124913
30;1023;29062021124913
31;1023;29062021124913
32;1023;29062021124913
33;1023;29062021124913
34;1023;29062021124913
35;1023;29062021124913
36;1023;29062021124913
37;1023;29062021124913
38;1011;29062021124913
39;864;29062021124913
40;738;29062021124913
41;641;29062021124913
42;585;29062021124913
43;543;29062021124913
44;514;29062021124913
45;499;29062021124913
46;489;29062021124913
47;488;29062021124913
48;479;29062021124913
49;479;29062021124913
50;483;29062021124913
51;488;29062021124913
52;486;29062021124913
53;499;29062021124913
54;506;29062021124913
55;521;29062021124913
56;524;29062021124913
57;536;29062021124913
58;554;29062021124913
59;564;29062021124913
60;576;29062021124913
61;591;29062021124913
62;596;29062021124913
63;608;29062021124913
64;615;29062021124913
65;615;29062021124913
66;621;29062021124913
67;616;29062021124913
68;605;29062021124913
69;599;29062021124913
70;585;29062021124913
71;571;29062021124913
72;564;29062021124913
73;543;29062021124913
74;531;29062021124913
75;509;29062021124913
76;495;29062021124913
77;483;29062021124913
78;470;29062021124913
79;448;29062021124913
80;435;29062021124913
81;416;29062021124913
82;408;29062021124913
83;397;29062021124913
84;388;29062021124913
85;379;29062021124913
86;375;29062021124913
87;369;29062021124913
88;367;29062021124913
89;355;29062021124913
90;351;29062021124913
91;345;29062021124913
92;328;29062021124913
93;324;29062021124913
94;316;29062021124913
95;304;29062021124913
96;299;29062021124913
97;288;29062021124913
98;281;29062021124913
99;274;29062021124913
100;267;29062021124913
101;265;29062021124913
102;259;29062021124913
103;252;29062021124913
104;248;29062021124913
105;238;29062021124913
106;241;29062021124913
107;231;29062021124913
108;229;29062021124913
109;225;29062021124913
110;219;29062021124913
111;213;29062021124913
112;212;29062021124913
113;207;29062021124913
114;204;29062021124913
115;201;29062021124913
116;201;29062021124913
117;198;29062021124913
118;194;29062021124913
119;190;29062021124913
120;187;29062021124913
121;184;29062021124913
122;182;29062021124913
123;181;29062021124913
124;177;29062021124913
125;177;29062021124913
126;171;29062021124913
127;170;29062021124913
128;170;29062021124913
129;165;29062021124913
130;165;29062021124913
131;162;29062021124913
132;158;29062021124913
133;162;29062021124913
134;155;29062021124913
135;154;29062021124913
136;155;29062021124913
137;150;29062021124913
138;149;29062021124913
139;150;29062021124913
140;146;29062021124913
141;147;29062021124913
142;144;29062021124913
143;141;29062021124913
144;142;29062021124913
145;140;29062021124913
146;141;29062021124913
147;141;29062021124913
148;137;29062021124913
149;138;29062021124913
150;137;29062021124913
151;136;29062021124913
152;135;29062021124913
153;133;29062021124913
154;135;29062021124913
155;133;29062021124913
156;132;29062021124913
157;132;29062021124913
158;131;29062021124913
159;130;29062021124913
160;131;29062021124913
161;129;29062021124913
162;130;29062021124913
163;131;29062021124913
164;128;29062021124913
165;129;29062021124913
166;128;29062021124913
167;128;29062021124913
168;129;29062021124913
169;126;29062021124913
170;128;29062021124913
171;126;29062021124913
172;125;29062021124913
173;126;29062021124913
174;124;29062021124913
175;124;29062021124913
176;125;29062021124913
177;124;29062021124913
178;127;29062021124913
179;125;29062021124913
180;123;29062021124913
181;124;29062021124913
182;125;29062021124913
183;123;29062021124913
184;124;29062021124913
185;122;29062021124913
186;125;29062021124913
187;124;29062021124913
188;123;29062021124913
189;124;29062021124913
190;122;29062021124913
191;123;29062021124913
192;126;29062021124913
193;122;29062021124913
194;125;29062021124913
195;124;29062021124913
196;121;29062021124913
197;122;29062021124913
198;122;29062021124913
199;121;29062021124913
200;0;29062021124913
0;0;29062021124913
1;140;29062021124913
2;142;29062021124913
3;142;29062021124913
4;143;29062021124913
5;144;29062021124913
6;145;29062021124913
7;148;29062021124913
8;150;29062021124913
9;151;29062021124913
10;157;29062021124913
11;157;29062021124913
12;162;29062021124913
13;172;29062021124913
14;177;29062021124913
15;192;29062021124913
16;219;29062021124913
17;260;29062021124913
18;352;29062021124913
19;543;29062021124913
20;908;29062021124913
21;1023;29062021124913
22;1023;29062021124913
23;1023;29062021124913
24;1023;29062021124913
25;1013;29062021124913
26;949;29062021124913
27;959;29062021124913
28;1017;29062021124913
29;1023;29062021124913
30;1023;29062021124913
31;1023;29062021124913
32;1023;29062021124913
33;1023;29062021124913
34;1023;29062021124913
35;1023;29062021124913
36;1023;29062021124913
37;1023;29062021124913
38;1014;29062021124913
39;880;29062021124913
40;743;29062021124913
41;646;29062021124913
42;586;29062021124913
43;547;29062021124913
44;515;29062021124913
45;503;29062021124913
46;489;29062021124913
47;483;29062021124913
48;487;29062021124913
49;481;29062021124913
50;484;29062021124913
51;485;29062021124913
52;486;29062021124913
53;498;29062021124913
54;502;29062021124913
55;512;29062021124913
56;523;29062021124913
57;538;29062021124913
58;554;29062021124913
59;563;29062021124913
60;578;29062021124913
61;594;29062021124913
62;597;29062021124913
63;604;29062021124913
64;615;29062021124913
65;612;29062021124913
66;620;29062021124913
67;612;29062021124913
68;606;29062021124913
69;598;29062021124913
70;586;29062021124913
71;572;29062021124913
72;566;29062021124913
73;546;29062021124913
74;530;29062021124913
75;507;29062021124913
76;501;29062021124913
77;482;29062021124913
78;466;29062021124913
79;451;29062021124913
80;432;29062021124913
81;415;29062021124913
82;409;29062021124913
83;397;29062021124913
84;388;29062021124913
85;382;29062021124913
86;375;29062021124913
87;370;29062021124913
88;365;29062021124913
89;357;29062021124913
90;354;29062021124913
91;344;29062021124913
92;333;29062021124913
93;323;29062021124913
94;312;29062021124913
95;301;29062021124913
96;297;29062021124913
97;288;29062021124913
98;281;29062021124913
99;275;29062021124913
100;268;29062021124913
101;264;29062021124913
102;259;29062021124913
103;251;29062021124913
104;247;29062021124913
105;240;29062021124913
106;239;29062021124913
107;230;29062021124913
108;226;29062021124913
109;223;29062021124913
110;217;29062021124913
111;215;29062021124913
112;213;29062021124913
113;206;29062021124913
114;204;29062021124913
115;200;29062021124913
116;199;29062021124913
117;198;29062021124913
118;190;29062021124913
119;191;29062021124913
120;187;29062021124913
121;183;29062021124913
122;183;29062021124913
123;179;29062021124913
124;177;29062021124913
125;175;29062021124913
126;171;29062021124913
127;170;29062021124913
128;171;29062021124913
129;164;29062021124913
130;163;29062021124913
131;162;29062021124913
132;158;29062021124913
133;160;29062021124913
134;157;29062021124913
135;155;29062021124913
136;153;29062021124913
137;148;29062021124913
138;152;29062021124913
139;149;29062021124913
140;146;29062021124913
141;146;29062021124913
142;143;29062021124913
143;141;29062021124913
144;142;29062021124913
145;139;29062021124913
146;140;29062021124913
147;139;29062021124913
148;137;29062021124913
149;137;29062021124913
150;137;29062021124913
151;136;29062021124913
152;136;29062021124913
153;133;29062021124913
154;134;29062021124913
155;133;29062021124913
156;131;29062021124913
157;133;29062021124913
158;131;29062021124913
159;130;29062021124913
160;130;29062021124913
161;129;29062021124913
162;130;29062021124913
163;129;29062021124913
164;128;29062021124913
165;130;29062021124913
166;128;29062021124913
167;127;29062021124913
168;128;29062021124913
169;125;29062021124913
170;127;29062021124913
171;126;29062021124913
172;125;29062021124913
173;126;29062021124913
174;124;29062021124913
175;124;29062021124913
176;125;29062021124913
177;123;29062021124913
178;126;29062021124913
179;124;29062021124913
180;123;29062021124913
181;124;29062021124913
182;125;29062021124913
183;123;29062021124913
184;123;29062021124913
185;120;29062021124913
186;124;29062021124913
187;124;29062021124913
188;122;29062021124913
189;122;29062021124913
190;121;29062021124913
191;122;29062021124913
192;126;29062021124913
193;122;29062021124913
194;122;29062021124913
195;121;29062021124913
196;122;29062021124913
197;122;29062021124913
198;123;29062021124913
199;121;29062021124913
200;0;29062021124913
0;0;29062021124914
1;141;29062021124914
2;142;29062021124914
3;140;29062021124914
4;143;29062021124914
5;144;29062021124914
6;145;29062021124914
7;148;29062021124914
8;150;29062021124914
9;150;29062021124914
10;157;29062021124914
11;157;29062021124914
12;163;29062021124914
13;171;29062021124914
14;176;29062021124914
15;193;29062021124914
16;217;29062021124914
17;257;29062021124914
18;353;29062021124914
19;540;29062021124914
20;911;29062021124914
21;1023;29062021124914
22;1023;29062021124914
23;1023;29062021124914
24;1023;29062021124914
25;1012;29062021124914
26;950;29062021124914
27;956;29062021124914
28;1016;29062021124914
29;1023;29062021124914
30;1023;29062021124914
31;1023;29062021124914
32;1023;29062021124914
33;1023;29062021124914
34;1023;29062021124914
35;1023;29062021124914
36;1023;29062021124914
37;1023;29062021124914
38;1016;29062021124914
39;877;29062021124914
40;742;29062021124914
41;645;29062021124914
42;587;29062021124914
43;543;29062021124914
44;516;29062021124914
45;498;29062021124914
46;490;29062021124914
47;487;29062021124914
48;483;29062021124914
49;477;29062021124914
50;483;29062021124914
51;484;29062021124914
52;486;29062021124914
53;496;29062021124914
54;502;29062021124914
55;513;29062021124914
56;523;29062021124914
57;539;29062021124914
58;553;29062021124914
59;562;29062021124914
60;575;29062021124914
61;589;29062021124914
62;597;29062021124914
63;609;29062021124914
64;615;29062021124914
65;614;29062021124914
66;619;29062021124914
67;617;29062021124914
68;607;29062021124914
69;599;29062021124914
70;586;29062021124914
71;573;29062021124914
72;566;29062021124914
73;543;29062021124914
74;534;29062021124914
75;507;29062021124914
76;495;29062021124914
77;481;29062021124914
78;463;29062021124914
79;446;29062021124914
80;433;29062021124914
81;415;29062021124914
82;405;29062021124914
83;395;29062021124914
84;384;29062021124914
85;379;29062021124914
86;374;29062021124914
87;370;29062021124914
88;363;29062021124914
89;356;29062021124914
90;352;29062021124914
91;343;29062021124914
92;331;29062021124914
93;326;29062021124914
94;314;29062021124914
95;301;29062021124914
96;297;29062021124914
97;286;29062021124914
98;283;29062021124914
99;274;29062021124914
100;268;29062021124914
101;265;29062021124914
102;257;29062021124914
103;251;29062021124914
104;248;29062021124914
105;240;29062021124914
106;239;29062021124914
107;233;29062021124914
108;229;29062021124914
109;223;29062021124914
110;217;29062021124914
111;214;29062021124914
112;212;29062021124914
113;205;29062021124914
114;204;29062021124914
115;201;29062021124914
116;199;29062021124914
117;197;29062021124914
118;191;29062021124914
119;189;29062021124914
120;185;29062021124914
121;184;29062021124914
122;182;29062021124914
123;178;29062021124914
124;177;29062021124914
125;176;29062021124914
126;171;29062021124914
127;169;29062021124914
128;170;29062021124914
129;165;29062021124914
130;163;29062021124914
131;162;29062021124914
132;157;29062021124914
133;160;29062021124914
134;155;29062021124914
135;153;29062021124914
136;153;29062021124914
137;149;29062021124914
138;151;29062021124914
139;149;29062021124914
140;144;29062021124914
141;147;29062021124914
142;144;29062021124914
143;141;29062021124914
144;142;29062021124914
145;140;29062021124914
146;142;29062021124914
147;139;29062021124914
148;138;29062021124914
149;137;29062021124914
150;136;29062021124914
151;135;29062021124914
152;134;29062021124914
153;132;29062021124914
154;134;29062021124914
155;133;29062021124914
156;131;29062021124914
157;131;29062021124914
158;130;29062021124914
159;130;29062021124914
160;130;29062021124914
161;128;29062021124914
162;129;29062021124914
163;130;29062021124914
164;129;29062021124914
165;130;29062021124914
166;127;29062021124914
167;127;29062021124914
168;128;29062021124914
169;123;29062021124914
170;127;29062021124914
171;125;29062021124914
172;124;29062021124914
173;127;29062021124914
174;124;29062021124914
175;123;29062021124914
176;125;29062021124914
177;124;29062021124914
178;126;29062021124914
179;125;29062021124914
180;123;29062021124914
181;124;29062021124914
182;125;29062021124914
183;123;29062021124914
184;125;29062021124914
185;121;29062021124914
186;125;29062021124914
187;124;29062021124914
188;122;29062021124914
189;122;29062021124914
190;121;29062021124914
191;122;29062021124914
192;126;29062021124914
193;121;29062021124914
194;123;29062021124914
195;122;29062021124914
196;122;29062021124914
197;122;29062021124914
198;122;29062021124914
199;120;29062021124914
200;0;29062021124914
0;0;29062021124915
1;141;29062021124915
2;143;29062021124915
3;141;29062021124915
4;144;29062021124915
5;144;29062021124915
6;144;29062021124915
7;148;29062021124915
8;151;29062021124915
9;151;29062021124915
10;158;29062021124915
11;159;29062021124915
12;161;29062021124915
13;173;29062021124915
14;179;29062021124915
15;194;29062021124915
16;216;29062021124915
17;258;29062021124915
18;353;29062021124915
19;543;29062021124915
20;911;29062021124915
21;1023;29062021124915
22;1023;29062021124915
23;1023;29062021124915
24;1023;29062021124915
25;1015;29062021124915
26;954;29062021124915
27;961;29062021124915
28;1021;29062021124915
29;1023;29062021124915
30;1023;29062021124915
31;1023;29062021124915
32;1023;29062021124915
33;1023;29062021124915
34;1023;29062021124915
35;1023;29062021124915
36;1023;29062021124915
37;1023;29062021124915
38;1017;29062021124915
39;881;29062021124915
40;744;29062021124915
41;649;29062021124915
42;591;29062021124915
43;546;29062021124915
44;518;29062021124915
45;499;29062021124915
46;494;29062021124915
47;485;29062021124915
48;483;29062021124915
49;483;29062021124915
50;482;29062021124915
51;483;29062021124915
52;486;29062021124915
53;494;29062021124915
54;506;29062021124915
55;516;29062021124915
56;524;29062021124915
57;538;29062021124915
58;557;29062021124915
59;561;29062021124915
60;575;29062021124915
61;588;29062021124915
62;597;29062021124915
63;609;29062021124915
64;614;29062021124915
65;612;29062021124915
66;616;29062021124915
67;614;29062021124915
68;605;29062021124915
69;594;29062021124915
70;579;29062021124915
71;577;29062021124915
72;562;29062021124915
73;542;29062021124915
74;533;29062021124915
75;513;29062021124915
76;497;29062021124915
77;481;29062021124915
78;467;29062021124915
79;449;29062021124915
80;432;29062021124915
81;414;29062021124915
82;409;29062021124915
83;396;29062021124915
84;386;29062021124915
85;380;29062021124915
86;374;29062021124915
87;370;29062021124915
88;371;29062021124915
89;354;29062021124915
90;351;29062021124915
91;342;29062021124915
92;329;29062021124915
93;320;29062021124915
94;315;29062021124915
95;303;29062021124915
96;299;29062021124915
97;287;29062021124915
98;280;29062021124915
99;273;29062021124915
100;267;29062021124915
101;265;29062021124915
102;258;29062021124915
103;249;29062021124915
104;247;29062021124915
105;241;29062021124915
106;240;29062021124915
107;230;29062021124915
108;230;29062021124915
109;225;29062021124915
110;218;29062021124915
111;213;29062021124915
112;210;29062021124915
113;204;29062021124915
114;204;29062021124915
115;202;29062021124915
116;197;29062021124915
117;199;29062021124915
118;193;29062021124915
119;192;29062021124915
120;187;29062021124915
121;183;29062021124915
122;181;29062021124915
123;180;29062021124915
124;176;29062021124915
125;176;29062021124915
126;171;29062021124915
127;170;29062021124915
128;167;29062021124915
129;163;29062021124915
130;162;29062021124915
131;162;29062021124915
132;158;29062021124915
133;160;29062021124915
134;156;29062021124915
135;153;29062021124915
136;155;29062021124915
137;149;29062021124915
138;150;29062021124915
139;146;29062021124915
140;145;29062021124915
141;146;29062021124915
142;143;29062021124915
143;143;29062021124915
144;143;29062021124915
145;140;29062021124915
146;141;29062021124915
147;140;29062021124915
148;138;29062021124915
149;137;29062021124915
150;136;29062021124915
151;136;29062021124915
152;135;29062021124915
153;133;29062021124915
154;135;29062021124915
155;132;29062021124915
156;132;29062021124915
157;131;29062021124915
158;131;29062021124915
159;129;29062021124915
160;130;29062021124915
161;129;29062021124915
162;130;29062021124915
163;130;29062021124915
164;129;29062021124915
165;131;29062021124915
166;128;29062021124915
167;128;29062021124915
168;129;29062021124915
169;124;29062021124915
170;127;29062021124915
171;125;29062021124915
172;124;29062021124915
173;126;29062021124915
174;125;29062021124915
175;124;29062021124915
176;126;29062021124915
177;124;29062021124915
178;126;29062021124915
179;124;29062021124915
180;123;29062021124915
181;124;29062021124915
182;124;29062021124915
183;123;29062021124915
184;125;29062021124915
185;121;29062021124915
186;124;29062021124915
187;123;29062021124915
188;121;29062021124915
189;122;29062021124915
190;122;29062021124915
191;123;29062021124915
192;125;29062021124915
193;121;29062021124915
194;123;29062021124915
195;122;29062021124915
196;122;29062021124915
197;123;29062021124915
198;122;29062021124915
199;121;29062021124915
200;0;29062021124915
0;0;29062021124916
1;141;29062021124916
2;143;29062021124916
3;141;29062021124916
4;142;29062021124916
5;144;29062021124916
6;143;29062021124916
7;148;29062021124916
8;150;29062021124916
9;150;29062021124916
10;157;29062021124916
11;158;29062021124916
12;161;29062021124916
13;172;29062021124916
14;178;29062021124916
15;193;29062021124916
16;216;29062021124916
17;260;29062021124916
18;352;29062021124916
19;538;29062021124916
20;907;29062021124916
21;1023;29062021124916
22;1023;29062021124916
23;1023;29062021124916
24;1023;29062021124916
25;1014;29062021124916
26;951;29062021124916
27;959;29062021124916
28;1014;29062021124916
29;1023;29062021124916
30;1023;29062021124916
31;1023;29062021124916
32;1023;29062021124916
33;1023;29062021124916
34;1023;29062021124916
35;1023;29062021124916
36;1023;29062021124916
37;1023;29062021124916
38;1017;29062021124916
39;879;29062021124916
40;746;29062021124916
41;649;29062021124916
42;586;29062021124916
43;541;29062021124916
44;521;29062021124916
45;501;29062021124916
46;488;29062021124916
47;486;29062021124916
48;480;29062021124916
49;482;29062021124916
50;482;29062021124916
51;486;29062021124916
52;482;29062021124916
53;500;29062021124916
54;502;29062021124916
55;512;29062021124916
56;524;29062021124916
57;535;29062021124916
58;553;29062021124916
59;559;29062021124916
60;573;29062021124916
61;588;29062021124916
62;596;29062021124916
63;609;29062021124916
64;612;29062021124916
65;614;29062021124916
66;620;29062021124916
67;613;29062021124916
68;604;29062021124916
69;600;29062021124916
70;586;29062021124916
71;574;29062021124916
72;566;29062021124916
73;543;29062021124916
74;531;29062021124916
75;506;29062021124916
76;493;29062021124916
77;482;29062021124916
78;464;29062021124916
79;450;29062021124916
80;430;29062021124916
81;415;29062021124916
82;408;29062021124916
83;393;29062021124916
84;385;29062021124916
85;378;29062021124916
86;375;29062021124916
87;367;29062021124916
88;366;29062021124916
89;354;29062021124916
90;353;29062021124916
91;342;29062021124916
92;329;29062021124916
93;322;29062021124916
94;314;29062021124916
95;303;29062021124916
96;299;29062021124916
97;289;29062021124916
98;281;29062021124916
99;276;29062021124916
100;268;29062021124916
101;265;29062021124916
102;258;29062021124916
103;250;29062021124916
104;247;29062021124916
105;241;29062021124916
106;240;29062021124916
107;231;29062021124916
108;228;29062021124916
109;225;29062021124916
110;215;29062021124916
111;212;29062021124916
112;211;29062021124916
113;203;29062021124916
114;204;29062021124916
115;204;29062021124916
116;198;29062021124916
117;196;29062021124916
118;192;29062021124916
119;192;29062021124916
120;185;29062021124916
121;184;29062021124916
122;183;29062021124916
123;180;29062021124916
124;176;29062021124916
125;176;29062021124916
126;171;29062021124916
127;170;29062021124916
128;169;29062021124916
129;163;29062021124916
130;163;29062021124916
131;161;29062021124916
132;157;29062021124916
133;161;29062021124916
134;155;29062021124916
135;153;29062021124916
136;153;29062021124916
137;149;29062021124916
138;151;29062021124916
139;148;29062021124916
140;146;29062021124916
141;146;29062021124916
142;142;29062021124916
143;141;29062021124916
144;142;29062021124916
145;140;29062021124916
146;141;29062021124916
147;140;29062021124916
148;137;29062021124916
149;136;29062021124916
150;136;29062021124916
151;136;29062021124916
152;135;29062021124916
153;133;29062021124916
154;133;29062021124916
155;133;29062021124916
156;132;29062021124916
157;131;29062021124916
158;130;29062021124916
159;130;29062021124916
160;130;29062021124916
161;129;29062021124916
162;130;29062021124916
163;130;29062021124916
164;127;29062021124916
165;129;29062021124916
166;127;29062021124916
167;127;29062021124916
168;128;29062021124916
169;125;29062021124916
170;127;29062021124916
171;126;29062021124916
172;124;29062021124916
173;126;29062021124916
174;124;29062021124916
175;124;29062021124916
176;125;29062021124916
177;124;29062021124916
178;126;29062021124916
179;125;29062021124916
180;123;29062021124916
181;124;29062021124916
182;124;29062021124916
183;123;29062021124916
184;124;29062021124916
185;121;29062021124916
186;125;29062021124916
187;122;29062021124916
188;120;29062021124916
189;122;29062021124916
190;122;29062021124916
191;122;29062021124916
192;124;29062021124916
193;121;29062021124916
194;122;29062021124916
195;122;29062021124916
196;121;29062021124916
197;123;29062021124916
198;122;29062021124916
199;119;29062021124916
200;0;29062021124916
0;0;29062021124916
1;140;29062021124916
2;142;29062021124916
3;141;29062021124916
4;142;29062021124916
5;145;29062021124916
6;143;29062021124916
7;148;29062021124916
8;151;29062021124916
9;150;29062021124916
10;156;29062021124916
11;158;29062021124916
12;163;29062021124916
13;171;29062021124916
14;177;29062021124916
15;193;29062021124916
16;219;29062021124916
17;259;29062021124916
18;351;29062021124916
19;537;29062021124916
20;900;29062021124916
21;1023;29062021124916
22;1023;29062021124916
23;1023;29062021124916
24;1023;29062021124916
25;1014;29062021124916
26;953;29062021124916
27;955;29062021124916
28;1016;29062021124916
29;1023;29062021124916
30;1023;29062021124916
31;1023;29062021124916
32;1023;29062021124916
33;1023;29062021124916
34;1023;29062021124916
35;1023;29062021124916
36;1023;29062021124916
37;1023;29062021124916
38;1019;29062021124916
39;883;29062021124916
40;747;29062021124916
41;645;29062021124916
42;593;29062021124916
43;543;29062021124916
44;517;29062021124916
45;496;29062021124916
46;492;29062021124916
47;483;29062021124916
48;483;29062021124916
49;481;29062021124916
50;483;29062021124916
51;485;29062021124916
52;487;29062021124916
53;497;29062021124916
54;502;29062021124916
55;510;29062021124916
56;523;29062021124916
57;536;29062021124916
58;553;29062021124916
59;555;29062021124916
60;572;29062021124916
61;588;29062021124916
62;596;29062021124916
63;606;29062021124916
64;613;29062021124916
65;611;29062021124916
66;614;29062021124916
67;613;29062021124916
68;601;29062021124916
69;597;29062021124916
70;583;29062021124916
71;573;29062021124916
72;561;29062021124916
73;542;29062021124916
74;531;29062021124916
75;510;29062021124916
76;493;29062021124916
77;485;29062021124916
78;465;29062021124916
79;450;29062021124916
80;428;29062021124916
81;415;29062021124916
82;409;29062021124916
83;395;29062021124916
84;390;29062021124916
85;378;29062021124916
86;374;29062021124916
87;370;29062021124916
88;366;29062021124916
89;355;29062021124916
90;353;29062021124916
91;342;29062021124916
92;327;29062021124916
93;324;29062021124916
94;312;29062021124916
95;303;29062021124916
96;299;29062021124916
97;288;29062021124916
98;284;29062021124916
99;272;29062021124916
100;266;29062021124916
101;265;29062021124916
102;256;29062021124916
103;252;29062021124916
104;247;29062021124916
105;239;29062021124916
106;238;29062021124916
107;232;29062021124916
108;228;29062021124916
109;224;29062021124916
110;217;29062021124916
111;213;29062021124916
112;212;29062021124916
113;206;29062021124916
114;204;29062021124916
115;203;29062021124916
116;196;29062021124916
117;197;29062021124916
118;192;29062021124916
119;191;29062021124916
120;186;29062021124916
121;184;29062021124916
122;184;29062021124916
123;181;29062021124916
124;175;29062021124916
125;178;29062021124916
126;171;29062021124916
127;169;29062021124916
128;169;29062021124916
129;164;29062021124916
130;165;29062021124916
131;162;29062021124916
132;158;29062021124916
133;161;29062021124916
134;155;29062021124916
135;154;29062021124916
136;154;29062021124916
137;150;29062021124916
138;152;29062021124916
139;148;29062021124916
140;146;29062021124916
141;147;29062021124916
142;144;29062021124916
143;142;29062021124916
144;143;29062021124916
145;140;29062021124916
146;141;29062021124916
147;139;29062021124916
148;137;29062021124916
149;138;29062021124916
150;136;29062021124916
151;136;29062021124916
152;134;29062021124916
153;133;29062021124916
154;135;29062021124916
155;133;29062021124916
156;130;29062021124916
157;132;29062021124916
158;132;29062021124916
159;129;29062021124916
160;131;29062021124916
161;129;29062021124916
162;130;29062021124916
163;130;29062021124916
164;129;29062021124916
165;130;29062021124916
166;127;29062021124916
167;127;29062021124916
168;129;29062021124916
169;124;29062021124916
170;128;29062021124916
171;126;29062021124916
172;125;29062021124916
173;127;29062021124916
174;123;29062021124916
175;122;29062021124916
176;127;29062021124916
177;124;29062021124916
178;125;29062021124916
179;124;29062021124916
180;124;29062021124916
181;125;29062021124916
182;125;29062021124916
183;123;29062021124916
184;123;29062021124916
185;120;29062021124916
186;125;29062021124916
187;123;29062021124916
188;121;29062021124916
189;123;29062021124916
190;122;29062021124916
191;122;29062021124916
192;125;29062021124916
193;121;29062021124916
194;123;29062021124916
195;122;29062021124916
196;121;29062021124916
197;122;29062021124916
198;122;29062021124916
199;121;29062021124916
200;0;29062021124916
0;0;29062021124917
1;141;29062021124917
2;143;29062021124917
3;141;29062021124917
4;143;29062021124917
5;146;29062021124917
6;144;29062021124917
7;149;29062021124917
8;151;29062021124917
9;150;29062021124917
10;155;29062021124917
11;159;29062021124917
12;161;29062021124917
13;172;29062021124917
14;178;29062021124917
15;195;29062021124917
16;216;29062021124917
17;258;29062021124917
18;351;29062021124917
19;535;29062021124917
20;900;29062021124917
21;1023;29062021124917
22;1023;29062021124917
23;1023;29062021124917
24;1023;29062021124917
25;1015;29062021124917
26;950;29062021124917
27;956;29062021124917
28;1015;29062021124917
29;1023;29062021124917
30;1023;29062021124917
31;1023;29062021124917
32;1023;29062021124917
33;1023;29062021124917
34;1023;29062021124917
35;1023;29062021124917
36;1023;29062021124917
37;1023;29062021124917
38;1019;29062021124917
39;888;29062021124917
40;747;29062021124917
41;651;29062021124917
42;584;29062021124917
43;540;29062021124917
44;518;29062021124917
45;502;29062021124917
46;488;29062021124917
47;483;29062021124917
48;483;29062021124917
49;476;29062021124917
50;480;29062021124917
51;483;29062021124917
52;483;29062021124917
53;493;29062021124917
54;501;29062021124917
55;509;29062021124917
56;520;29062021124917
57;533;29062021124917
58;551;29062021124917
59;560;29062021124917
60;573;29062021124917
61;583;29062021124917
62;594;29062021124917
63;604;29062021124917
64;606;29062021124917
65;613;29062021124917
66;617;29062021124917
67;611;29062021124917
68;607;29062021124917
69;596;29062021124917
70;582;29062021124917
71;573;29062021124917
72;563;29062021124917
73;542;29062021124917
74;526;29062021124917
75;504;29062021124917
76;498;29062021124917
77;479;29062021124917
78;465;29062021124917
79;445;29062021124917
80;432;29062021124917
81;412;29062021124917
82;405;29062021124917
83;388;29062021124917
84;386;29062021124917
85;377;29062021124917
86;375;29062021124917
87;372;29062021124917
88;367;29062021124917
89;354;29062021124917
90;351;29062021124917
91;342;29062021124917
92;330;29062021124917
93;324;29062021124917
94;315;29062021124917
95;303;29062021124917
96;297;29062021124917
97;288;29062021124917
98;281;29062021124917
99;274;29062021124917
100;269;29062021124917
101;264;29062021124917
102;258;29062021124917
103;250;29062021124917
104;248;29062021124917
105;239;29062021124917
106;238;29062021124917
107;232;29062021124917
108;227;29062021124917
109;224;29062021124917
110;218;29062021124917
111;214;29062021124917
112;212;29062021124917
113;204;29062021124917
114;204;29062021124917
115;202;29062021124917
116;199;29062021124917
117;197;29062021124917
118;193;29062021124917
119;191;29062021124917
120;186;29062021124917
121;182;29062021124917
122;182;29062021124917
123;179;29062021124917
124;177;29062021124917
125;177;29062021124917
126;170;29062021124917
127;169;29062021124917
128;171;29062021124917
129;165;29062021124917
130;164;29062021124917
131;162;29062021124917
132;158;29062021124917
133;161;29062021124917
134;153;29062021124917
135;154;29062021124917
136;154;29062021124917
137;150;29062021124917
138;151;29062021124917
139;148;29062021124917
140;145;29062021124917
141;146;29062021124917
142;144;29062021124917
143;142;29062021124917
144;144;29062021124917
145;139;29062021124917
146;141;29062021124917
147;140;29062021124917
148;136;29062021124917
149;137;29062021124917
150;136;29062021124917
151;134;29062021124917
152;136;29062021124917
153;132;29062021124917
154;135;29062021124917
155;133;29062021124917
156;131;29062021124917
157;132;29062021124917
158;131;29062021124917
159;130;29062021124917
160;130;29062021124917
161;128;29062021124917
162;130;29062021124917
163;129;29062021124917
164;128;29062021124917
165;129;29062021124917
166;127;29062021124917
167;127;29062021124917
168;128;29062021124917
169;124;29062021124917
170;127;29062021124917
171;126;29062021124917
172;125;29062021124917
173;128;29062021124917
174;124;29062021124917
175;123;29062021124917
176;126;29062021124917
177;123;29062021124917
178;125;29062021124917
179;124;29062021124917
180;124;29062021124917
181;124;29062021124917
182;123;29062021124917
183;122;29062021124917
184;125;29062021124917
185;121;29062021124917
186;125;29062021124917
187;122;29062021124917
188;121;29062021124917
189;123;29062021124917
190;121;29062021124917
191;123;29062021124917
192;126;29062021124917
193;121;29062021124917
194;122;29062021124917
195;123;29062021124917
196;122;29062021124917
197;122;29062021124917
198;123;29062021124917
199;121;29062021124917
200;0;29062021124917
0;0;29062021124917
1;140;29062021124917
2;141;29062021124917
3;141;29062021124917
4;143;29062021124917
5;144;29062021124917
6;145;29062021124917
7;148;29062021124917
8;150;29062021124917
9;150;29062021124917
10;157;29062021124917
11;156;29062021124917
12;162;29062021124917
13;172;29062021124917
14;177;29062021124917
15;194;29062021124917
16;218;29062021124917
17;258;29062021124917
18;349;29062021124917
19;536;29062021124917
20;906;29062021124917
21;1023;29062021124917
22;1023;29062021124917
23;1023;29062021124917
24;1023;29062021124917
25;1019;29062021124917
26;958;29062021124917
27;961;29062021124917
28;1018;29062021124917
29;1023;29062021124917
30;1023;29062021124917
31;1023;29062021124917
32;1023;29062021124917
33;1023;29062021124917
34;1023;29062021124917
35;1023;29062021124917
36;1023;29062021124917
37;1023;29062021124917
38;1023;29062021124917
39;891;29062021124917
40;750;29062021124917
41;649;29062021124917
42;590;29062021124917
43;541;29062021124917
44;517;29062021124917
45;499;29062021124917
46;491;29062021124917
47;484;29062021124917
48;482;29062021124917
49;483;29062021124917
50;482;29062021124917
51;482;29062021124917
52;478;29062021124917
53;497;29062021124917
54;506;29062021124917
55;511;29062021124917
56;524;29062021124917
57;538;29062021124917
58;550;29062021124917
59;559;29062021124917
60;578;29062021124917
61;584;29062021124917
62;594;29062021124917
63;605;29062021124917
64;613;29062021124917
65;612;29062021124917
66;615;29062021124917
67;609;29062021124917
68;605;29062021124917
69;594;29062021124917
70;581;29062021124917
71;576;29062021124917
72;562;29062021124917
73;540;29062021124917
74;526;29062021124917
75;510;29062021124917
76;496;29062021124917
77;480;29062021124917
78;464;29062021124917
79;448;29062021124917
80;430;29062021124917
81;414;29062021124917
82;407;29062021124917
83;396;29062021124917
84;383;29062021124917
85;377;29062021124917
86;373;29062021124917
87;369;29062021124917
88;364;29062021124917
89;354;29062021124917
90;349;29062021124917
91;341;29062021124917
92;331;29062021124917
93;320;29062021124917
94;315;29062021124917
95;303;29062021124917
96;296;29062021124917
97;289;29062021124917
98;282;29062021124917
99;276;29062021124917
100;266;29062021124917
101;267;29062021124917
102;258;29062021124917
103;250;29062021124917
104;246;29062021124917
105;239;29062021124917
106;239;29062021124917
107;230;29062021124917
108;226;29062021124917
109;224;29062021124917
110;219;29062021124917
111;214;29062021124917
112;212;29062021124917
113;205;29062021124917
114;203;29062021124917
115;200;29062021124917
116;197;29062021124917
117;196;29062021124917
118;192;29062021124917
119;190;29062021124917
120;185;29062021124917
121;183;29062021124917
122;184;29062021124917
123;180;29062021124917
124;179;29062021124917
125;176;29062021124917
126;173;29062021124917
127;169;29062021124917
128;169;29062021124917
129;164;29062021124917
130;163;29062021124917
131;163;29062021124917
132;157;29062021124917
133;162;29062021124917
134;155;29062021124917
135;153;29062021124917
136;154;29062021124917
137;149;29062021124917
138;152;29062021124917
139;149;29062021124917
140;146;29062021124917
141;147;29062021124917
142;145;29062021124917
143;142;29062021124917
144;142;29062021124917
145;139;29062021124917
146;141;29062021124917
147;140;29062021124917
148;137;29062021124917
149;136;29062021124917
150;137;29062021124917
151;136;29062021124917
152;135;29062021124917
153;133;29062021124917
154;133;29062021124917
155;133;29062021124917
156;130;29062021124917
157;132;29062021124917
158;131;29062021124917
159;130;29062021124917
160;130;29062021124917
161;129;29062021124917
162;130;29062021124917
163;130;29062021124917
164;128;29062021124917
165;130;29062021124917
166;128;29062021124917
167;127;29062021124917
168;128;29062021124917
169;124;29062021124917
170;128;29062021124917
171;127;29062021124917
172;125;29062021124917
173;127;29062021124917
174;125;29062021124917
175;123;29062021124917
176;126;29062021124917
177;123;29062021124917
178;126;29062021124917
179;125;29062021124917
180;124;29062021124917
181;125;29062021124917
182;123;29062021124917
183;123;29062021124917
184;125;29062021124917
185;121;29062021124917
186;125;29062021124917
187;122;29062021124917
188;121;29062021124917
189;123;29062021124917
190;121;29062021124917
191;123;29062021124917
192;125;29062021124917
193;122;29062021124917
194;122;29062021124917
195;122;29062021124917
196;122;29062021124917
197;122;29062021124917
198;123;29062021124917
199;121;29062021124917
200;0;29062021124917
0;0;29062021124918
1;140;29062021124918
2;142;29062021124918
3;141;29062021124918
4;143;29062021124918
5;145;29062021124918
6;143;29062021124918
7;147;29062021124918
8;152;29062021124918
9;149;29062021124918
10;157;29062021124918
11;156;29062021124918
12;161;29062021124918
13;170;29062021124918
14;178;29062021124918
15;193;29062021124918
16;217;29062021124918
17;257;29062021124918
18;349;29062021124918
19;533;29062021124918
20;900;29062021124918
21;1023;29062021124918
22;1023;29062021124918
23;1023;29062021124918
24;1023;29062021124918
25;1014;29062021124918
26;953;29062021124918
27;956;29062021124918
28;1013;29062021124918
29;1023;29062021124918
30;1023;29062021124918
31;1023;29062021124918
32;1023;29062021124918
33;1023;29062021124918
34;1023;29062021124918
35;1023;29062021124918
36;1023;29062021124918
37;1023;29062021124918
38;1019;29062021124918
39;888;29062021124918
40;751;29062021124918
41;651;29062021124918
42;591;29062021124918
43;542;29062021124918
44;516;29062021124918
45;499;29062021124918
46;487;29062021124918
47;483;29062021124918
48;482;29062021124918
49;478;29062021124918
50;480;29062021124918
51;487;29062021124918
52;483;29062021124918
53;499;29062021124918
54;501;29062021124918
55;508;29062021124918
56;520;29062021124918
57;533;29062021124918
58;548;29062021124918
59;560;29062021124918
60;573;29062021124918
61;588;29062021124918
62;593;29062021124918
63;609;29062021124918
64;614;29062021124918
65;612;29062021124918
66;611;29062021124918
67;611;29062021124918
68;601;29062021124918
69;596;29062021124918
70;580;29062021124918
71;572;29062021124918
72;559;29062021124918
73;540;29062021124918
74;531;29062021124918
75;510;29062021124918
76;492;29062021124918
77;480;29062021124918
78;463;29062021124918
79;451;29062021124918
80;433;29062021124918
81;414;29062021124918
82;406;29062021124918
83;392;29062021124918
84;384;29062021124918
85;378;29062021124918
86;375;29062021124918
87;370;29062021124918
88;363;29062021124918
89;353;29062021124918
90;347;29062021124918
91;341;29062021124918
92;329;29062021124918
93;322;29062021124918
94;314;29062021124918
95;303;29062021124918
96;296;29062021124918
97;290;29062021124918
98;278;29062021124918
99;274;29062021124918
100;267;29062021124918
101;265;29062021124918
102;255;29062021124918
103;250;29062021124918
104;248;29062021124918
105;239;29062021124918
106;239;29062021124918
107;230;29062021124918
108;228;29062021124918
109;224;29062021124918
110;216;29062021124918
111;214;29062021124918
112;212;29062021124918
113;207;29062021124918
114;203;29062021124918
115;202;29062021124918
116;196;29062021124918
117;197;29062021124918
118;190;29062021124918
119;189;29062021124918
120;187;29062021124918
121;182;29062021124918
122;182;29062021124918
123;180;29062021124918
124;176;29062021124918
125;176;29062021124918
126;169;29062021124918
127;169;29062021124918
128;169;29062021124918
129;164;29062021124918
130;163;29062021124918
131;160;29062021124918
132;158;29062021124918
133;160;29062021124918
134;155;29062021124918
135;154;29062021124918
136;154;29062021124918
137;149;29062021124918
138;150;29062021124918
139;147;29062021124918
140;146;29062021124918
141;146;29062021124918
142;143;29062021124918
143;142;29062021124918
144;142;29062021124918
145;139;29062021124918
146;142;29062021124918
147;141;29062021124918
148;138;29062021124918
149;138;29062021124918
150;136;29062021124918
151;136;29062021124918
152;134;29062021124918
153;134;29062021124918
154;135;29062021124918
155;132;29062021124918
156;132;29062021124918
157;131;29062021124918
158;131;29062021124918
159;130;29062021124918
160;131;29062021124918
161;129;29062021124918
162;131;29062021124918
163;129;29062021124918
164;128;29062021124918
165;130;29062021124918
166;127;29062021124918
167;127;29062021124918
168;128;29062021124918
169;124;29062021124918
170;128;29062021124918
171;125;29062021124918
172;125;29062021124918
173;126;29062021124918
174;124;29062021124918
175;123;29062021124918
176;126;29062021124918
177;123;29062021124918
178;126;29062021124918
179;124;29062021124918
180;123;29062021124918
181;124;29062021124918
182;124;29062021124918
183;123;29062021124918
184;124;29062021124918
185;121;29062021124918
186;124;29062021124918
187;124;29062021124918
188;121;29062021124918
189;123;29062021124918
190;121;29062021124918
191;122;29062021124918
192;124;29062021124918
193;122;29062021124918
194;122;29062021124918
195;122;29062021124918
196;121;29062021124918
197;123;29062021124918
198;122;29062021124918
199;120;29062021124918
200;0;29062021124918
0;0;29062021124918
1;141;29062021124918
2;141;29062021124918
3;141;29062021124918
4;142;29062021124918
5;144;29062021124918
6;143;29062021124918
7;148;29062021124918
8;150;29062021124918
9;151;29062021124918
10;157;29062021124918
11;159;29062021124918
12;162;29062021124918
13;172;29062021124918
14;177;29062021124918
15;194;29062021124918
16;220;29062021124918
17;260;29062021124918
18;350;29062021124918
19;533;29062021124918
20;899;29062021124918
21;1023;29062021124918
22;1023;29062021124918
23;1023;29062021124918
24;1023;29062021124918
25;1015;29062021124918
26;952;29062021124918
27;956;29062021124918
28;1014;29062021124918
29;1023;29062021124918
30;1023;29062021124918
31;1023;29062021124918
32;1023;29062021124918
33;1023;29062021124918
34;1023;29062021124918
35;1023;29062021124918
36;1023;29062021124918
37;1023;29062021124918
38;1022;29062021124918
39;892;29062021124918
40;750;29062021124918
41;648;29062021124918
42;590;29062021124918
43;540;29062021124918
44;516;29062021124918
45;497;29062021124918
46;490;29062021124918
47;480;29062021124918
48;481;29062021124918
49;476;29062021124918
50;480;29062021124918
51;483;29062021124918
52;481;29062021124918
53;495;29062021124918
54;500;29062021124918
55;509;29062021124918
56;523;29062021124918
57;531;29062021124918
58;547;29062021124918
59;560;29062021124918
60;569;29062021124918
61;588;29062021124918
62;589;29062021124918
63;608;29062021124918
64;612;29062021124918
65;611;29062021124918
66;607;29062021124918
67;604;29062021124918
68;604;29062021124918
69;593;29062021124918
70;582;29062021124918
71;572;29062021124918
72;564;29062021124918
73;543;29062021124918
74;531;29062021124918
75;511;29062021124918
76;494;29062021124918
77;481;29062021124918
78;463;29062021124918
79;449;29062021124918
80;430;29062021124918
81;412;29062021124918
82;407;29062021124918
83;394;29062021124918
84;384;29062021124918
85;380;29062021124918
86;374;29062021124918
87;370;29062021124918
88;366;29062021124918
89;356;29062021124918
90;349;29062021124918
91;338;29062021124918
92;330;29062021124918
93;322;29062021124918
94;316;29062021124918
95;301;29062021124918
96;297;29062021124918
97;287;29062021124918
98;278;29062021124918
99;275;29062021124918
100;267;29062021124918
101;268;29062021124918
102;257;29062021124918
103;253;29062021124918
104;247;29062021124918
105;242;29062021124918
106;240;29062021124918
107;230;29062021124918
108;226;29062021124918
109;223;29062021124918
110;217;29062021124918
111;213;29062021124918
112;211;29062021124918
113;204;29062021124918
114;203;29062021124918
115;202;29062021124918
116;196;29062021124918
117;198;29062021124918
118;189;29062021124918
119;190;29062021124918
120;188;29062021124918
121;181;29062021124918
122;183;29062021124918
123;178;29062021124918
124;175;29062021124918
125;175;29062021124918
126;171;29062021124918
127;168;29062021124918
128;168;29062021124918
129;164;29062021124918
130;164;29062021124918
131;161;29062021124918
132;157;29062021124918
133;160;29062021124918
134;153;29062021124918
135;152;29062021124918
136;154;29062021124918
137;150;29062021124918
138;151;29062021124918
139;149;29062021124918
140;146;29062021124918
141;146;29062021124918
142;144;29062021124918
143;140;29062021124918
144;144;29062021124918
145;140;29062021124918
146;140;29062021124918
147;139;29062021124918
148;137;29062021124918
149;137;29062021124918
150;137;29062021124918
151;136;29062021124918
152;135;29062021124918
153;133;29062021124918
154;134;29062021124918
155;133;29062021124918
156;132;29062021124918
157;132;29062021124918
158;130;29062021124918
159;130;29062021124918
160;131;29062021124918
161;128;29062021124918
162;130;29062021124918
163;128;29062021124918
164;128;29062021124918
165;129;29062021124918
166;127;29062021124918
167;127;29062021124918
168;128;29062021124918
169;124;29062021124918
170;127;29062021124918
171;126;29062021124918
172;125;29062021124918
173;127;29062021124918
174;124;29062021124918
175;124;29062021124918
176;125;29062021124918
177;123;29062021124918
178;126;29062021124918
179;124;29062021124918
180;124;29062021124918
181;124;29062021124918
182;124;29062021124918
183;122;29062021124918
184;124;29062021124918
185;121;29062021124918
186;123;29062021124918
187;124;29062021124918
188;121;29062021124918
189;123;29062021124918
190;121;29062021124918
191;122;29062021124918
192;125;29062021124918
193;121;29062021124918
194;122;29062021124918
195;121;29062021124918
196;121;29062021124918
197;121;29062021124918
198;123;29062021124918
199;122;29062021124918
200;0;29062021124918
