ind;val;datetime
0;0;18062021131012
1;163;18062021131012
2;174;18062021131012
3;163;18062021131012
4;169;18062021131012
5;164;18062021131012
6;167;18062021131012
7;172;18062021131012
8;174;18062021131012
9;166;18062021131012
10;173;18062021131012
11;172;18062021131012
12;169;18062021131012
13;174;18062021131012
14;172;18062021131012
15;180;18062021131012
16;181;18062021131012
17;185;18062021131012
18;203;18062021131012
19;241;18062021131012
20;313;18062021131012
21;499;18062021131012
22;956;18062021131012
23;1023;18062021131012
24;1023;18062021131012
25;1023;18062021131012
26;1023;18062021131012
27;1023;18062021131012
28;1023;18062021131012
29;1023;18062021131012
30;1023;18062021131012
31;1023;18062021131012
32;1023;18062021131012
33;961;18062021131012
34;818;18062021131012
35;733;18062021131012
36;683;18062021131012
37;680;18062021131012
38;688;18062021131012
39;713;18062021131012
40;732;18062021131012
41;755;18062021131012
42;788;18062021131012
43;816;18062021131012
44;838;18062021131012
45;872;18062021131012
46;881;18062021131012
47;893;18062021131012
48;899;18062021131012
49;906;18062021131012
50;909;18062021131012
51;930;18062021131012
52;930;18062021131012
53;951;18062021131012
54;961;18062021131012
55;978;18062021131012
56;1000;18062021131012
57;1019;18062021131012
58;1023;18062021131012
59;1023;18062021131012
60;1023;18062021131012
61;1023;18062021131012
62;1023;18062021131012
63;1023;18062021131012
64;1023;18062021131012
65;1023;18062021131012
66;1023;18062021131012
67;1023;18062021131012
68;1023;18062021131012
69;1023;18062021131012
70;1023;18062021131012
71;1018;18062021131012
72;999;18062021131012
73;963;18062021131012
74;931;18062021131012
75;890;18062021131012
76;863;18062021131012
77;833;18062021131012
78;798;18062021131012
79;777;18062021131012
80;737;18062021131012
81;697;18062021131012
82;686;18062021131012
83;663;18062021131012
84;643;18062021131012
85;628;18062021131012
86;635;18062021131012
87;623;18062021131012
88;600;18062021131012
89;580;18062021131012
90;577;18062021131012
91;555;18062021131012
92;533;18062021131012
93;524;18062021131012
94;508;18062021131012
95;482;18062021131012
96;471;18062021131012
97;454;18062021131012
98;436;18062021131012
99;428;18062021131012
100;413;18062021131012
101;416;18062021131012
102;404;18062021131012
103;386;18062021131012
104;377;18062021131012
105;363;18062021131012
106;357;18062021131012
107;347;18062021131012
108;340;18062021131012
109;332;18062021131012
110;319;18062021131012
111;314;18062021131012
112;307;18062021131012
113;298;18062021131012
114;294;18062021131012
115;292;18062021131012
116;287;18062021131012
117;284;18062021131012
118;275;18062021131012
119;277;18062021131012
120;264;18062021131012
121;256;18062021131012
122;258;18062021131012
123;252;18062021131012
124;249;18062021131012
125;241;18062021131012
126;234;18062021131012
127;239;18062021131012
128;238;18062021131012
129;232;18062021131012
130;228;18062021131012
131;222;18062021131012
132;216;18062021131012
133;230;18062021131012
134;210;18062021131012
135;212;18062021131012
136;211;18062021131012
137;207;18062021131012
138;213;18062021131012
139;199;18062021131012
140;204;18062021131012
141;202;18062021131012
142;196;18062021131012
143;192;18062021131012
144;195;18062021131012
145;191;18062021131012
146;190;18062021131012
147;196;18062021131012
148;187;18062021131012
149;189;18062021131012
150;191;18062021131012
151;187;18062021131012
152;180;18062021131012
153;178;18062021131012
154;181;18062021131012
155;188;18062021131012
156;179;18062021131012
157;177;18062021131012
158;175;18062021131012
159;172;18062021131012
160;171;18062021131012
161;173;18062021131012
162;173;18062021131012
163;174;18062021131012
164;173;18062021131012
165;174;18062021131012
166;168;18062021131012
167;172;18062021131012
168;175;18062021131012
169;163;18062021131012
170;172;18062021131012
171;166;18062021131012
172;165;18062021131012
173;174;18062021131012
174;165;18062021131012
175;166;18062021131012
176;168;18062021131012
177;162;18062021131012
178;171;18062021131012
179;167;18062021131012
180;164;18062021131012
181;163;18062021131012
182;172;18062021131012
183;164;18062021131012
184;165;18062021131012
185;159;18062021131012
186;168;18062021131012
187;162;18062021131012
188;163;18062021131012
189;167;18062021131012
190;161;18062021131012
191;170;18062021131012
192;169;18062021131012
193;161;18062021131012
194;171;18062021131012
195;164;18062021131012
196;162;18062021131012
197;160;18062021131012
198;164;18062021131012
199;160;18062021131012
200;0;18062021131012
0;0;18062021131013
1;162;18062021131013
2;173;18062021131013
3;164;18062021131013
4;168;18062021131013
5;163;18062021131013
6;167;18062021131013
7;171;18062021131013
8;172;18062021131013
9;164;18062021131013
10;171;18062021131013
11;172;18062021131013
12;169;18062021131013
13;174;18062021131013
14;172;18062021131013
15;178;18062021131013
16;180;18062021131013
17;183;18062021131013
18;205;18062021131013
19;240;18062021131013
20;311;18062021131013
21;498;18062021131013
22;965;18062021131013
23;1023;18062021131013
24;1023;18062021131013
25;1023;18062021131013
26;1023;18062021131013
27;1023;18062021131013
28;1023;18062021131013
29;1023;18062021131013
30;1023;18062021131013
31;1023;18062021131013
32;1023;18062021131013
33;979;18062021131013
34;840;18062021131013
35;749;18062021131013
36;699;18062021131013
37;688;18062021131013
38;695;18062021131013
39;721;18062021131013
40;740;18062021131013
41;768;18062021131013
42;799;18062021131013
43;824;18062021131013
44;851;18062021131013
45;883;18062021131013
46;895;18062021131013
47;898;18062021131013
48;904;18062021131013
49;913;18062021131013
50;914;18062021131013
51;934;18062021131013
52;939;18062021131013
53;957;18062021131013
54;977;18062021131013
55;989;18062021131013
56;1013;18062021131013
57;1023;18062021131013
58;1023;18062021131013
59;1023;18062021131013
60;1023;18062021131013
61;1023;18062021131013
62;1023;18062021131013
63;1023;18062021131013
64;1023;18062021131013
65;1023;18062021131013
66;1023;18062021131013
67;1023;18062021131013
68;1023;18062021131013
69;1023;18062021131013
70;1023;18062021131013
71;1023;18062021131013
72;1013;18062021131013
73;973;18062021131013
74;944;18062021131013
75;901;18062021131013
76;872;18062021131013
77;844;18062021131013
78;815;18062021131013
79;791;18062021131013
80;742;18062021131013
81;710;18062021131013
82;698;18062021131013
83;671;18062021131013
84;653;18062021131013
85;642;18062021131013
86;639;18062021131013
87;627;18062021131013
88;603;18062021131013
89;591;18062021131013
90;583;18062021131013
91;568;18062021131013
92;543;18062021131013
93;537;18062021131013
94;513;18062021131013
95;492;18062021131013
96;479;18062021131013
97;458;18062021131013
98;442;18062021131013
99;434;18062021131013
100;418;18062021131013
101;422;18062021131013
102;409;18062021131013
103;388;18062021131013
104;380;18062021131013
105;368;18062021131013
106;361;18062021131013
107;350;18062021131013
108;348;18062021131013
109;335;18062021131013
110;324;18062021131013
111;319;18062021131013
112;309;18062021131013
113;300;18062021131013
114;296;18062021131013
115;293;18062021131013
116;289;18062021131013
117;285;18062021131013
118;275;18062021131013
119;275;18062021131013
120;268;18062021131013
121;261;18062021131013
122;257;18062021131013
123;252;18062021131013
124;255;18062021131013
125;242;18062021131013
126;239;18062021131013
127;242;18062021131013
128;242;18062021131013
129;233;18062021131013
130;228;18062021131013
131;222;18062021131013
132;218;18062021131013
133;230;18062021131013
134;216;18062021131013
135;211;18062021131013
136;210;18062021131013
137;206;18062021131013
138;210;18062021131013
139;201;18062021131013
140;203;18062021131013
141;205;18062021131013
142;196;18062021131013
143;189;18062021131013
144;197;18062021131013
145;191;18062021131013
146;189;18062021131013
147;195;18062021131013
148;186;18062021131013
149;186;18062021131013
150;190;18062021131013
151;186;18062021131013
152;179;18062021131013
153;177;18062021131013
154;181;18062021131013
155;187;18062021131013
156;180;18062021131013
157;176;18062021131013
158;174;18062021131013
159;170;18062021131013
160;170;18062021131013
161;170;18062021131013
162;173;18062021131013
163;174;18062021131013
164;175;18062021131013
165;173;18062021131013
166;168;18062021131013
167;172;18062021131013
168;176;18062021131013
169;163;18062021131013
170;170;18062021131013
171;166;18062021131013
172;165;18062021131013
173;171;18062021131013
174;163;18062021131013
175;164;18062021131013
176;168;18062021131013
177;162;18062021131013
178;171;18062021131013
179;167;18062021131013
180;163;18062021131013
181;162;18062021131013
182;171;18062021131013
183;162;18062021131013
184;163;18062021131013
185;158;18062021131013
186;166;18062021131013
187;163;18062021131013
188;163;18062021131013
189;166;18062021131013
190;160;18062021131013
191;168;18062021131013
192;166;18062021131013
193;159;18062021131013
194;170;18062021131013
195;162;18062021131013
196;160;18062021131013
197;160;18062021131013
198;163;18062021131013
199;158;18062021131013
200;0;18062021131013
0;0;18062021131014
1;163;18062021131014
2;174;18062021131014
3;164;18062021131014
4;169;18062021131014
5;166;18062021131014
6;167;18062021131014
7;172;18062021131014
8;172;18062021131014
9;164;18062021131014
10;171;18062021131014
11;172;18062021131014
12;169;18062021131014
13;176;18062021131014
14;174;18062021131014
15;180;18062021131014
16;181;18062021131014
17;185;18062021131014
18;205;18062021131014
19;240;18062021131014
20;312;18062021131014
21;493;18062021131014
22;961;18062021131014
23;1023;18062021131014
24;1023;18062021131014
25;1023;18062021131014
26;1023;18062021131014
27;1023;18062021131014
28;1023;18062021131014
29;1023;18062021131014
30;1023;18062021131014
31;1023;18062021131014
32;1023;18062021131014
33;993;18062021131014
34;841;18062021131014
35;758;18062021131014
36;704;18062021131014
37;699;18062021131014
38;702;18062021131014
39;723;18062021131014
40;744;18062021131014
41;772;18062021131014
42;806;18062021131014
43;824;18062021131014
44;856;18062021131014
45;885;18062021131014
46;899;18062021131014
47;907;18062021131014
48;912;18062021131014
49;919;18062021131014
50;924;18062021131014
51;943;18062021131014
52;942;18062021131014
53;968;18062021131014
54;982;18062021131014
55;993;18062021131014
56;1015;18062021131014
57;1023;18062021131014
58;1023;18062021131014
59;1023;18062021131014
60;1023;18062021131014
61;1023;18062021131014
62;1023;18062021131014
63;1023;18062021131014
64;1023;18062021131014
65;1023;18062021131014
66;1023;18062021131014
67;1023;18062021131014
68;1023;18062021131014
69;1023;18062021131014
70;1023;18062021131014
71;1023;18062021131014
72;1021;18062021131014
73;982;18062021131014
74;952;18062021131014
75;911;18062021131014
76;878;18062021131014
77;847;18062021131014
78;819;18062021131014
79;795;18062021131014
80;752;18062021131014
81;717;18062021131014
82;697;18062021131014
83;672;18062021131014
84;659;18062021131014
85;643;18062021131014
86;641;18062021131014
87;631;18062021131014
88;612;18062021131014
89;596;18062021131014
90;590;18062021131014
91;566;18062021131014
92;548;18062021131014
93;538;18062021131014
94;517;18062021131014
95;493;18062021131014
96;476;18062021131014
97;462;18062021131014
98;447;18062021131014
99;439;18062021131014
100;418;18062021131014
101;427;18062021131014
102;413;18062021131014
103;392;18062021131014
104;384;18062021131014
105;372;18062021131014
106;361;18062021131014
107;352;18062021131014
108;351;18062021131014
109;337;18062021131014
110;326;18062021131014
111;317;18062021131014
112;312;18062021131014
113;304;18062021131014
114;299;18062021131014
115;296;18062021131014
116;288;18062021131014
117;284;18062021131014
118;279;18062021131014
119;278;18062021131014
120;269;18062021131014
121;264;18062021131014
122;260;18062021131014
123;254;18062021131014
124;253;18062021131014
125;246;18062021131014
126;239;18062021131014
127;243;18062021131014
128;243;18062021131014
129;235;18062021131014
130;231;18062021131014
131;225;18062021131014
132;216;18062021131014
133;234;18062021131014
134;213;18062021131014
135;213;18062021131014
136;213;18062021131014
137;206;18062021131014
138;211;18062021131014
139;205;18062021131014
140;204;18062021131014
141;204;18062021131014
142;198;18062021131014
143;190;18062021131014
144;198;18062021131014
145;193;18062021131014
146;192;18062021131014
147;196;18062021131014
148;185;18062021131014
149;189;18062021131014
150;189;18062021131014
151;188;18062021131014
152;181;18062021131014
153;181;18062021131014
154;182;18062021131014
155;186;18062021131014
156;180;18062021131014
157;177;18062021131014
158;173;18062021131014
159;172;18062021131014
160;171;18062021131014
161;171;18062021131014
162;173;18062021131014
163;173;18062021131014
164;173;18062021131014
165;175;18062021131014
166;167;18062021131014
167;174;18062021131014
168;175;18062021131014
169;163;18062021131014
170;171;18062021131014
171;166;18062021131014
172;164;18062021131014
173;173;18062021131014
174;165;18062021131014
175;164;18062021131014
176;167;18062021131014
177;161;18062021131014
178;172;18062021131014
179;169;18062021131014
180;164;18062021131014
181;164;18062021131014
182;170;18062021131014
183;162;18062021131014
184;163;18062021131014
185;158;18062021131014
186;166;18062021131014
187;163;18062021131014
188;164;18062021131014
189;167;18062021131014
190;159;18062021131014
191;167;18062021131014
192;166;18062021131014
193;159;18062021131014
194;170;18062021131014
195;162;18062021131014
196;161;18062021131014
197;160;18062021131014
198;165;18062021131014
199;160;18062021131014
200;0;18062021131014
0;0;18062021131015
1;162;18062021131015
2;175;18062021131015
3;162;18062021131015
4;169;18062021131015
5;165;18062021131015
6;166;18062021131015
7;173;18062021131015
8;174;18062021131015
9;164;18062021131015
10;172;18062021131015
11;173;18062021131015
12;169;18062021131015
13;175;18062021131015
14;172;18062021131015
15;179;18062021131015
16;179;18062021131015
17;186;18062021131015
18;206;18062021131015
19;242;18062021131015
20;311;18062021131015
21;489;18062021131015
22;949;18062021131015
23;1023;18062021131015
24;1023;18062021131015
25;1023;18062021131015
26;1023;18062021131015
27;1023;18062021131015
28;1023;18062021131015
29;1023;18062021131015
30;1023;18062021131015
31;1023;18062021131015
32;1023;18062021131015
33;996;18062021131015
34;845;18062021131015
35;761;18062021131015
36;702;18062021131015
37;697;18062021131015
38;701;18062021131015
39;719;18062021131015
40;741;18062021131015
41;769;18062021131015
42;804;18062021131015
43;823;18062021131015
44;850;18062021131015
45;878;18062021131015
46;891;18062021131015
47;903;18062021131015
48;911;18062021131015
49;921;18062021131015
50;921;18062021131015
51;935;18062021131015
52;939;18062021131015
53;962;18062021131015
54;975;18062021131015
55;993;18062021131015
56;1012;18062021131015
57;1023;18062021131015
58;1023;18062021131015
59;1023;18062021131015
60;1023;18062021131015
61;1023;18062021131015
62;1023;18062021131015
63;1023;18062021131015
64;1023;18062021131015
65;1023;18062021131015
66;1023;18062021131015
67;1023;18062021131015
68;1023;18062021131015
69;1023;18062021131015
70;1023;18062021131015
71;1023;18062021131015
72;1012;18062021131015
73;977;18062021131015
74;946;18062021131015
75;904;18062021131015
76;877;18062021131015
77;848;18062021131015
78;817;18062021131015
79;784;18062021131015
80;754;18062021131015
81;713;18062021131015
82;696;18062021131015
83;672;18062021131015
84;657;18062021131015
85;644;18062021131015
86;635;18062021131015
87;633;18062021131015
88;612;18062021131015
89;591;18062021131015
90;593;18062021131015
91;564;18062021131015
92;544;18062021131015
93;536;18062021131015
94;517;18062021131015
95;491;18062021131015
96;477;18062021131015
97;461;18062021131015
98;445;18062021131015
99;436;18062021131015
100;417;18062021131015
101;423;18062021131015
102;406;18062021131015
103;390;18062021131015
104;384;18062021131015
105;369;18062021131015
106;363;18062021131015
107;353;18062021131015
108;346;18062021131015
109;338;18062021131015
110;327;18062021131015
111;316;18062021131015
112;314;18062021131015
113;303;18062021131015
114;294;18062021131015
115;297;18062021131015
116;288;18062021131015
117;287;18062021131015
118;279;18062021131015
119;278;18062021131015
120;271;18062021131015
121;262;18062021131015
122;259;18062021131015
123;252;18062021131015
124;255;18062021131015
125;245;18062021131015
126;238;18062021131015
127;243;18062021131015
128;244;18062021131015
129;236;18062021131015
130;230;18062021131015
131;226;18062021131015
132;219;18062021131015
133;233;18062021131015
134;214;18062021131015
135;214;18062021131015
136;208;18062021131015
137;208;18062021131015
138;212;18062021131015
139;204;18062021131015
140;203;18062021131015
141;204;18062021131015
142;199;18062021131015
143;190;18062021131015
144;197;18062021131015
145;193;18062021131015
146;192;18062021131015
147;197;18062021131015
148;186;18062021131015
149;189;18062021131015
150;189;18062021131015
151;187;18062021131015
152;179;18062021131015
153;178;18062021131015
154;181;18062021131015
155;187;18062021131015
156;179;18062021131015
157;175;18062021131015
158;175;18062021131015
159;172;18062021131015
160;171;18062021131015
161;173;18062021131015
162;171;18062021131015
163;175;18062021131015
164;176;18062021131015
165;173;18062021131015
166;167;18062021131015
167;173;18062021131015
168;175;18062021131015
169;164;18062021131015
170;170;18062021131015
171;166;18062021131015
172;166;18062021131015
173;174;18062021131015
174;164;18062021131015
175;166;18062021131015
176;168;18062021131015
177;163;18062021131015
178;171;18062021131015
179;169;18062021131015
180;165;18062021131015
181;164;18062021131015
182;172;18062021131015
183;162;18062021131015
184;166;18062021131015
185;157;18062021131015
186;166;18062021131015
187;163;18062021131015
188;165;18062021131015
189;167;18062021131015
190;161;18062021131015
191;169;18062021131015
192;167;18062021131015
193;160;18062021131015
194;171;18062021131015
195;163;18062021131015
196;161;18062021131015
197;160;18062021131015
198;164;18062021131015
199;160;18062021131015
200;0;18062021131015
0;0;18062021131015
1;162;18062021131015
2;171;18062021131015
3;163;18062021131015
4;167;18062021131015
5;163;18062021131015
6;166;18062021131015
7;171;18062021131015
8;171;18062021131015
9;165;18062021131015
10;171;18062021131015
11;172;18062021131015
12;166;18062021131015
13;174;18062021131015
14;172;18062021131015
15;177;18062021131015
16;180;18062021131015
17;181;18062021131015
18;204;18062021131015
19;237;18062021131015
20;306;18062021131015
21;486;18062021131015
22;934;18062021131015
23;1023;18062021131015
24;1023;18062021131015
25;1023;18062021131015
26;1023;18062021131015
27;1023;18062021131015
28;1023;18062021131015
29;1023;18062021131015
30;1023;18062021131015
31;1023;18062021131015
32;1023;18062021131015
33;988;18062021131015
34;842;18062021131015
35;751;18062021131015
36;702;18062021131015
37;693;18062021131015
38;693;18062021131015
39;719;18062021131015
40;732;18062021131015
41;761;18062021131015
42;795;18062021131015
43;810;18062021131015
44;843;18062021131015
45;875;18062021131015
46;885;18062021131015
47;891;18062021131015
48;905;18062021131015
49;914;18062021131015
50;916;18062021131015
51;929;18062021131015
52;932;18062021131015
53;958;18062021131015
54;967;18062021131015
55;989;18062021131015
56;1003;18062021131015
57;1023;18062021131015
58;1023;18062021131015
59;1023;18062021131015
60;1023;18062021131015
61;1023;18062021131015
62;1023;18062021131015
63;1023;18062021131015
64;1023;18062021131015
65;1023;18062021131015
66;1023;18062021131015
67;1023;18062021131015
68;1023;18062021131015
69;1023;18062021131015
70;1023;18062021131015
71;1023;18062021131015
72;1009;18062021131015
73;975;18062021131015
74;942;18062021131015
75;898;18062021131015
76;877;18062021131015
77;843;18062021131015
78;809;18062021131015
79;786;18062021131015
80;742;18062021131015
81;709;18062021131015
82;691;18062021131015
83;669;18062021131015
84;657;18062021131015
85;632;18062021131015
86;635;18062021131015
87;623;18062021131015
88;605;18062021131015
89;588;18062021131015
90;582;18062021131015
91;561;18062021131015
92;540;18062021131015
93;539;18062021131015
94;511;18062021131015
95;488;18062021131015
96;476;18062021131015
97;458;18062021131015
98;440;18062021131015
99;432;18062021131015
100;419;18062021131015
101;424;18062021131015
102;408;18062021131015
103;386;18062021131015
104;377;18062021131015
105;371;18062021131015
106;359;18062021131015
107;351;18062021131015
108;343;18062021131015
109;335;18062021131015
110;325;18062021131015
111;315;18062021131015
112;308;18062021131015
113;299;18062021131015
114;296;18062021131015
115;295;18062021131015
116;288;18062021131015
117;286;18062021131015
118;277;18062021131015
119;279;18062021131015
120;267;18062021131015
121;259;18062021131015
122;257;18062021131015
123;253;18062021131015
124;254;18062021131015
125;242;18062021131015
126;236;18062021131015
127;241;18062021131015
128;242;18062021131015
129;233;18062021131015
130;227;18062021131015
131;224;18062021131015
132;215;18062021131015
133;231;18062021131015
134;212;18062021131015
135;212;18062021131015
136;211;18062021131015
137;205;18062021131015
138;209;18062021131015
139;200;18062021131015
140;201;18062021131015
141;201;18062021131015
142;198;18062021131015
143;189;18062021131015
144;197;18062021131015
145;190;18062021131015
146;191;18062021131015
147;195;18062021131015
148;186;18062021131015
149;186;18062021131015
150;188;18062021131015
151;186;18062021131015
152;179;18062021131015
153;179;18062021131015
154;181;18062021131015
155;184;18062021131015
156;179;18062021131015
157;175;18062021131015
158;172;18062021131015
159;170;18062021131015
160;170;18062021131015
161;172;18062021131015
162;173;18062021131015
163;175;18062021131015
164;174;18062021131015
165;173;18062021131015
166;167;18062021131015
167;172;18062021131015
168;175;18062021131015
169;162;18062021131015
170;170;18062021131015
171;166;18062021131015
172;163;18062021131015
173;172;18062021131015
174;164;18062021131015
175;163;18062021131015
176;166;18062021131015
177;162;18062021131015
178;171;18062021131015
179;167;18062021131015
180;164;18062021131015
181;163;18062021131015
182;169;18062021131015
183;163;18062021131015
184;164;18062021131015
185;156;18062021131015
186;166;18062021131015
187;161;18062021131015
188;163;18062021131015
189;167;18062021131015
190;159;18062021131015
191;167;18062021131015
192;165;18062021131015
193;160;18062021131015
194;170;18062021131015
195;162;18062021131015
196;161;18062021131015
197;159;18062021131015
198;162;18062021131015
199;158;18062021131015
200;0;18062021131015
0;0;18062021131016
1;161;18062021131016
2;171;18062021131016
3;162;18062021131016
4;167;18062021131016
5;163;18062021131016
6;167;18062021131016
7;173;18062021131016
8;173;18062021131016
9;164;18062021131016
10;171;18062021131016
11;171;18062021131016
12;168;18062021131016
13;175;18062021131016
14;172;18062021131016
15;178;18062021131016
16;178;18062021131016
17;181;18062021131016
18;204;18062021131016
19;242;18062021131016
20;307;18062021131016
21;487;18062021131016
22;935;18062021131016
23;1023;18062021131016
24;1023;18062021131016
25;1023;18062021131016
26;1023;18062021131016
27;1023;18062021131016
28;1023;18062021131016
29;1023;18062021131016
30;1023;18062021131016
31;1023;18062021131016
32;1023;18062021131016
33;988;18062021131016
34;851;18062021131016
35;755;18062021131016
36;703;18062021131016
37;687;18062021131016
38;695;18062021131016
39;719;18062021131016
40;740;18062021131016
41;767;18062021131016
42;799;18062021131016
43;821;18062021131016
44;844;18062021131016
45;874;18062021131016
46;887;18062021131016
47;896;18062021131016
48;901;18062021131016
49;908;18062021131016
50;914;18062021131016
51;927;18062021131016
52;932;18062021131016
53;957;18062021131016
54;967;18062021131016
55;990;18062021131016
56;1008;18062021131016
57;1023;18062021131016
58;1023;18062021131016
59;1023;18062021131016
60;1023;18062021131016
61;1023;18062021131016
62;1023;18062021131016
63;1023;18062021131016
64;1023;18062021131016
65;1023;18062021131016
66;1023;18062021131016
67;1023;18062021131016
68;1023;18062021131016
69;1023;18062021131016
70;1023;18062021131016
71;1023;18062021131016
72;1013;18062021131016
73;971;18062021131016
74;940;18062021131016
75;904;18062021131016
76;874;18062021131016
77;838;18062021131016
78;812;18062021131016
79;780;18062021131016
80;747;18062021131016
81;710;18062021131016
82;693;18062021131016
83;672;18062021131016
84;657;18062021131016
85;641;18062021131016
86;637;18062021131016
87;627;18062021131016
88;606;18062021131016
89;592;18062021131016
90;587;18062021131016
91;560;18062021131016
92;542;18062021131016
93;532;18062021131016
94;512;18062021131016
95;486;18062021131016
96;474;18062021131016
97;460;18062021131016
98;441;18062021131016
99;431;18062021131016
100;417;18062021131016
101;421;18062021131016
102;407;18062021131016
103;388;18062021131016
104;380;18062021131016
105;369;18062021131016
106;360;18062021131016
107;350;18062021131016
108;341;18062021131016
109;336;18062021131016
110;325;18062021131016
111;316;18062021131016
112;309;18062021131016
113;296;18062021131016
114;292;18062021131016
115;293;18062021131016
116;287;18062021131016
117;286;18062021131016
118;274;18062021131016
119;276;18062021131016
120;267;18062021131016
121;260;18062021131016
122;257;18062021131016
123;252;18062021131016
124;253;18062021131016
125;244;18062021131016
126;237;18062021131016
127;241;18062021131016
128;243;18062021131016
129;232;18062021131016
130;228;18062021131016
131;223;18062021131016
132;216;18062021131016
133;230;18062021131016
134;213;18062021131016
135;210;18062021131016
136;208;18062021131016
137;205;18062021131016
138;209;18062021131016
139;201;18062021131016
140;201;18062021131016
141;204;18062021131016
142;197;18062021131016
143;190;18062021131016
144;196;18062021131016
145;191;18062021131016
146;188;18062021131016
147;194;18062021131016
148;185;18062021131016
149;188;18062021131016
150;188;18062021131016
151;187;18062021131016
152;177;18062021131016
153;179;18062021131016
154;180;18062021131016
155;185;18062021131016
156;177;18062021131016
157;174;18062021131016
158;173;18062021131016
159;172;18062021131016
160;170;18062021131016
161;170;18062021131016
162;171;18062021131016
163;173;18062021131016
164;175;18062021131016
165;172;18062021131016
166;167;18062021131016
167;171;18062021131016
168;176;18062021131016
169;161;18062021131016
170;170;18062021131016
171;163;18062021131016
172;164;18062021131016
173;172;18062021131016
174;164;18062021131016
175;164;18062021131016
176;168;18062021131016
177;162;18062021131016
178;170;18062021131016
179;167;18062021131016
180;163;18062021131016
181;161;18062021131016
182;169;18062021131016
183;161;18062021131016
184;164;18062021131016
185;157;18062021131016
186;165;18062021131016
187;162;18062021131016
188;164;18062021131016
189;166;18062021131016
190;158;18062021131016
191;167;18062021131016
192;167;18062021131016
193;158;18062021131016
194;168;18062021131016
195;163;18062021131016
196;161;18062021131016
197;163;18062021131016
198;163;18062021131016
199;159;18062021131016
200;0;18062021131016
