ind;val;datetime
0;0;29062021164553
1;143;29062021164553
2;136;29062021164553
3;134;29062021164553
4;136;29062021164553
5;138;29062021164553
6;134;29062021164553
7;138;29062021164553
8;139;29062021164553
9;139;29062021164553
10;143;29062021164553
11;142;29062021164553
12;145;29062021164553
13;152;29062021164553
14;156;29062021164553
15;164;29062021164553
16;177;29062021164553
17;197;29062021164553
18;251;29062021164553
19;356;29062021164553
20;590;29062021164553
21;1023;29062021164553
22;1023;29062021164553
23;1023;29062021164553
24;1023;29062021164553
25;1023;29062021164553
26;1023;29062021164553
27;1023;29062021164553
28;1023;29062021164553
29;1023;29062021164553
30;1023;29062021164553
31;1023;29062021164553
32;1023;29062021164553
33;1023;29062021164553
34;1023;29062021164553
35;1023;29062021164553
36;1023;29062021164553
37;973;29062021164553
38;804;29062021164553
39;666;29062021164553
40;562;29062021164553
41;495;29062021164553
42;455;29062021164553
43;418;29062021164553
44;408;29062021164553
45;391;29062021164553
46;383;29062021164553
47;380;29062021164553
48;382;29062021164553
49;377;29062021164553
50;385;29062021164553
51;385;29062021164553
52;385;29062021164553
53;397;29062021164553
54;402;29062021164553
55;408;29062021164553
56;420;29062021164553
57;430;29062021164553
58;446;29062021164553
59;448;29062021164553
60;461;29062021164553
61;475;29062021164553
62;479;29062021164553
63;490;29062021164553
64;500;29062021164553
65;493;29062021164553
66;501;29062021164553
67;494;29062021164553
68;491;29062021164553
69;483;29062021164553
70;473;29062021164553
71;471;29062021164553
72;457;29062021164553
73;442;29062021164553
74;433;29062021164553
75;415;29062021164553
76;403;29062021164553
77;393;29062021164553
78;379;29062021164553
79;370;29062021164553
80;356;29062021164553
81;340;29062021164553
82;333;29062021164553
83;323;29062021164553
84;320;29062021164553
85;312;29062021164553
86;310;29062021164553
87;304;29062021164553
88;302;29062021164553
89;295;29062021164553
90;291;29062021164553
91;286;29062021164553
92;277;29062021164553
93;269;29062021164553
94;261;29062021164553
95;254;29062021164553
96;251;29062021164553
97;245;29062021164553
98;237;29062021164553
99;232;29062021164553
100;229;29062021164553
101;228;29062021164553
102;220;29062021164553
103;214;29062021164553
104;211;29062021164553
105;206;29062021164553
106;205;29062021164553
107;202;29062021164553
108;199;29062021164553
109;196;29062021164553
110;189;29062021164553
111;188;29062021164553
112;190;29062021164553
113;182;29062021164553
114;181;29062021164553
115;179;29062021164553
116;176;29062021164553
117;177;29062021164553
118;172;29062021164553
119;172;29062021164553
120;168;29062021164553
121;165;29062021164553
122;166;29062021164553
123;164;29062021164553
124;161;29062021164553
125;160;29062021164553
126;157;29062021164553
127;156;29062021164553
128;157;29062021164553
129;153;29062021164553
130;152;29062021164553
131;151;29062021164553
132;150;29062021164553
133;151;29062021164553
134;146;29062021164553
135;144;29062021164553
136;146;29062021164553
137;142;29062021164553
138;143;29062021164553
139;141;29062021164553
140;140;29062021164553
141;140;29062021164553
142;138;29062021164553
143;137;29062021164553
144;138;29062021164553
145;136;29062021164553
146;138;29062021164553
147;135;29062021164553
148;133;29062021164553
149;134;29062021164553
150;133;29062021164553
151;133;29062021164553
152;132;29062021164553
153;131;29062021164553
154;132;29062021164553
155;131;29062021164553
156;130;29062021164553
157;130;29062021164553
158;128;29062021164553
159;129;29062021164553
160;129;29062021164553
161;127;29062021164553
162;129;29062021164553
163;129;29062021164553
164;127;29062021164553
165;130;29062021164553
166;127;29062021164553
167;126;29062021164553
168;128;29062021164553
169;124;29062021164553
170;127;29062021164553
171;126;29062021164553
172;125;29062021164553
173;127;29062021164553
174;125;29062021164553
175;125;29062021164553
176;126;29062021164553
177;123;29062021164553
178;126;29062021164553
179;124;29062021164553
180;124;29062021164553
181;126;29062021164553
182;124;29062021164553
183;124;29062021164553
184;125;29062021164553
185;123;29062021164553
186;126;29062021164553
187;124;29062021164553
188;123;29062021164553
189;124;29062021164553
190;123;29062021164553
191;124;29062021164553
192;126;29062021164553
193;124;29062021164553
194;124;29062021164553
195;123;29062021164553
196;122;29062021164553
197;125;29062021164553
198;123;29062021164553
199;122;29062021164553
200;0;29062021164553
0;0;29062021164553
1;143;29062021164553
2;135;29062021164553
3;132;29062021164553
4;136;29062021164553
5;137;29062021164553
6;135;29062021164553
7;137;29062021164553
8;140;29062021164553
9;137;29062021164553
10;143;29062021164553
11;142;29062021164553
12;145;29062021164553
13;152;29062021164553
14;154;29062021164553
15;164;29062021164553
16;177;29062021164553
17;198;29062021164553
18;250;29062021164553
19;358;29062021164553
20;592;29062021164553
21;1023;29062021164553
22;1023;29062021164553
23;1023;29062021164553
24;1023;29062021164553
25;1023;29062021164553
26;1023;29062021164553
27;1023;29062021164553
28;1023;29062021164553
29;1023;29062021164553
30;1023;29062021164553
31;1023;29062021164553
32;1023;29062021164553
33;1023;29062021164553
34;1023;29062021164553
35;1023;29062021164553
36;1023;29062021164553
37;973;29062021164553
38;801;29062021164553
39;670;29062021164553
40;568;29062021164553
41;498;29062021164553
42;456;29062021164553
43;425;29062021164553
44;407;29062021164553
45;394;29062021164553
46;384;29062021164553
47;382;29062021164553
48;384;29062021164553
49;384;29062021164553
50;387;29062021164553
51;389;29062021164553
52;387;29062021164553
53;401;29062021164553
54;403;29062021164553
55;413;29062021164553
56;420;29062021164553
57;431;29062021164553
58;447;29062021164553
59;453;29062021164553
60;463;29062021164553
61;477;29062021164553
62;479;29062021164553
63;492;29062021164553
64;497;29062021164553
65;497;29062021164553
66;495;29062021164553
67;501;29062021164553
68;495;29062021164553
69;486;29062021164553
70;475;29062021164553
71;468;29062021164553
72;459;29062021164553
73;442;29062021164553
74;434;29062021164553
75;418;29062021164553
76;406;29062021164553
77;394;29062021164553
78;383;29062021164553
79;368;29062021164553
80;357;29062021164553
81;342;29062021164553
82;336;29062021164553
83;326;29062021164553
84;320;29062021164553
85;313;29062021164553
86;309;29062021164553
87;307;29062021164553
88;301;29062021164553
89;294;29062021164553
90;294;29062021164553
91;286;29062021164553
92;275;29062021164553
93;272;29062021164553
94;261;29062021164553
95;255;29062021164553
96;253;29062021164553
97;243;29062021164553
98;237;29062021164553
99;233;29062021164553
100;229;29062021164553
101;228;29062021164553
102;221;29062021164553
103;216;29062021164553
104;213;29062021164553
105;208;29062021164553
106;207;29062021164553
107;200;29062021164553
108;199;29062021164553
109;195;29062021164553
110;190;29062021164553
111;189;29062021164553
112;186;29062021164553
113;182;29062021164553
114;181;29062021164553
115;179;29062021164553
116;177;29062021164553
117;177;29062021164553
118;173;29062021164553
119;171;29062021164553
120;168;29062021164553
121;165;29062021164553
122;166;29062021164553
123;164;29062021164553
124;161;29062021164553
125;160;29062021164553
126;156;29062021164553
127;155;29062021164553
128;157;29062021164553
129;152;29062021164553
130;152;29062021164553
131;152;29062021164553
132;148;29062021164553
133;152;29062021164553
134;146;29062021164553
135;144;29062021164553
136;145;29062021164553
137;141;29062021164553
138;144;29062021164553
139;141;29062021164553
140;139;29062021164553
141;141;29062021164553
142;138;29062021164553
143;137;29062021164553
144;137;29062021164553
145;133;29062021164553
146;136;29062021164553
147;135;29062021164553
148;133;29062021164553
149;134;29062021164553
150;132;29062021164553
151;133;29062021164553
152;132;29062021164553
153;130;29062021164553
154;133;29062021164553
155;130;29062021164553
156;129;29062021164553
157;129;29062021164553
158;129;29062021164553
159;129;29062021164553
160;129;29062021164553
161;128;29062021164553
162;130;29062021164553
163;128;29062021164553
164;127;29062021164553
165;130;29062021164553
166;127;29062021164553
167;127;29062021164553
168;128;29062021164553
169;125;29062021164553
170;126;29062021164553
171;126;29062021164553
172;125;29062021164553
173;126;29062021164553
174;125;29062021164553
175;124;29062021164553
176;126;29062021164553
177;124;29062021164553
178;126;29062021164553
179;124;29062021164553
180;124;29062021164553
181;126;29062021164553
182;125;29062021164553
183;123;29062021164553
184;125;29062021164553
185;122;29062021164553
186;126;29062021164553
187;123;29062021164553
188;123;29062021164553
189;124;29062021164553
190;122;29062021164553
191;123;29062021164553
192;127;29062021164553
193;123;29062021164553
194;123;29062021164553
195;124;29062021164553
196;121;29062021164553
197;123;29062021164553
198;123;29062021164553
199;122;29062021164553
200;0;29062021164553
0;0;29062021164554
1;144;29062021164554
2;135;29062021164554
3;133;29062021164554
4;135;29062021164554
5;136;29062021164554
6;135;29062021164554
7;138;29062021164554
8;140;29062021164554
9;138;29062021164554
10;142;29062021164554
11;142;29062021164554
12;144;29062021164554
13;152;29062021164554
14;154;29062021164554
15;164;29062021164554
16;176;29062021164554
17;197;29062021164554
18;250;29062021164554
19;359;29062021164554
20;591;29062021164554
21;1023;29062021164554
22;1023;29062021164554
23;1023;29062021164554
24;1023;29062021164554
25;1023;29062021164554
26;1023;29062021164554
27;1023;29062021164554
28;1023;29062021164554
29;1023;29062021164554
30;1023;29062021164554
31;1023;29062021164554
32;1023;29062021164554
33;1023;29062021164554
34;1023;29062021164554
35;1023;29062021164554
36;1023;29062021164554
37;980;29062021164554
38;812;29062021164554
39;667;29062021164554
40;569;29062021164554
41;500;29062021164554
42;460;29062021164554
43;424;29062021164554
44;409;29062021164554
45;394;29062021164554
46;387;29062021164554
47;383;29062021164554
48;380;29062021164554
49;382;29062021164554
50;382;29062021164554
51;390;29062021164554
52;389;29062021164554
53;397;29062021164554
54;407;29062021164554
55;410;29062021164554
56;422;29062021164554
57;433;29062021164554
58;440;29062021164554
59;451;29062021164554
60;465;29062021164554
61;475;29062021164554
62;479;29062021164554
63;492;29062021164554
64;493;29062021164554
65;495;29062021164554
66;501;29062021164554
67;496;29062021164554
68;493;29062021164554
69;488;29062021164554
70;477;29062021164554
71;469;29062021164554
72;459;29062021164554
73;443;29062021164554
74;435;29062021164554
75;418;29062021164554
76;406;29062021164554
77;394;29062021164554
78;381;29062021164554
79;365;29062021164554
80;355;29062021164554
81;343;29062021164554
82;333;29062021164554
83;325;29062021164554
84;316;29062021164554
85;314;29062021164554
86;311;29062021164554
87;305;29062021164554
88;304;29062021164554
89;295;29062021164554
90;289;29062021164554
91;285;29062021164554
92;275;29062021164554
93;269;29062021164554
94;264;29062021164554
95;255;29062021164554
96;251;29062021164554
97;242;29062021164554
98;239;29062021164554
99;234;29062021164554
100;227;29062021164554
101;225;29062021164554
102;221;29062021164554
103;218;29062021164554
104;212;29062021164554
105;209;29062021164554
106;207;29062021164554
107;202;29062021164554
108;197;29062021164554
109;196;29062021164554
110;191;29062021164554
111;188;29062021164554
112;187;29062021164554
113;182;29062021164554
114;181;29062021164554
115;181;29062021164554
116;177;29062021164554
117;178;29062021164554
118;171;29062021164554
119;171;29062021164554
120;168;29062021164554
121;165;29062021164554
122;166;29062021164554
123;163;29062021164554
124;161;29062021164554
125;162;29062021164554
126;157;29062021164554
127;156;29062021164554
128;156;29062021164554
129;153;29062021164554
130;152;29062021164554
131;150;29062021164554
132;147;29062021164554
133;150;29062021164554
134;145;29062021164554
135;144;29062021164554
136;146;29062021164554
137;142;29062021164554
138;144;29062021164554
139;140;29062021164554
140;138;29062021164554
141;140;29062021164554
142;137;29062021164554
143;137;29062021164554
144;138;29062021164554
145;133;29062021164554
146;137;29062021164554
147;135;29062021164554
148;132;29062021164554
149;134;29062021164554
150;132;29062021164554
151;132;29062021164554
152;132;29062021164554
153;131;29062021164554
154;131;29062021164554
155;130;29062021164554
156;129;29062021164554
157;129;29062021164554
158;129;29062021164554
159;128;29062021164554
160;130;29062021164554
161;128;29062021164554
162;129;29062021164554
163;129;29062021164554
164;127;29062021164554
165;129;29062021164554
166;126;29062021164554
167;127;29062021164554
168;127;29062021164554
169;123;29062021164554
170;126;29062021164554
171;125;29062021164554
172;125;29062021164554
173;126;29062021164554
174;125;29062021164554
175;124;29062021164554
176;125;29062021164554
177;124;29062021164554
178;126;29062021164554
179;124;29062021164554
180;122;29062021164554
181;125;29062021164554
182;125;29062021164554
183;123;29062021164554
184;126;29062021164554
185;122;29062021164554
186;126;29062021164554
187;124;29062021164554
188;121;29062021164554
189;124;29062021164554
190;123;29062021164554
191;123;29062021164554
192;126;29062021164554
193;122;29062021164554
194;123;29062021164554
195;123;29062021164554
196;122;29062021164554
197;124;29062021164554
198;123;29062021164554
199;122;29062021164554
200;0;29062021164554
0;0;29062021164555
1;143;29062021164555
2;134;29062021164555
3;134;29062021164555
4;134;29062021164555
5;137;29062021164555
6;134;29062021164555
7;137;29062021164555
8;139;29062021164555
9;138;29062021164555
10;143;29062021164555
11;143;29062021164555
12;144;29062021164555
13;150;29062021164555
14;155;29062021164555
15;165;29062021164555
16;176;29062021164555
17;198;29062021164555
18;251;29062021164555
19;358;29062021164555
20;591;29062021164555
21;1023;29062021164555
22;1023;29062021164555
23;1023;29062021164555
24;1023;29062021164555
25;1023;29062021164555
26;1023;29062021164555
27;1023;29062021164555
28;1023;29062021164555
29;1023;29062021164555
30;1023;29062021164555
31;1023;29062021164555
32;1023;29062021164555
33;1023;29062021164555
34;1023;29062021164555
35;1023;29062021164555
36;1023;29062021164555
37;978;29062021164555
38;814;29062021164555
39;670;29062021164555
40;570;29062021164555
41;496;29062021164555
42;455;29062021164555
43;423;29062021164555
44;410;29062021164555
45;392;29062021164555
46;386;29062021164555
47;384;29062021164555
48;381;29062021164555
49;381;29062021164555
50;384;29062021164555
51;383;29062021164555
52;388;29062021164555
53;398;29062021164555
54;404;29062021164555
55;414;29062021164555
56;422;29062021164555
57;432;29062021164555
58;444;29062021164555
59;453;29062021164555
60;464;29062021164555
61;475;29062021164555
62;481;29062021164555
63;494;29062021164555
64;496;29062021164555
65;494;29062021164555
66;499;29062021164555
67;498;29062021164555
68;494;29062021164555
69;486;29062021164555
70;476;29062021164555
71;469;29062021164555
72;460;29062021164555
73;443;29062021164555
74;436;29062021164555
75;418;29062021164555
76;406;29062021164555
77;394;29062021164555
78;381;29062021164555
79;370;29062021164555
80;358;29062021164555
81;343;29062021164555
82;340;29062021164555
83;325;29062021164555
84;323;29062021164555
85;314;29062021164555
86;308;29062021164555
87;304;29062021164555
88;302;29062021164555
89;292;29062021164555
90;291;29062021164555
91;286;29062021164555
92;273;29062021164555
93;271;29062021164555
94;263;29062021164555
95;256;29062021164555
96;250;29062021164555
97;243;29062021164555
98;240;29062021164555
99;233;29062021164555
100;228;29062021164555
101;230;29062021164555
102;219;29062021164555
103;215;29062021164555
104;211;29062021164555
105;207;29062021164555
106;206;29062021164555
107;199;29062021164555
108;199;29062021164555
109;197;29062021164555
110;189;29062021164555
111;188;29062021164555
112;188;29062021164555
113;182;29062021164555
114;180;29062021164555
115;178;29062021164555
116;178;29062021164555
117;177;29062021164555
118;172;29062021164555
119;172;29062021164555
120;169;29062021164555
121;165;29062021164555
122;164;29062021164555
123;164;29062021164555
124;160;29062021164555
125;160;29062021164555
126;156;29062021164555
127;155;29062021164555
128;156;29062021164555
129;152;29062021164555
130;152;29062021164555
131;152;29062021164555
132;148;29062021164555
133;150;29062021164555
134;146;29062021164555
135;144;29062021164555
136;146;29062021164555
137;140;29062021164555
138;142;29062021164555
139;141;29062021164555
140;139;29062021164555
141;141;29062021164555
142;138;29062021164555
143;135;29062021164555
144;138;29062021164555
145;135;29062021164555
146;137;29062021164555
147;134;29062021164555
148;132;29062021164555
149;134;29062021164555
150;132;29062021164555
151;133;29062021164555
152;132;29062021164555
153;130;29062021164555
154;132;29062021164555
155;129;29062021164555
156;129;29062021164555
157;130;29062021164555
158;128;29062021164555
159;128;29062021164555
160;129;29062021164555
161;127;29062021164555
162;129;29062021164555
163;129;29062021164555
164;127;29062021164555
165;128;29062021164555
166;127;29062021164555
167;127;29062021164555
168;128;29062021164555
169;124;29062021164555
170;127;29062021164555
171;126;29062021164555
172;125;29062021164555
173;125;29062021164555
174;125;29062021164555
175;123;29062021164555
176;125;29062021164555
177;123;29062021164555
178;126;29062021164555
179;124;29062021164555
180;124;29062021164555
181;125;29062021164555
182;124;29062021164555
183;123;29062021164555
184;125;29062021164555
185;121;29062021164555
186;125;29062021164555
187;124;29062021164555
188;121;29062021164555
189;124;29062021164555
190;122;29062021164555
191;124;29062021164555
192;126;29062021164555
193;122;29062021164555
194;123;29062021164555
195;123;29062021164555
196;122;29062021164555
197;124;29062021164555
198;123;29062021164555
199;121;29062021164555
200;0;29062021164555
0;0;29062021164556
1;143;29062021164556
2;135;29062021164556
3;134;29062021164556
4;135;29062021164556
5;136;29062021164556
6;135;29062021164556
7;138;29062021164556
8;139;29062021164556
9;138;29062021164556
10;142;29062021164556
11;143;29062021164556
12;145;29062021164556
13;152;29062021164556
14;154;29062021164556
15;162;29062021164556
16;176;29062021164556
17;199;29062021164556
18;251;29062021164556
19;355;29062021164556
20;587;29062021164556
21;1023;29062021164556
22;1023;29062021164556
23;1023;29062021164556
24;1023;29062021164556
25;1023;29062021164556
26;1023;29062021164556
27;1023;29062021164556
28;1023;29062021164556
29;1023;29062021164556
30;1023;29062021164556
31;1023;29062021164556
32;1023;29062021164556
33;1023;29062021164556
34;1023;29062021164556
35;1023;29062021164556
36;1023;29062021164556
37;982;29062021164556
38;816;29062021164556
39;669;29062021164556
40;566;29062021164556
41;497;29062021164556
42;459;29062021164556
43;425;29062021164556
44;405;29062021164556
45;393;29062021164556
46;381;29062021164556
47;381;29062021164556
48;378;29062021164556
49;377;29062021164556
50;382;29062021164556
51;385;29062021164556
52;388;29062021164556
53;400;29062021164556
54;404;29062021164556
55;408;29062021164556
56;420;29062021164556
57;430;29062021164556
58;445;29062021164556
59;451;29062021164556
60;463;29062021164556
61;475;29062021164556
62;480;29062021164556
63;491;29062021164556
64;495;29062021164556
65;495;29062021164556
66;499;29062021164556
67;495;29062021164556
68;492;29062021164556
69;486;29062021164556
70;474;29062021164556
71;470;29062021164556
72;457;29062021164556
73;444;29062021164556
74;433;29062021164556
75;419;29062021164556
76;404;29062021164556
77;396;29062021164556
78;381;29062021164556
79;367;29062021164556
80;355;29062021164556
81;343;29062021164556
82;334;29062021164556
83;323;29062021164556
84;314;29062021164556
85;312;29062021164556
86;307;29062021164556
87;305;29062021164556
88;301;29062021164556
89;294;29062021164556
90;289;29062021164556
91;284;29062021164556
92;275;29062021164556
93;272;29062021164556
94;265;29062021164556
95;254;29062021164556
96;251;29062021164556
97;244;29062021164556
98;239;29062021164556
99;235;29062021164556
100;228;29062021164556
101;229;29062021164556
102;220;29062021164556
103;215;29062021164556
104;213;29062021164556
105;206;29062021164556
106;207;29062021164556
107;200;29062021164556
108;198;29062021164556
109;195;29062021164556
110;190;29062021164556
111;187;29062021164556
112;188;29062021164556
113;182;29062021164556
114;180;29062021164556
115;180;29062021164556
116;176;29062021164556
117;178;29062021164556
118;173;29062021164556
119;171;29062021164556
120;168;29062021164556
121;165;29062021164556
122;166;29062021164556
123;165;29062021164556
124;160;29062021164556
125;160;29062021164556
126;156;29062021164556
127;156;29062021164556
128;155;29062021164556
129;151;29062021164556
130;152;29062021164556
131;151;29062021164556
132;147;29062021164556
133;150;29062021164556
134;144;29062021164556
135;144;29062021164556
136;145;29062021164556
137;142;29062021164556
138;143;29062021164556
139;142;29062021164556
140;139;29062021164556
141;140;29062021164556
142;137;29062021164556
143;136;29062021164556
144;138;29062021164556
145;133;29062021164556
146;136;29062021164556
147;135;29062021164556
148;132;29062021164556
149;133;29062021164556
150;132;29062021164556
151;133;29062021164556
152;134;29062021164556
153;129;29062021164556
154;132;29062021164556
155;129;29062021164556
156;130;29062021164556
157;129;29062021164556
158;128;29062021164556
159;128;29062021164556
160;129;29062021164556
161;127;29062021164556
162;128;29062021164556
163;129;29062021164556
164;126;29062021164556
165;129;29062021164556
166;127;29062021164556
167;127;29062021164556
168;127;29062021164556
169;124;29062021164556
170;127;29062021164556
171;126;29062021164556
172;125;29062021164556
173;126;29062021164556
174;125;29062021164556
175;125;29062021164556
176;126;29062021164556
177;124;29062021164556
178;125;29062021164556
179;124;29062021164556
180;124;29062021164556
181;124;29062021164556
182;124;29062021164556
183;123;29062021164556
184;125;29062021164556
185;122;29062021164556
186;125;29062021164556
187;124;29062021164556
188;121;29062021164556
189;123;29062021164556
190;123;29062021164556
191;123;29062021164556
192;125;29062021164556
193;122;29062021164556
194;122;29062021164556
195;123;29062021164556
196;122;29062021164556
197;123;29062021164556
198;123;29062021164556
199;122;29062021164556
200;0;29062021164556
0;0;29062021164557
1;143;29062021164557
2;134;29062021164557
3;133;29062021164557
4;134;29062021164557
5;136;29062021164557
6;133;29062021164557
7;137;29062021164557
8;138;29062021164557
9;137;29062021164557
10;142;29062021164557
11;142;29062021164557
12;144;29062021164557
13;149;29062021164557
14;154;29062021164557
15;162;29062021164557
16;176;29062021164557
17;197;29062021164557
18;250;29062021164557
19;356;29062021164557
20;594;29062021164557
21;1023;29062021164557
22;1023;29062021164557
23;1023;29062021164557
24;1023;29062021164557
25;1023;29062021164557
26;1023;29062021164557
27;1023;29062021164557
28;1023;29062021164557
29;1023;29062021164557
30;1023;29062021164557
31;1023;29062021164557
32;1023;29062021164557
33;1023;29062021164557
34;1023;29062021164557
35;1023;29062021164557
36;1023;29062021164557
37;984;29062021164557
38;814;29062021164557
39;672;29062021164557
40;572;29062021164557
41;499;29062021164557
42;461;29062021164557
43;426;29062021164557
44;409;29062021164557
45;396;29062021164557
46;389;29062021164557
47;378;29062021164557
48;382;29062021164557
49;381;29062021164557
50;384;29062021164557
51;387;29062021164557
52;389;29062021164557
53;398;29062021164557
54;405;29062021164557
55;413;29062021164557
56;424;29062021164557
57;427;29062021164557
58;448;29062021164557
59;454;29062021164557
60;468;29062021164557
61;479;29062021164557
62;480;29062021164557
63;493;29062021164557
64;498;29062021164557
65;497;29062021164557
66;501;29062021164557
67;505;29062021164557
68;495;29062021164557
69;488;29062021164557
70;480;29062021164557
71;467;29062021164557
72;464;29062021164557
73;443;29062021164557
74;435;29062021164557
75;417;29062021164557
76;410;29062021164557
77;399;29062021164557
78;383;29062021164557
79;372;29062021164557
80;359;29062021164557
81;342;29062021164557
82;339;29062021164557
83;328;29062021164557
84;321;29062021164557
85;314;29062021164557
86;308;29062021164557
87;305;29062021164557
88;305;29062021164557
89;295;29062021164557
90;292;29062021164557
91;287;29062021164557
92;277;29062021164557
93;272;29062021164557
94;264;29062021164557
95;255;29062021164557
96;253;29062021164557
97;246;29062021164557
98;236;29062021164557
99;235;29062021164557
100;229;29062021164557
101;227;29062021164557
102;221;29062021164557
103;217;29062021164557
104;214;29062021164557
105;209;29062021164557
106;206;29062021164557
107;200;29062021164557
108;197;29062021164557
109;197;29062021164557
110;190;29062021164557
111;187;29062021164557
112;186;29062021164557
113;180;29062021164557
114;180;29062021164557
115;180;29062021164557
116;176;29062021164557
117;178;29062021164557
118;171;29062021164557
119;171;29062021164557
120;168;29062021164557
121;166;29062021164557
122;166;29062021164557
123;165;29062021164557
124;161;29062021164557
125;160;29062021164557
126;157;29062021164557
127;156;29062021164557
128;156;29062021164557
129;151;29062021164557
130;151;29062021164557
131;150;29062021164557
132;148;29062021164557
133;151;29062021164557
134;146;29062021164557
135;145;29062021164557
136;144;29062021164557
137;141;29062021164557
138;142;29062021164557
139;139;29062021164557
140;139;29062021164557
141;140;29062021164557
142;137;29062021164557
143;135;29062021164557
144;137;29062021164557
145;133;29062021164557
146;137;29062021164557
147;134;29062021164557
148;133;29062021164557
149;133;29062021164557
150;131;29062021164557
151;133;29062021164557
152;131;29062021164557
153;129;29062021164557
154;131;29062021164557
155;129;29062021164557
156;128;29062021164557
157;129;29062021164557
158;128;29062021164557
159;128;29062021164557
160;130;29062021164557
161;127;29062021164557
162;128;29062021164557
163;128;29062021164557
164;127;29062021164557
165;128;29062021164557
166;126;29062021164557
167;125;29062021164557
168;127;29062021164557
169;124;29062021164557
170;127;29062021164557
171;125;29062021164557
172;124;29062021164557
173;125;29062021164557
174;124;29062021164557
175;123;29062021164557
176;126;29062021164557
177;124;29062021164557
178;126;29062021164557
179;124;29062021164557
180;123;29062021164557
181;125;29062021164557
182;124;29062021164557
183;123;29062021164557
184;124;29062021164557
185;121;29062021164557
186;125;29062021164557
187;123;29062021164557
188;121;29062021164557
189;124;29062021164557
190;122;29062021164557
191;123;29062021164557
192;125;29062021164557
193;122;29062021164557
194;122;29062021164557
195;122;29062021164557
196;121;29062021164557
197;123;29062021164557
198;122;29062021164557
199;121;29062021164557
200;0;29062021164557
0;0;29062021164557
1;143;29062021164557
2;135;29062021164557
3;133;29062021164557
4;134;29062021164557
5;136;29062021164557
6;135;29062021164557
7;137;29062021164557
8;139;29062021164557
9;139;29062021164557
10;144;29062021164557
11;143;29062021164557
12;145;29062021164557
13;151;29062021164557
14;154;29062021164557
15;163;29062021164557
16;176;29062021164557
17;199;29062021164557
18;250;29062021164557
19;357;29062021164557
20;590;29062021164557
21;1023;29062021164557
22;1023;29062021164557
23;1023;29062021164557
24;1023;29062021164557
25;1023;29062021164557
26;1023;29062021164557
27;1023;29062021164557
28;1023;29062021164557
29;1023;29062021164557
30;1023;29062021164557
31;1023;29062021164557
32;1023;29062021164557
33;1023;29062021164557
34;1023;29062021164557
35;1023;29062021164557
36;1023;29062021164557
37;986;29062021164557
38;820;29062021164557
39;675;29062021164557
40;578;29062021164557
41;500;29062021164557
42;459;29062021164557
43;426;29062021164557
44;408;29062021164557
45;393;29062021164557
46;384;29062021164557
47;383;29062021164557
48;384;29062021164557
49;382;29062021164557
50;386;29062021164557
51;386;29062021164557
52;391;29062021164557
53;394;29062021164557
54;402;29062021164557
55;416;29062021164557
56;422;29062021164557
57;429;29062021164557
58;448;29062021164557
59;455;29062021164557
60;465;29062021164557
61;472;29062021164557
62;479;29062021164557
63;489;29062021164557
64;498;29062021164557
65;498;29062021164557
66;500;29062021164557
67;494;29062021164557
68;493;29062021164557
69;488;29062021164557
70;480;29062021164557
71;473;29062021164557
72;461;29062021164557
73;448;29062021164557
74;432;29062021164557
75;417;29062021164557
76;404;29062021164557
77;395;29062021164557
78;381;29062021164557
79;369;29062021164557
80;357;29062021164557
81;342;29062021164557
82;340;29062021164557
83;328;29062021164557
84;320;29062021164557
85;312;29062021164557
86;310;29062021164557
87;306;29062021164557
88;302;29062021164557
89;295;29062021164557
90;291;29062021164557
91;285;29062021164557
92;273;29062021164557
93;271;29062021164557
94;264;29062021164557
95;254;29062021164557
96;251;29062021164557
97;242;29062021164557
98;240;29062021164557
99;234;29062021164557
100;230;29062021164557
101;227;29062021164557
102;220;29062021164557
103;216;29062021164557
104;214;29062021164557
105;209;29062021164557
106;208;29062021164557
107;201;29062021164557
108;198;29062021164557
109;196;29062021164557
110;190;29062021164557
111;187;29062021164557
112;188;29062021164557
113;182;29062021164557
114;182;29062021164557
115;178;29062021164557
116;177;29062021164557
117;177;29062021164557
118;173;29062021164557
119;171;29062021164557
120;168;29062021164557
121;165;29062021164557
122;166;29062021164557
123;164;29062021164557
124;161;29062021164557
125;161;29062021164557
126;157;29062021164557
127;156;29062021164557
128;156;29062021164557
129;154;29062021164557
130;153;29062021164557
131;150;29062021164557
132;147;29062021164557
133;150;29062021164557
134;146;29062021164557
135;144;29062021164557
136;147;29062021164557
137;143;29062021164557
138;144;29062021164557
139;140;29062021164557
140;139;29062021164557
141;141;29062021164557
142;137;29062021164557
143;138;29062021164557
144;137;29062021164557
145;135;29062021164557
146;137;29062021164557
147;135;29062021164557
148;134;29062021164557
149;133;29062021164557
150;133;29062021164557
151;133;29062021164557
152;131;29062021164557
153;130;29062021164557
154;132;29062021164557
155;130;29062021164557
156;129;29062021164557
157;130;29062021164557
158;129;29062021164557
159;128;29062021164557
160;130;29062021164557
161;128;29062021164557
162;129;29062021164557
163;128;29062021164557
164;126;29062021164557
165;130;29062021164557
166;127;29062021164557
167;127;29062021164557
168;128;29062021164557
169;125;29062021164557
170;128;29062021164557
171;126;29062021164557
172;126;29062021164557
173;126;29062021164557
174;125;29062021164557
175;124;29062021164557
176;126;29062021164557
177;123;29062021164557
178;126;29062021164557
179;125;29062021164557
180;123;29062021164557
181;126;29062021164557
182;125;29062021164557
183;122;29062021164557
184;123;29062021164557
185;122;29062021164557
186;125;29062021164557
187;124;29062021164557
188;121;29062021164557
189;124;29062021164557
190;122;29062021164557
191;123;29062021164557
192;126;29062021164557
193;123;29062021164557
194;123;29062021164557
195;122;29062021164557
196;122;29062021164557
197;124;29062021164557
198;124;29062021164557
199;122;29062021164557
200;0;29062021164557
0;0;29062021164558
1;143;29062021164558
2;134;29062021164558
3;133;29062021164558
4;135;29062021164558
5;136;29062021164558
6;134;29062021164558
7;136;29062021164558
8;139;29062021164558
9;139;29062021164558
10;143;29062021164558
11;142;29062021164558
12;144;29062021164558
13;151;29062021164558
14;155;29062021164558
15;164;29062021164558
16;177;29062021164558
17;198;29062021164558
18;250;29062021164558
19;357;29062021164558
20;591;29062021164558
21;1023;29062021164558
22;1023;29062021164558
23;1023;29062021164558
24;1023;29062021164558
25;1023;29062021164558
26;1023;29062021164558
27;1023;29062021164558
28;1023;29062021164558
29;1023;29062021164558
30;1023;29062021164558
31;1023;29062021164558
32;1023;29062021164558
33;1023;29062021164558
34;1023;29062021164558
35;1023;29062021164558
36;1023;29062021164558
37;986;29062021164558
38;819;29062021164558
39;677;29062021164558
40;573;29062021164558
41;503;29062021164558
42;461;29062021164558
43;427;29062021164558
44;407;29062021164558
45;397;29062021164558
46;388;29062021164558
47;384;29062021164558
48;380;29062021164558
49;378;29062021164558
50;384;29062021164558
51;386;29062021164558
52;388;29062021164558
53;399;29062021164558
54;405;29062021164558
55;413;29062021164558
56;420;29062021164558
57;430;29062021164558
58;446;29062021164558
59;452;29062021164558
60;462;29062021164558
61;475;29062021164558
62;477;29062021164558
63;491;29062021164558
64;495;29062021164558
65;497;29062021164558
66;498;29062021164558
67;494;29062021164558
68;490;29062021164558
69;486;29062021164558
70;477;29062021164558
71;468;29062021164558
72;460;29062021164558
73;441;29062021164558
74;434;29062021164558
75;420;29062021164558
76;408;29062021164558
77;395;29062021164558
78;378;29062021164558
79;369;29062021164558
80;354;29062021164558
81;341;29062021164558
82;337;29062021164558
83;329;29062021164558
84;319;29062021164558
85;312;29062021164558
86;308;29062021164558
87;304;29062021164558
88;305;29062021164558
89;293;29062021164558
90;291;29062021164558
91;286;29062021164558
92;275;29062021164558
93;271;29062021164558
94;263;29062021164558
95;257;29062021164558
96;252;29062021164558
97;243;29062021164558
98;239;29062021164558
99;231;29062021164558
100;227;29062021164558
101;227;29062021164558
102;219;29062021164558
103;215;29062021164558
104;212;29062021164558
105;207;29062021164558
106;207;29062021164558
107;201;29062021164558
108;198;29062021164558
109;196;29062021164558
110;192;29062021164558
111;187;29062021164558
112;186;29062021164558
113;179;29062021164558
114;181;29062021164558
115;178;29062021164558
116;177;29062021164558
117;177;29062021164558
118;172;29062021164558
119;171;29062021164558
120;168;29062021164558
121;165;29062021164558
122;164;29062021164558
123;162;29062021164558
124;160;29062021164558
125;160;29062021164558
126;157;29062021164558
127;155;29062021164558
128;157;29062021164558
129;152;29062021164558
130;152;29062021164558
131;151;29062021164558
132;149;29062021164558
133;152;29062021164558
134;145;29062021164558
135;145;29062021164558
136;147;29062021164558
137;142;29062021164558
138;143;29062021164558
139;141;29062021164558
140;139;29062021164558
141;140;29062021164558
142;137;29062021164558
143;136;29062021164558
144;138;29062021164558
145;133;29062021164558
146;136;29062021164558
147;136;29062021164558
148;133;29062021164558
149;133;29062021164558
150;133;29062021164558
151;133;29062021164558
152;132;29062021164558
153;129;29062021164558
154;132;29062021164558
155;130;29062021164558
156;129;29062021164558
157;130;29062021164558
158;128;29062021164558
159;127;29062021164558
160;128;29062021164558
161;127;29062021164558
162;129;29062021164558
163;128;29062021164558
164;127;29062021164558
165;130;29062021164558
166;125;29062021164558
167;127;29062021164558
168;127;29062021164558
169;125;29062021164558
170;126;29062021164558
171;124;29062021164558
172;126;29062021164558
173;126;29062021164558
174;125;29062021164558
175;124;29062021164558
176;125;29062021164558
177;124;29062021164558
178;126;29062021164558
179;125;29062021164558
180;124;29062021164558
181;125;29062021164558
182;125;29062021164558
183;122;29062021164558
184;124;29062021164558
185;121;29062021164558
186;124;29062021164558
187;123;29062021164558
188;122;29062021164558
189;123;29062021164558
190;122;29062021164558
191;123;29062021164558
192;126;29062021164558
193;123;29062021164558
194;123;29062021164558
195;123;29062021164558
196;122;29062021164558
197;123;29062021164558
198;123;29062021164558
199;122;29062021164558
200;0;29062021164558
0;0;29062021164558
1;143;29062021164558
2;134;29062021164558
3;133;29062021164558
4;134;29062021164558
5;136;29062021164558
6;135;29062021164558
7;137;29062021164558
8;139;29062021164558
9;138;29062021164558
10;143;29062021164558
11;141;29062021164558
12;144;29062021164558
13;151;29062021164558
14;154;29062021164558
15;164;29062021164558
16;176;29062021164558
17;197;29062021164558
18;249;29062021164558
19;355;29062021164558
20;589;29062021164558
21;1023;29062021164558
22;1023;29062021164558
23;1023;29062021164558
24;1023;29062021164558
25;1023;29062021164558
26;1023;29062021164558
27;1023;29062021164558
28;1023;29062021164558
29;1023;29062021164558
30;1023;29062021164558
31;1023;29062021164558
32;1023;29062021164558
33;1023;29062021164558
34;1023;29062021164558
35;1023;29062021164558
36;1023;29062021164558
37;988;29062021164558
38;821;29062021164558
39;678;29062021164558
40;574;29062021164558
41;500;29062021164558
42;460;29062021164558
43;426;29062021164558
44;405;29062021164558
45;392;29062021164558
46;388;29062021164558
47;383;29062021164558
48;384;29062021164558
49;381;29062021164558
50;386;29062021164558
51;390;29062021164558
52;388;29062021164558
53;397;29062021164558
54;403;29062021164558
55;409;29062021164558
56;422;29062021164558
57;430;29062021164558
58;444;29062021164558
59;449;29062021164558
60;463;29062021164558
61;478;29062021164558
62;485;29062021164558
63;491;29062021164558
64;495;29062021164558
65;496;29062021164558
66;502;29062021164558
67;499;29062021164558
68;492;29062021164558
69;486;29062021164558
70;475;29062021164558
71;468;29062021164558
72;461;29062021164558
73;447;29062021164558
74;436;29062021164558
75;417;29062021164558
76;403;29062021164558
77;392;29062021164558
78;380;29062021164558
79;369;29062021164558
80;355;29062021164558
81;342;29062021164558
82;334;29062021164558
83;325;29062021164558
84;318;29062021164558
85;314;29062021164558
86;310;29062021164558
87;307;29062021164558
88;306;29062021164558
89;294;29062021164558
90;295;29062021164558
91;286;29062021164558
92;277;29062021164558
93;271;29062021164558
94;262;29062021164558
95;256;29062021164558
96;254;29062021164558
97;243;29062021164558
98;240;29062021164558
99;234;29062021164558
100;227;29062021164558
101;227;29062021164558
102;221;29062021164558
103;217;29062021164558
104;215;29062021164558
105;209;29062021164558
106;207;29062021164558
107;202;29062021164558
108;198;29062021164558
109;195;29062021164558
110;189;29062021164558
111;189;29062021164558
112;187;29062021164558
113;181;29062021164558
114;179;29062021164558
115;178;29062021164558
116;178;29062021164558
117;178;29062021164558
118;173;29062021164558
119;171;29062021164558
120;169;29062021164558
121;167;29062021164558
122;165;29062021164558
123;164;29062021164558
124;162;29062021164558
125;161;29062021164558
126;157;29062021164558
127;157;29062021164558
128;156;29062021164558
129;152;29062021164558
130;152;29062021164558
131;151;29062021164558
132;147;29062021164558
133;150;29062021164558
134;146;29062021164558
135;143;29062021164558
136;145;29062021164558
137;143;29062021164558
138;143;29062021164558
139;140;29062021164558
140;138;29062021164558
141;140;29062021164558
142;137;29062021164558
143;137;29062021164558
144;137;29062021164558
145;134;29062021164558
146;137;29062021164558
147;134;29062021164558
148;134;29062021164558
149;134;29062021164558
150;132;29062021164558
151;133;29062021164558
152;132;29062021164558
153;129;29062021164558
154;132;29062021164558
155;130;29062021164558
156;129;29062021164558
157;128;29062021164558
158;128;29062021164558
159;128;29062021164558
160;129;29062021164558
161;128;29062021164558
162;129;29062021164558
163;128;29062021164558
164;127;29062021164558
165;128;29062021164558
166;127;29062021164558
167;127;29062021164558
168;127;29062021164558
169;123;29062021164558
170;127;29062021164558
171;125;29062021164558
172;124;29062021164558
173;126;29062021164558
174;124;29062021164558
175;124;29062021164558
176;126;29062021164558
177;123;29062021164558
178;126;29062021164558
179;124;29062021164558
180;124;29062021164558
181;125;29062021164558
182;124;29062021164558
183;124;29062021164558
184;124;29062021164558
185;122;29062021164558
186;124;29062021164558
187;123;29062021164558
188;122;29062021164558
189;124;29062021164558
190;122;29062021164558
191;122;29062021164558
192;126;29062021164558
193;122;29062021164558
194;124;29062021164558
195;123;29062021164558
196;123;29062021164558
197;123;29062021164558
198;123;29062021164558
199;121;29062021164558
200;0;29062021164558
0;0;29062021164559
1;143;29062021164559
2;134;29062021164559
3;133;29062021164559
4;133;29062021164559
5;136;29062021164559
6;135;29062021164559
7;139;29062021164559
8;139;29062021164559
9;140;29062021164559
10;142;29062021164559
11;141;29062021164559
12;145;29062021164559
13;151;29062021164559
14;155;29062021164559
15;165;29062021164559
16;175;29062021164559
17;198;29062021164559
18;250;29062021164559
19;353;29062021164559
20;584;29062021164559
21;1023;29062021164559
22;1023;29062021164559
23;1023;29062021164559
24;1023;29062021164559
25;1023;29062021164559
26;1023;29062021164559
27;1023;29062021164559
28;1023;29062021164559
29;1023;29062021164559
30;1023;29062021164559
31;1023;29062021164559
32;1023;29062021164559
33;1023;29062021164559
34;1023;29062021164559
35;1023;29062021164559
36;1023;29062021164559
37;985;29062021164559
38;820;29062021164559
39;675;29062021164559
40;571;29062021164559
41;499;29062021164559
42;458;29062021164559
43;430;29062021164559
44;405;29062021164559
45;395;29062021164559
46;389;29062021164559
47;382;29062021164559
48;381;29062021164559
49;380;29062021164559
50;384;29062021164559
51;386;29062021164559
52;389;29062021164559
53;400;29062021164559
54;403;29062021164559
55;405;29062021164559
56;419;29062021164559
57;431;29062021164559
58;443;29062021164559
59;454;29062021164559
60;465;29062021164559
61;477;29062021164559
62;482;29062021164559
63;492;29062021164559
64;497;29062021164559
65;498;29062021164559
66;500;29062021164559
67;497;29062021164559
68;490;29062021164559
69;486;29062021164559
70;473;29062021164559
71;467;29062021164559
72;460;29062021164559
73;444;29062021164559
74;435;29062021164559
75;415;29062021164559
76;407;29062021164559
77;398;29062021164559
78;379;29062021164559
79;368;29062021164559
80;355;29062021164559
81;343;29062021164559
82;335;29062021164559
83;324;29062021164559
84;320;29062021164559
85;315;29062021164559
86;308;29062021164559
87;302;29062021164559
88;303;29062021164559
89;295;29062021164559
90;291;29062021164559
91;284;29062021164559
92;275;29062021164559
93;270;29062021164559
94;262;29062021164559
95;254;29062021164559
96;251;29062021164559
97;244;29062021164559
98;240;29062021164559
99;232;29062021164559
100;227;29062021164559
101;228;29062021164559
102;220;29062021164559
103;216;29062021164559
104;213;29062021164559
105;207;29062021164559
106;206;29062021164559
107;201;29062021164559
108;198;29062021164559
109;196;29062021164559
110;191;29062021164559
111;188;29062021164559
112;187;29062021164559
113;181;29062021164559
114;181;29062021164559
115;178;29062021164559
116;177;29062021164559
117;176;29062021164559
118;174;29062021164559
119;171;29062021164559
120;167;29062021164559
121;165;29062021164559
122;165;29062021164559
123;163;29062021164559
124;160;29062021164559
125;160;29062021164559
126;157;29062021164559
127;155;29062021164559
128;156;29062021164559
129;152;29062021164559
130;151;29062021164559
131;149;29062021164559
132;147;29062021164559
133;151;29062021164559
134;147;29062021164559
135;143;29062021164559
136;146;29062021164559
137;142;29062021164559
138;144;29062021164559
139;141;29062021164559
140;139;29062021164559
141;141;29062021164559
142;137;29062021164559
143;136;29062021164559
144;137;29062021164559
145;135;29062021164559
146;137;29062021164559
147;135;29062021164559
148;133;29062021164559
149;133;29062021164559
150;132;29062021164559
151;132;29062021164559
152;132;29062021164559
153;129;29062021164559
154;133;29062021164559
155;130;29062021164559
156;129;29062021164559
157;130;29062021164559
158;128;29062021164559
159;128;29062021164559
160;128;29062021164559
161;127;29062021164559
162;128;29062021164559
163;128;29062021164559
164;126;29062021164559
165;128;29062021164559
166;127;29062021164559
167;127;29062021164559
168;128;29062021164559
169;124;29062021164559
170;127;29062021164559
171;125;29062021164559
172;125;29062021164559
173;126;29062021164559
174;124;29062021164559
175;123;29062021164559
176;126;29062021164559
177;123;29062021164559
178;126;29062021164559
179;125;29062021164559
180;124;29062021164559
181;125;29062021164559
182;125;29062021164559
183;122;29062021164559
184;125;29062021164559
185;121;29062021164559
186;126;29062021164559
187;124;29062021164559
188;122;29062021164559
189;124;29062021164559
190;123;29062021164559
191;123;29062021164559
192;127;29062021164559
193;122;29062021164559
194;122;29062021164559
195;123;29062021164559
196;122;29062021164559
197;124;29062021164559
198;123;29062021164559
199;122;29062021164559
200;0;29062021164559
