[
  {
    "name": "goods 1",
    "price": 100,
    "url": "./img/1.png",
    "article": "00001",
    "color": "color1"
  },
  {
    "name": "goods 2",
    "price": 100,
    "url": "./img/2.png",
    "article": "00002",
    "color": "color2"
  },
  {
    "name": "goods 3",
    "price": 100,
    "url": "./img/3.png",
    "article": "00003",
    "color": "color3"
  },
  {
    "name": "goods 4",
    "price": 100,
    "url": "./img/4.png",
    "article": "00004",
    "color": "color4"
  },
  {
    "name": "goods 5",
    "price": 100,
    "url": "./img/5.png",
    "article": "00005",
    "color": "color5"
  },
  {
    "name": "goods 6",
    "price": 100,
    "url": "./img/6.png",
    "article": "00006",
    "color": "color6"
  },
  {
    "name": "goods 7",
    "price": 100,
    "url": "./img/7.png",
    "article": "00007",
    "color": "color7"
  },
  {
    "name": "goods 8",
    "price": 100,
    "url": "./img/8.png",
    "article": "00008",
    "color": "color8"
  },
  {
    "name": "goods 9",
    "price": 100,
    "url": "./img/9.png",
    "article": "00009",
    "color": "color9"
  },
  {
    "name": "goods 10",
    "price": 100,
    "url": "./img/10.png",
    "article": "00010",
    "color": "color10"
  }
]