%YAML 1.1
%TAG !u! tag:unity3d.com,2011:
--- !u!181963792 &2655988077585873504
Preset:
  m_ObjectHideFlags: 0
  m_CorrespondingSourceObject: {fileID: 0}
  m_PrefabInstance: {fileID: 0}
  m_PrefabAsset: {fileID: 0}
  m_Name: FBXImporter
  m_TargetType:
    m_NativeTypeID: 1041
    m_ManagedTypePPtr: {fileID: 0}
    m_ManagedTypeFallback: 
  m_Properties:
  - target: {fileID: 0}
    propertyPath: m_ExternalObjects.Array.size
    value: 1
    objectReference: {fileID: 0}
  - target: {fileID: 0}
    propertyPath: m_ExternalObjects.Array.data[0].first.type
    value: UnityEngine:Material
    objectReference: {fileID: 0}
  - target: {fileID: 0}
    propertyPath: m_ExternalObjects.Array.data[0].first.assembly
    value: UnityEngine.CoreModule
    objectReference: {fileID: 0}
  - target: {fileID: 0}
    propertyPath: m_ExternalObjects.Array.data[0].first.name
    value: Texture_Atlas
    objectReference: {fileID: 0}
  - target: {fileID: 0}
    propertyPath: m_ExternalObjects.Array.data[0].second
    value: 
    objectReference: {fileID: 2100000, guid: 11a66f1268944604eb5369e5725d214d, type: 2}
  - target: {fileID: 0}
    propertyPath: m_MaterialImportMode
    value: 1
    objectReference: {fileID: 0}
  - target: {fileID: 0}
    propertyPath: m_MaterialName
    value: 0
    objectReference: {fileID: 0}
  - target: {fileID: 0}
    propertyPath: m_MaterialSearch
    value: 1
    objectReference: {fileID: 0}
  - target: {fileID: 0}
    propertyPath: m_MaterialLocation
    value: 1
    objectReference: {fileID: 0}
  - target: {fileID: 0}
    propertyPath: m_LegacyGenerateAnimations
    value: 4
    objectReference: {fileID: 0}
  - target: {fileID: 0}
    propertyPath: m_BakeSimulation
    value: 0
    objectReference: {fileID: 0}
  - target: {fileID: 0}
    propertyPath: m_ResampleCurves
    value: 1
    objectReference: {fileID: 0}
  - target: {fileID: 0}
    propertyPath: m_OptimizeGameObjects
    value: 0
    objectReference: {fileID: 0}
  - target: {fileID: 0}
    propertyPath: m_MotionNodeName
    value: 
    objectReference: {fileID: 0}
  - target: {fileID: 0}
    propertyPath: m_RigImportErrors
    value: 
    objectReference: {fileID: 0}
  - target: {fileID: 0}
    propertyPath: m_RigImportWarnings
    value: 
    objectReference: {fileID: 0}
  - target: {fileID: 0}
    propertyPath: m_AnimationImportErrors
    value: 
    objectReference: {fileID: 0}
  - target: {fileID: 0}
    propertyPath: m_AnimationImportWarnings
    value: 
    objectReference: {fileID: 0}
  - target: {fileID: 0}
    propertyPath: m_AnimationRetargetingWarnings
    value: 
    objectReference: {fileID: 0}
  - target: {fileID: 0}
    propertyPath: m_AnimationDoRetargetingWarnings
    value: 0
    objectReference: {fileID: 0}
  - target: {fileID: 0}
    propertyPath: m_ImportAnimatedCustomProperties
    value: 0
    objectReference: {fileID: 0}
  - target: {fileID: 0}
    propertyPath: m_ImportConstraints
    value: 0
    objectReference: {fileID: 0}
  - target: {fileID: 0}
    propertyPath: m_AnimationCompression
    value: 1
    objectReference: {fileID: 0}
  - target: {fileID: 0}
    propertyPath: m_AnimationRotationError
    value: 0.5
    objectReference: {fileID: 0}
  - target: {fileID: 0}
    propertyPath: m_AnimationPositionError
    value: 0.5
    objectReference: {fileID: 0}
  - target: {fileID: 0}
    propertyPath: m_AnimationScaleError
    value: 0.5
    objectReference: {fileID: 0}
  - target: {fileID: 0}
    propertyPath: m_AnimationWrapMode
    value: 0
    objectReference: {fileID: 0}
  - target: {fileID: 0}
    propertyPath: m_ExtraExposedTransformPaths.Array.size
    value: 0
    objectReference: {fileID: 0}
  - target: {fileID: 0}
    propertyPath: m_ExtraUserProperties.Array.size
    value: 0
    objectReference: {fileID: 0}
  - target: {fileID: 0}
    propertyPath: m_ClipAnimations.Array.size
    value: 0
    objectReference: {fileID: 0}
  - target: {fileID: 0}
    propertyPath: m_IsReadable
    value: 0
    objectReference: {fileID: 0}
  - target: {fileID: 0}
    propertyPath: m_LODScreenPercentages.Array.size
    value: 0
    objectReference: {fileID: 0}
  - target: {fileID: 0}
    propertyPath: m_GlobalScale
    value: 1
    objectReference: {fileID: 0}
  - target: {fileID: 0}
    propertyPath: m_MeshCompression
    value: 0
    objectReference: {fileID: 0}
  - target: {fileID: 0}
    propertyPath: m_AddColliders
    value: 0
    objectReference: {fileID: 0}
  - target: {fileID: 0}
    propertyPath: m_UseSRGBMaterialColor
    value: 1
    objectReference: {fileID: 0}
  - target: {fileID: 0}
    propertyPath: m_SortHierarchyByName
    value: 1
    objectReference: {fileID: 0}
  - target: {fileID: 0}
    propertyPath: m_ImportVisibility
    value: 1
    objectReference: {fileID: 0}
  - target: {fileID: 0}
    propertyPath: m_ImportBlendShapes
    value: 1
    objectReference: {fileID: 0}
  - target: {fileID: 0}
    propertyPath: m_ImportCameras
    value: 1
    objectReference: {fileID: 0}
  - target: {fileID: 0}
    propertyPath: m_ImportLights
    value: 0
    objectReference: {fileID: 0}
  - target: {fileID: 0}
    propertyPath: swapUVChannels
    value: 0
    objectReference: {fileID: 0}
  - target: {fileID: 0}
    propertyPath: generateSecondaryUV
    value: 0
    objectReference: {fileID: 0}
  - target: {fileID: 0}
    propertyPath: m_UseFileUnits
    value: 1
    objectReference: {fileID: 0}
  - target: {fileID: 0}
    propertyPath: keepQuads
    value: 0
    objectReference: {fileID: 0}
  - target: {fileID: 0}
    propertyPath: weldVertices
    value: 1
    objectReference: {fileID: 0}
  - target: {fileID: 0}
    propertyPath: m_PreserveHierarchy
    value: 0
    objectReference: {fileID: 0}
  - target: {fileID: 0}
    propertyPath: skinWeightsMode
    value: 0
    objectReference: {fileID: 0}
  - target: {fileID: 0}
    propertyPath: maxBonesPerVertex
    value: 4
    objectReference: {fileID: 0}
  - target: {fileID: 0}
    propertyPath: minBoneWeight
    value: 0.001
    objectReference: {fileID: 0}
  - target: {fileID: 0}
    propertyPath: meshOptimizationFlags
    value: -1
    objectReference: {fileID: 0}
  - target: {fileID: 0}
    propertyPath: indexFormat
    value: 0
    objectReference: {fileID: 0}
  - target: {fileID: 0}
    propertyPath: secondaryUVAngleDistortion
    value: 8
    objectReference: {fileID: 0}
  - target: {fileID: 0}
    propertyPath: secondaryUVAreaDistortion
    value: 15.000001
    objectReference: {fileID: 0}
  - target: {fileID: 0}
    propertyPath: secondaryUVHardAngle
    value: 88
    objectReference: {fileID: 0}
  - target: {fileID: 0}
    propertyPath: secondaryUVPackMargin
    value: 4
    objectReference: {fileID: 0}
  - target: {fileID: 0}
    propertyPath: m_UseFileScale
    value: 1
    objectReference: {fileID: 0}
  - target: {fileID: 0}
    propertyPath: normalSmoothAngle
    value: 60
    objectReference: {fileID: 0}
  - target: {fileID: 0}
    propertyPath: normalImportMode
    value: 0
    objectReference: {fileID: 0}
  - target: {fileID: 0}
    propertyPath: tangentImportMode
    value: 3
    objectReference: {fileID: 0}
  - target: {fileID: 0}
    propertyPath: normalCalculationMode
    value: 4
    objectReference: {fileID: 0}
  - target: {fileID: 0}
    propertyPath: legacyComputeAllNormalsFromSmoothingGroupsWhenMeshHasBlendShapes
    value: 0
    objectReference: {fileID: 0}
  - target: {fileID: 0}
    propertyPath: blendShapeNormalImportMode
    value: 1
    objectReference: {fileID: 0}
  - target: {fileID: 0}
    propertyPath: normalSmoothingSource
    value: 0
    objectReference: {fileID: 0}
  - target: {fileID: 0}
    propertyPath: m_ReferencedClips.Array.size
    value: 0
    objectReference: {fileID: 0}
  - target: {fileID: 0}
    propertyPath: m_ImportAnimation
    value: 1
    objectReference: {fileID: 0}
  - target: {fileID: 0}
    propertyPath: m_HumanDescription.m_Human.Array.size
    value: 0
    objectReference: {fileID: 0}
  - target: {fileID: 0}
    propertyPath: m_HumanDescription.m_Skeleton.Array.size
    value: 0
    objectReference: {fileID: 0}
  - target: {fileID: 0}
    propertyPath: m_HumanDescription.m_ArmTwist
    value: 0.5
    objectReference: {fileID: 0}
  - target: {fileID: 0}
    propertyPath: m_HumanDescription.m_ForeArmTwist
    value: 0.5
    objectReference: {fileID: 0}
  - target: {fileID: 0}
    propertyPath: m_HumanDescription.m_UpperLegTwist
    value: 0.5
    objectReference: {fileID: 0}
  - target: {fileID: 0}
    propertyPath: m_HumanDescription.m_LegTwist
    value: 0.5
    objectReference: {fileID: 0}
  - target: {fileID: 0}
    propertyPath: m_HumanDescription.m_ArmStretch
    value: 0.05
    objectReference: {fileID: 0}
  - target: {fileID: 0}
    propertyPath: m_HumanDescription.m_LegStretch
    value: 0.05
    objectReference: {fileID: 0}
  - target: {fileID: 0}
    propertyPath: m_HumanDescription.m_FeetSpacing
    value: 0
    objectReference: {fileID: 0}
  - target: {fileID: 0}
    propertyPath: m_HumanDescription.m_GlobalScale
    value: 1
    objectReference: {fileID: 0}
  - target: {fileID: 0}
    propertyPath: m_HumanDescription.m_RootMotionBoneName
    value: 
    objectReference: {fileID: 0}
  - target: {fileID: 0}
    propertyPath: m_HumanDescription.m_HasTranslationDoF
    value: 0
    objectReference: {fileID: 0}
  - target: {fileID: 0}
    propertyPath: m_HumanDescription.m_HasExtraRoot
    value: 0
    objectReference: {fileID: 0}
  - target: {fileID: 0}
    propertyPath: m_HumanDescription.m_SkeletonHasParents
    value: 1
    objectReference: {fileID: 0}
  - target: {fileID: 0}
    propertyPath: m_LastHumanDescriptionAvatarSource
    value: 
    objectReference: {fileID: 0}
  - target: {fileID: 0}
    propertyPath: m_AutoGenerateAvatarMappingIfUnspecified
    value: 1
    objectReference: {fileID: 0}
  - target: {fileID: 0}
    propertyPath: m_AnimationType
    value: 2
    objectReference: {fileID: 0}
  - target: {fileID: 0}
    propertyPath: m_HumanoidOversampling
    value: 1
    objectReference: {fileID: 0}
  - target: {fileID: 0}
    propertyPath: m_AvatarSetup
    value: 0
    objectReference: {fileID: 0}
  - target: {fileID: 0}
    propertyPath: m_AdditionalBone
    value: 0
    objectReference: {fileID: 0}
  - target: {fileID: 0}
    propertyPath: m_UserData
    value: 
    objectReference: {fileID: 0}
  - target: {fileID: 0}
    propertyPath: m_AssetBundleName
    value: 
    objectReference: {fileID: 0}
  - target: {fileID: 0}
    propertyPath: m_AssetBundleVariant
    value: 
    objectReference: {fileID: 0}
