%YAML 1.1
%TAG !u! tag:unity3d.com,2011:
--- !u!78 &1
TagManager:
  serializedVersion: 2
  tags:
  - FxTemporaire
  - Stone
  - Wall
  - LeanManager
  layers:
  - Default
  - TransparentFX
  - Ignore Raycast
  - 
  - Water
  - UI
  - 
  - 
  - PostProcessing
  - Flore
  - Character
  - Ground
  - Set
  - InvisibleWall
  - Stone
  - SoundFurniture
  - StoneTarget
  - Bad
  - Wall
  - Mirror
  - Trampoline
  - Robot
  - 
  - 
  - 
  - 
  - 
  - 
  - 
  - 
  - 
  - 
  m_SortingLayers:
  - name: Default
    uniqueID: 0
    locked: 0
