<svg xmlns="http://www.w3.org/2000/svg" viewBox="0 0 30.016 34.117">
  <defs>
    <style>
      .cls-1 {
        fill: #f27938;
      }

      .cls-2 {
        fill: #fff;
      }
    </style>
  </defs>
  <g id="Billdesk_logo-02" data-name="Billdesk logo-02" transform="translate(-52.51 -52.33)">
    <path id="Path_616" data-name="Path 616" class="cls-1" d="M66.576,52.33,52.51,60.941V78.472l14.066,7.975V82.354L56.122,76.336l.041-13.723,1.729-.979,8.684-4.893Z"/>
    <path id="Path_617" data-name="Path 617" class="cls-1" d="M58.87,76.309l9.777,5.537,9.663-5.537V65.171L68.59,59.52l-3.824,2.707v4.126L68.59,64.1l5.9,3.131-.179,7.2-6.181,2.887-5.317-3.2V60.531L58.87,62.708Z" transform="translate(-1.174 -1.327)"/>
    <path id="Path_618" data-name="Path 618" class="cls-2" d="M72.11,52.33v4.542L82.637,62.93V76.01L72.11,82.068v4.379l14.033-8.366V60.7Z" transform="translate(-3.618)"/>
  </g>
</svg>
