module gitlab.com/nikita.morozov/redis-lib

go 1.18

require (
	github.com/go-redis/redis/v8 v8.11.2
	github.com/stretchr/testify v1.7.1
)

require (
	github.com/cespare/xxhash/v2 v2.1.2 // indirect
	github.com/davecgh/go-spew v1.1.0 // indirect
	github.com/dgryski/go-rendezvous v0.0.0-20200823014737-9f7001d12a5f // indirect
	github.com/go-redis/redismock/v8 v8.0.6 // indirect
	github.com/onsi/gomega v1.19.0 // indirect
	github.com/pmezard/go-difflib v1.0.0 // indirect
	gopkg.in/yaml.v3 v3.0.0-20200313102051-9f266ea9e77c // indirect
)
