module bots-ms

go 1.22

require (
	github.com/DATA-DOG/go-sqlmock v1.5.0
	github.com/go-redis/redis/v8 v8.11.5
	github.com/go-redis/redismock/v8 v8.11.5
	github.com/google/uuid v1.4.0
	github.com/pkg/errors v0.9.1 // indirect
	github.com/randree/gormseeder v0.1.0
	github.com/stretchr/testify v1.8.4
	github.com/tidwall/gjson v1.17.0
	gitlab.com/nikita.morozov/ms-shared v1.11.1
	google.golang.org/grpc v1.59.0
	google.golang.org/protobuf v1.31.0
	gopkg.in/tucnak/telebot.v3 v3.0.0-20210831121553-6ecbc6adaecb
	gorm.io/driver/postgres v1.5.4
	gorm.io/gorm v1.25.5
)

require (
	github.com/labstack/echo/v4 v4.11.3
	gitlab.com/nikita.morozov/bot-ms-common-handlers v1.4.3
	gitlab.com/nikita.morozov/bot-ms-core v1.4.1
)

require (
	github.com/cespare/xxhash/v2 v2.2.0 // indirect
	github.com/davecgh/go-spew v1.1.1 // indirect
	github.com/dgryski/go-rendezvous v0.0.0-20200823014737-9f7001d12a5f // indirect
	github.com/golang/protobuf v1.5.3 // indirect
	github.com/jackc/chunkreader/v2 v2.0.1 // indirect
	github.com/jackc/pgconn v1.10.1 // indirect
	github.com/jackc/pgio v1.0.0 // indirect
	github.com/jackc/pgpassfile v1.0.0 // indirect
	github.com/jackc/pgproto3/v2 v2.2.0 // indirect
	github.com/jackc/pgservicefile v0.0.0-20221227161230-091c0ba34f0a // indirect
	github.com/jackc/pgtype v1.9.0 // indirect
	github.com/jackc/pgx/v4 v4.14.0 // indirect
	github.com/jackc/pgx/v5 v5.5.0 // indirect
	github.com/jackc/puddle/v2 v2.2.1 // indirect
	github.com/jinzhu/inflection v1.0.0 // indirect
	github.com/jinzhu/now v1.1.5 // indirect
	github.com/kr/pretty v0.3.0 // indirect
	github.com/labstack/gommon v0.4.0 // indirect
	github.com/mattn/go-colorable v0.1.13 // indirect
	github.com/mattn/go-isatty v0.0.20 // indirect
	github.com/mergermarket/go-pkcs7 v0.0.0-20170926155232-153b18ea13c9 // indirect
	github.com/pmezard/go-difflib v1.0.0 // indirect
	github.com/rogpeppe/go-internal v1.11.0 // indirect
	github.com/stretchr/objx v0.5.1 // indirect
	github.com/tidwall/match v1.1.1 // indirect
	github.com/tidwall/pretty v1.2.1 // indirect
	github.com/tidwall/sjson v1.2.4 // indirect
	github.com/valyala/bytebufferpool v1.0.0 // indirect
	github.com/valyala/fasttemplate v1.2.2 // indirect
	golang.org/x/crypto v0.15.0 // indirect
	golang.org/x/net v0.18.0 // indirect
	golang.org/x/sync v0.5.0 // indirect
	golang.org/x/sys v0.14.0 // indirect
	golang.org/x/text v0.14.0 // indirect
	google.golang.org/genproto/googleapis/rpc v0.0.0-20231106174013-bbf56f31fb17 // indirect
	gopkg.in/check.v1 v1.0.0-20201130134442-10cb98267c6c // indirect
	gopkg.in/telebot.v3 v3.1.4 // indirect
	gopkg.in/yaml.v3 v3.0.1 // indirect
)
