B+
A-
A
A
B+
B-
A
C+
B+
B+
B+
C+
A
B+
B+
A-
A-
D+
F
A
C
B+
B+
A-
B+
B+
B+
B+
D+
B+
B+
B+
B+
B+
B+
A
D+
B+
B+
B-
D+
B+
A
B+
B+
A
B+
A
D+
B-
B-
B+
B+
B-
D+
B+
A
A
B+
C+
A
B+
B+
B+
B+
B-
B+
B-
A
B+
B-
D+
B+
C
B+
A
B+
A
B-
B+
B
B+
B-
B-
B+
C
A
B+
B+
B-
C+
B+
A
B+
B+
B+
C+
B+
B+
B
B+
B-
A
B+
B+
B+
B+
B+
B+
B
B+
A
B+
B+
B+
A-
B+
B+
A
B-
B+
B+
B-
B+
B+
B+
A
B+
A
A
D+
B+
A
B
F
B+
A
B
A
B+
A
B+
B-
B+
B+
B+
B
C
B-
B+
A
A
F
B+
A
B+
A
A
B-
A-
A-
B+
B+
A-
B+
B+
D+
D+
B+
A-
D+
B+
C+
A
B+
B-
B+
A
B-
B+
B+
B-
B+
B+
B+
C+
A
B-
B+
B
A-
B+
B+
A-
B+
B+
C
B+
B-
B-
C
B+
B+
A-
B
B+
A
B+
D+
A
D+
B+
B+
B-
D+
B+
A
A
A
A
B+
B+
B+
B-
A
A
A
A
B+
A
B+
B+
B+
B+
B+
A
A
C+
D+
B+
D+
B+
C
B+
B
B
A
B+
D+
B-
B-
B+
C-
B+
B+
B+
B+
B+
B+
B+
B-
B+
A
B+
B+
A
B+
B+
B+
B+
B+
B
A
B
A
B+
B-
B
C+
B
B-
A
A
B+
B+
A
B+
B-
A
B+
