tests,pass,fail,error,skip,duration,coverage_percentage,coverage_absolute,run,frequency,parallelization
28,28,0,0,0,164.816,1,(54/54),-d -a 1,1,1
28,27,1,0,0,157.791,1,(54/54),-d -a 1,1,1
28,28,0,0,0,176.88,1,(54/54),-d -a 1,1,1
28,27,1,0,0,193.983,1,(54/54),-d -a 1,1,1
28,28,0,0,0,168.805,1,(54/54),-d -a 1,1,1
28,27,1,0,0,172.995,1,(54/54),-d -a 1,1,1
28,28,0,0,0,169.765,1,(54/54),-d -a 1,1,1
28,28,0,0,0,172.69,1,(102/102),-d -a 1,1,1
28,27,1,0,0,172.807,1,(54/54),-d -a 1,1,1
28,28,0,0,0,174.021,1,(54/54),-d -a 1,1,1
28,28,0,0,0,184.972,1,(54/54),-d -a 1,1,1
28,28,0,0,0,171.996,1,(54/54),-d -a 1,1,1
28,28,0,0,0,164.754,1,(54/54),-d -a 1,1,1
28,26,2,0,0,154.745,1,(54/54),-d -a 1,1,1
28,27,1,0,0,158.815,1,(54/54),-d -a 1,1,1
28,28,0,0,0,175.85,1,(54/54),-d -a 1,1,1
28,28,0,0,0,162.973,1,(54/54),-d -a 1,1,1
28,28,0,0,0,167.927,1,(54/54),-d -a 1,1,1
28,27,1,0,0,174.906,1,(54/54),-d -a 1,1,1
28,28,0,0,0,166.824,1,(54/54),-d -a 1,1,1
28,28,0,0,0,165.912,1,(54/54),-d -a 1,1,1
28,28,0,0,0,166.831,1,(54/54),-d -a 1,1,1
28,27,1,0,0,172.836,1,(54/54),-d -a 1,1,1
28,27,1,0,0,165.781,1,(54/54),-d -a 1,1,1
28,28,0,0,0,175.884,1,(54/54),-d -a 1,1,1
28,28,0,0,0,179.832,1,(54/54),-d -a 1,1,1
28,28,0,0,0,165.742,1,(54/54),-d -a 1,1,1
28,28,0,0,0,177.934,1,(54/54),-d -a 1,1,1
28,26,2,0,0,163.848,1,(54/54),-d -a 1,1,1
28,28,0,0,0,165.825,1,(54/54),-d -a 1,1,1
28,28,0,0,0,26.332,1,(54/54),-d -a 10,10,1
28,28,0,0,0,23.31,1,(54/54),-d -a 10,10,1
28,27,1,0,0,23.275,1,(54/54),-d -a 10,10,1
28,27,1,0,0,22.36,1,(54/54),-d -a 10,10,1
28,28,0,0,0,24.308,1,(54/54),-d -a 10,10,1
28,28,0,0,0,24.361,1,(54/54),-d -a 10,10,1
28,27,1,0,0,22.272,1,(54/54),-d -a 10,10,1
28,27,1,0,0,26.288,1,(54/54),-d -a 10,10,1
28,28,0,0,0,24.305,1,(54/54),-d -a 10,10,1
28,28,0,0,0,23.325,1,(54/54),-d -a 10,10,1
28,28,0,0,0,23.393,1,(54/54),-d -a 10,10,1
28,27,1,0,0,23.227,1,(54/54),-d -a 10,10,1
28,28,0,0,0,24.297,1,(54/54),-d -a 10,10,1
28,27,1,0,0,22.301,1,(54/54),-d -a 10,10,1
28,28,0,0,0,24.41,1,(54/54),-d -a 10,10,1
28,28,0,0,0,22.357,1,(54/54),-d -a 10,10,1
28,28,0,0,0,24.399,1,(54/54),-d -a 10,10,1
28,28,0,0,0,22.285,1,(54/54),-d -a 10,10,1
28,28,0,0,0,23.399,1,(54/54),-d -a 10,10,1
28,27,1,0,0,22.363,1,(54/54),-d -a 10,10,1
28,27,1,0,0,23.321,1,(54/54),-d -a 10,10,1
28,28,0,0,0,24.414,1,(54/54),-d -a 10,10,1
28,28,0,0,0,24.407,1,(54/54),-d -a 10,10,1
28,28,0,0,0,24.384,1,(54/54),-d -a 10,10,1
28,27,1,0,0,23.366,1,(54/54),-d -a 10,10,1
28,27,1,0,0,23.358,1,(54/54),-d -a 10,10,1
28,28,0,0,0,23.33,1,(54/54),-d -a 10,10,1
28,28,0,0,0,22.315,1,(54/54),-d -a 10,10,1
28,28,0,0,0,23.23,1,(54/54),-d -a 10,10,1
28,26,2,0,0,24.409,1,(54/54),-d -a 10,10,1
