\relax 
\providecommand\hyper@newdestlabel[2]{}
\providecommand\HyperFirstAtBeginDocument{\AtBeginDocument}
\HyperFirstAtBeginDocument{\ifx\hyper@anchor\@undefined
\global\let\oldcontentsline\contentsline
\gdef\contentsline#1#2#3#4{\oldcontentsline{#1}{#2}{#3}}
\global\let\oldnewlabel\newlabel
\gdef\newlabel#1#2{\newlabelxx{#1}#2}
\gdef\newlabelxx#1#2#3#4#5#6{\oldnewlabel{#1}{{#2}{#3}}}
\AtEndDocument{\ifx\hyper@anchor\@undefined
\let\contentsline\oldcontentsline
\let\newlabel\oldnewlabel
\fi}
\fi}
\global\let\hyper@last\relax 
\gdef\HyperFirstAtBeginDocument#1{#1}
\providecommand\HyField@AuxAddToFields[1]{}
\providecommand\HyField@AuxAddToCoFields[2]{}
\citation{GartnerIaaS}
\citation{Pichan15}
\@writefile{toc}{\contentsline {section}{Abstract}{1}{section*.1}\protected@file@percent }
\@writefile{toc}{\contentsline {section}{\numberline {1}Introduction}{1}{section.1}\protected@file@percent }
\@writefile{toc}{\contentsline {section}{\numberline {2}Background}{1}{section.2}\protected@file@percent }
\@writefile{toc}{\contentsline {subsection}{\numberline {2.1}Virtual Machine (VM) and Hypervisors}{1}{subsection.2.1}\protected@file@percent }
\citation{LibVMI}
\citation{libvmiRUST}
\citation{Payne2012SimplifyingVM}
\citation{Volatility}
\citation{Volatility3}
\citation{VolatilityFoundation}
\citation{Rekall}
\citation{RekallWithLibVMI}
\citation{pyvmidbg}
\citation{pyvmidbg}
\citation{pyvmidbg}
\citation{pyvmidbg}
\citation{RVMI}
\@writefile{toc}{\contentsline {subsection}{\numberline {2.2}Virtual machine introspection (VMI)}{2}{subsection.2.2}\protected@file@percent }
\@writefile{toc}{\contentsline {subsection}{\numberline {2.3}Semantic Gap Problem}{2}{subsection.2.3}\protected@file@percent }
\@writefile{toc}{\contentsline {section}{\numberline {3}Overview about investigative tools}{2}{section.3}\protected@file@percent }
\@writefile{lof}{\contentsline {figure}{\numberline {1}{\ignorespaces pyvmidbg vision with supported frontends and debuggers, taken from their Github page \citep  {pyvmidbg}. Not everything as depicted is supported yet, but the project is under active development.\relax }}{2}{figure.caption.4}\protected@file@percent }
\citation{RVMI}
\citation{Lamps14}
\citation{libvirtDocs}
\citation{MicrosoftHyperVDocs}
\citation{VM2DMP}
\citation{VolatilityImageinfo}
\citation{QUEMUDocumentation}
\citation{LibVMI}
\citation{LibVMI}
\citation{KVMVMI}
\citation{XenCoreDump}
\citation{CITRIXXenSnapshot}
\citation{LibVMI}
\citation{VirtualBoxMemoryDump}
\citation{IceBox}
\citation{VolatilityVirtualBox}
\citation{VMwareCommunityIntegratewithLibVMI}
\citation{vmss2core}
\citation{GartnerIaaS}
\citation{Zach15,Miyama17}
\citation{Orr18,Alqahtany14,Zach15}
\@writefile{toc}{\contentsline {section}{\numberline {4}Support for accessing memory and storage per Hypervisor}{3}{section.4}\protected@file@percent }
\@writefile{toc}{\contentsline {section}{\numberline {5}Current state of in-service VMI support by selected IaaS providers}{3}{section.5}\protected@file@percent }
\citation{diskSnapshotAWS}
\citation{MicrosoftAzureSupport}
\citation{diskSnapshotAZURE}
\citation{diskSnapshotGCE}
\citation{MargaritaShotgun}
\citation{MargaritaShotgunOverview}
\citation{MargaritaShotgunDocs}
\citation{nestedSupportGCE,nestedSupportAWS,nestedSupportAzure}
\citation{Yehuda10,Beham13}
\@writefile{toc}{\contentsline {section}{\numberline {6}Realizing VMI support without the IaaS provider}{4}{section.6}\protected@file@percent }
\@writefile{toc}{\contentsline {subsection}{\numberline {6.1}Margarita Shotgun}{4}{subsection.6.1}\protected@file@percent }
\@writefile{toc}{\contentsline {subsection}{\numberline {6.2}Nested Virtualization in a Pubic Cloud environment}{4}{subsection.6.2}\protected@file@percent }
\citation{nestedSupportHyperV}
\citation{nestedSupportGCE}
\citation{nestedSupportKVM}
\citation{updatesKVM}
\citation{nestedSupportXEN}
\citation{Miyama17}
\citation{Zhang11}
\citation{Zach15}
\citation{Beham13}
\bibstyle{ACM-Reference-Format}
\bibdata{./sources.bib}
\bibcite{Alqahtany14}{{1}{2014}{{Alqahtany et~al\mbox  {.}}}{{Alqahtany, Clarke, Furnell, and Reich}}}
\bibcite{nestedSupportAWS}{{2}{2018}{{AWS}}{{AWS}}}
\bibcite{diskSnapshotAWS}{{3}{2019}{{AWS}}{{AWS}}}
\bibcite{nestedSupportAzure}{{4}{2017}{{Azure}}{{Azure}}}
\bibcite{vmss2core}{{5}{2019}{{Base}}{{Base}}}
\bibcite{Beham13}{{6}{2013}{{Beham et~al\mbox  {.}}}{{Beham, Vlad, and Reiser}}}
\bibcite{Yehuda10}{{7}{2010}{{Ben-Yehuda et~al\mbox  {.}}}{{Ben-Yehuda, Day, Dubitzky, Factor, Har'El, Gordon, Liguori, Wasserman, and Yassour}}}
\bibcite{nestedSupportGCE}{{8}{2019}{{Cloud}}{{Cloud}}}
\bibcite{Rekall}{{9}{2019}{{Cohen}}{{Cohen}}}
\bibcite{VMwareCommunityIntegratewithLibVMI}{{10}{2018}{{Community}}{{Community}}}
\bibcite{CITRIXXenSnapshot}{{11}{2019}{{Documentation}}{{Documentation}}}
\bibcite{QUEMUDocumentation}{{12}{2016}{{Documentation}}{{Documentation}}}
\bibcite{XenCoreDump}{{13}{2007}{{Documentation}}{{Documentation}}}
\bibcite{RVMI}{{14}{2017}{{fireeye}}{{fireeye}}}
\bibcite{VolatilityVirtualBox}{{15}{2014}{{Foundation}}{{Foundation}}}
\@writefile{toc}{\contentsline {section}{\numberline {7}Related Work}{5}{section.7}\protected@file@percent }
\@writefile{toc}{\contentsline {section}{\numberline {8}Conclusion}{5}{section.8}\protected@file@percent }
\@writefile{toc}{\contentsline {section}{References}{5}{section*.6}\protected@file@percent }
\bibcite{Volatility}{{16}{2019a}{{Foundation}}{{Foundation}}}
\bibcite{VolatilityImageinfo}{{17}{2019b}{{Foundation}}{{Foundation}}}
\bibcite{Volatility3}{{18}{2019c}{{Foundation}}{{Foundation}}}
\bibcite{VolatilityFoundation}{{19}{2019d}{{Foundation}}{{Foundation}}}
\bibcite{GartnerIaaS}{{20}{2019}{{Gartner}}{{Gartner}}}
\bibcite{diskSnapshotGCE}{{21}{2019}{{Google}}{{Google}}}
\bibcite{nestedSupportKVM}{{22}{2018}{{KVM}}{{KVM}}}
\bibcite{Lamps14}{{23}{2014}{{{Lamps} et~al\mbox  {.}}}{{{Lamps}, {Palmer}, and {Sprabery}}}}
\bibcite{updatesKVM}{{24}{2019}{{Lan}}{{Lan}}}
\bibcite{libvirtDocs}{{25}{2019}{{libvirt}}{{libvirt}}}
\bibcite{LibVMI}{{26}{2019}{{LibVMI}}{{LibVMI}}}
\bibcite{VM2DMP}{{27}{2010}{{Microsoft}}{{Microsoft}}}
\bibcite{nestedSupportHyperV}{{28}{2016a}{{Microsoft}}{{Microsoft}}}
\bibcite{MicrosoftHyperVDocs}{{29}{2016b}{{Microsoft}}{{Microsoft}}}
\bibcite{diskSnapshotAZURE}{{30}{2018}{{Microsoft}}{{Microsoft}}}
\bibcite{Miyama17}{{31}{2017}{{Miyama and Kourai}}{{Miyama and Kourai}}}
\bibcite{Orr18}{{32}{2018}{{Orr and White}}{{Orr and White}}}
\bibcite{Payne2012SimplifyingVM}{{33}{2012}{{Payne}}{{Payne}}}
\bibcite{Pichan15}{{34}{2015}{{Pichan et~al\mbox  {.}}}{{Pichan, Lazarescu, and Soh}}}
\bibcite{nestedSupportXEN}{{35}{2018}{{Project}}{{Project}}}
\bibcite{MicrosoftAzureSupport}{{36}{2019}{{Support}}{{Support}}}
\bibcite{KVMVMI}{{37}{2019a}{{Tarral}}{{Tarral}}}
\bibcite{pyvmidbg}{{38}{2019b}{{Tarral}}{{Tarral}}}
\bibcite{RekallWithLibVMI}{{39}{2019c}{{Tarral}}{{Tarral}}}
\bibcite{libvmiRUST}{{40}{2019d}{{Tarral}}{{Tarral}}}
\bibcite{IceBox}{{41}{2019}{{THALIUM}}{{THALIUM}}}
\bibcite{MargaritaShotgunOverview}{{42}{2019a}{{ThreatResponse}}{{ThreatResponse}}}
\bibcite{MargaritaShotgunDocs}{{43}{2019b}{{ThreatResponse}}{{ThreatResponse}}}
\bibcite{MargaritaShotgun}{{44}{2019c}{{ThreatResponse}}{{ThreatResponse}}}
\bibcite{VirtualBoxMemoryDump}{{45}{2011}{{virtualbox.org}}{{virtualbox.org}}}
\bibcite{Zach15}{{46}{2015}{{Zach and Reiser}}{{Zach and Reiser}}}
\bibcite{Zhang11}{{47}{2011}{{Zhang et~al\mbox  {.}}}{{Zhang, Chen, Chen, and Zang}}}
\newlabel{tocindent-1}{0pt}
\newlabel{tocindent0}{0pt}
\newlabel{tocindent1}{4.185pt}
\newlabel{tocindent2}{10.34999pt}
\newlabel{tocindent3}{0pt}
\newlabel{TotPages}{{6}{6}{}{page.6}{}}
