<svg width="32" height="32" viewBox="0 0 32 32" fill="none" xmlns="http://www.w3.org/2000/svg">
<g clip-path="url(#clip0_1145_7006)">
<path d="M4.65507 9.57304C4.78827 9.86393 4.86012 10.1791 4.86613 10.499C4.87213 10.8189 4.81218 11.1366 4.69 11.4323C4.56783 11.728 4.38604 11.9953 4.15599 12.2177C3.92593 12.44 3.65254 12.6126 3.35286 12.7246L0.828425 13.6397C0.588442 15.1768 0.588442 16.7419 0.828425 18.279L3.35286 19.1973C3.65393 19.3069 3.92889 19.478 4.16026 19.6997C4.39163 19.9214 4.57436 20.1887 4.69683 20.4848C4.8193 20.7809 4.87883 21.0993 4.87164 21.4196C4.86446 21.74 4.7907 22.0553 4.65507 22.3456L3.51924 24.7772C4.43838 26.0338 5.54687 27.1401 6.80516 28.0568L9.23361 26.9241C9.52427 26.791 9.83926 26.7192 10.1589 26.7132C10.4786 26.7072 10.796 26.7672 11.0915 26.8894C11.3869 27.0116 11.654 27.1934 11.876 27.4234C12.098 27.6534 12.2703 27.9268 12.382 28.2264L13.3002 30.7508C14.0675 30.8718 14.8431 30.9328 15.6199 30.9332M15.6199 0.988678C14.8432 0.988854 14.0677 1.04876 13.3002 1.16785L12.382 3.69229C12.2702 3.99185 12.098 4.26519 11.876 4.4953C11.654 4.72541 11.3871 4.90736 11.0917 5.02982C10.7964 5.15228 10.479 5.21263 10.1593 5.2071C9.83966 5.20157 9.52454 5.13029 9.23361 4.9977L6.80516 3.86186C5.54679 4.77972 4.43832 5.88711 3.51924 7.14459M15.6199 20.8674C14.965 20.8841 14.3134 20.7696 13.7035 20.5305C13.0936 20.2915 12.5377 19.9328 12.0686 19.4755C11.5995 19.0182 11.2267 18.4717 10.9722 17.8681C10.7176 17.2645 10.5865 16.616 10.5865 15.9609C10.5865 15.3058 10.7176 14.6574 10.9722 14.0538C11.2267 13.4502 11.5995 12.9036 12.0686 12.4464C12.5377 11.9891 13.0936 11.6304 13.7035 11.3913C14.3134 11.1522 14.965 11.0377 15.6199 11.0544" stroke="#171321" stroke-width="1.27982" stroke-linecap="round" stroke-linejoin="round"/>
<path d="M23.8992 5.2601H20.2549V8.90443H23.8992V5.2601Z" stroke="#171321" stroke-width="1.27982" stroke-linecap="round" stroke-linejoin="round"/>
<path d="M23.8992 14.142H20.2549V17.7863H23.8992V14.142Z" stroke="#171321" stroke-width="1.27982" stroke-linecap="round" stroke-linejoin="round"/>
<path d="M31.3719 9.70108H27.7275V13.3454H31.3719V9.70108Z" stroke="#171321" stroke-width="1.27982" stroke-linecap="round" stroke-linejoin="round"/>
<path d="M31.3719 18.5829H27.7275V22.2273H31.3719V18.5829Z" stroke="#171321" stroke-width="1.27982" stroke-linecap="round" stroke-linejoin="round"/>
<path d="M23.8992 23.0239H20.2549V26.6682H23.8992V23.0239Z" stroke="#171321" stroke-width="1.27982" stroke-linecap="round" stroke-linejoin="round"/>
<path d="M15.6201 27.4425V0.988678" stroke="#171321" stroke-width="1.27982" stroke-linecap="round" stroke-linejoin="round"/>
</g>
<defs>
<clipPath id="clip0_1145_7006">
<rect width="31.9954" height="31.9954" fill="white"/>
</clipPath>
</defs>
</svg>
