<svg width="131" height="51" viewBox="0 0 131 51" fill="none" xmlns="http://www.w3.org/2000/svg">
<g clip-path="url(#clip0_1055_6233)">
<path d="M118.445 40.9879C116.509 40.8446 114.42 40.358 112.762 39.6636C112.387 39.5066 112.122 38.0788 111.933 38.007L111.545 36.0952C111.495 34.392 111.431 32.51 111.403 31.9136L111.352 30.8289H112.741L112.917 32.1631C113.577 37.1472 116.21 39.6557 120.78 39.6557C123.815 39.6557 125.697 38.5173 126.645 36.1073C126.94 35.3556 126.986 34.9679 126.992 33.1459C126.999 31.0723 126.994 31.0389 126.51 30.0495C125.661 28.3135 124.804 27.7378 120.529 26.0357C119.261 25.5308 117.755 24.8816 117.182 24.5929C113.449 22.7117 111.6 20.0426 111.607 16.5475C111.617 12.0759 114.106 8.84851 118.446 7.68025C119.957 7.27381 123.639 7.31811 125.214 7.76211C126.691 8.17818 128.644 8.95157 128.852 9.20294C128.94 9.31009 129.041 10.5756 129.087 12.1434C129.131 13.6571 129.191 15.2492 129.221 15.6811L129.276 16.4666H127.869L127.56 14.8911C126.84 11.2229 125.152 9.28938 122.244 8.80469C119.89 8.41222 117.037 9.32093 115.914 10.8205C115.06 11.9606 114.802 12.8537 114.802 14.6713C114.802 16.1165 114.838 16.3122 115.244 17.1188C115.772 18.1665 116.522 18.8517 117.926 19.569C118.909 20.0715 122.231 21.4038 122.5 21.4038C122.762 21.4038 125.746 22.8913 126.517 23.4061C128.662 24.8383 129.857 26.7602 130.282 29.4634C130.491 30.7848 130.5 31.2255 130.347 32.4498C130 35.2239 129.191 36.9428 127.484 38.5341C125.297 40.574 122.632 41.2973 118.445 40.9877V40.9879ZM65.6635 40.7857C60.9286 39.8786 58.6898 37.3866 58.0667 32.329C57.9703 31.5479 57.9104 26.8524 57.9104 20.0985V9.13576H54.3408V7.78956H66.0909V9.1271L64.1945 9.16899L62.2981 9.21089L62.2548 18.9353C62.198 31.5888 62.341 33.6265 63.4433 35.8788C64.5306 38.1005 66.6317 39.2071 69.7626 39.2071C73.3134 39.2071 75.2926 37.8794 76.3602 34.7816C77.0433 32.8002 77.0958 31.7533 77.0967 20.0949L77.0975 9.13601H73.5279V7.78956H82.1546V9.13601H78.8944L78.8479 21.0672C78.8019 32.8726 78.7978 33.0111 78.4704 34.1952C77.5025 37.6938 75.5887 39.654 72.2638 40.5526C70.7108 40.9723 67.271 41.0939 65.6638 40.7861L65.6635 40.7857ZM84.1164 39.9249L84.1624 39.2817L85.9473 39.2579L87.7322 39.2343L87.77 24.1896L87.8081 9.14516L85.9854 9.10302L84.1627 9.06112L84.1169 8.42522L84.0712 7.78956H91.3765C95.9963 7.78956 99.0749 7.85048 99.7515 7.9557C102.334 8.35732 104.098 9.49814 105.047 11.3798C105.865 13.0027 106.117 15.0351 105.735 16.9337C105.326 18.97 104.481 20.2252 102.788 21.314C101.644 22.0496 100.907 22.3541 99.4826 22.6802C98.8281 22.8297 98.2373 22.9994 98.1698 23.057C98.1024 23.1148 98.5038 23.2082 99.0622 23.2648C104.808 23.8487 107.324 26.3805 107.324 31.577C107.324 34.438 106.649 36.2662 104.975 37.9384C103.948 38.9634 102.702 39.6444 100.946 40.1394C99.8242 40.456 99.4831 40.4702 91.9252 40.5184L84.0705 40.5682L84.1164 39.9249ZM97.6688 38.9837C100.208 38.3186 101.906 36.5588 102.47 34.0082C102.825 32.4041 102.704 29.4637 102.231 28.2109C101.657 26.6875 100.688 25.4679 99.5071 24.7814C98.3268 24.0952 97.4711 23.9469 94.6959 23.9469H92.12V39.2069H94.4686C96.0705 39.2069 97.0878 39.1361 97.6688 38.9837ZM97.6606 22.2458C100.12 21.4469 101.555 18.9904 101.53 15.6205C101.504 12.1056 99.7274 9.57639 97.0042 9.17718C96.5674 9.11337 95.2899 9.08159 94.1652 9.10663L92.12 9.15214V15.7763C92.12 19.4197 92.1701 22.4531 92.2315 22.5171C92.4253 22.7194 96.8899 22.496 97.6606 22.2455V22.2458Z" fill="#171321"/>
<path d="M23.2919 49.8653C22.8236 49.7292 22.8084 49.6998 22.8084 48.9183C22.8084 48.1273 22.799 48.1097 22.3251 48.0173C21.4408 47.8449 19.9169 47.1449 19.2051 46.5839C16.583 44.518 15.6847 41.2872 16.8652 38.171C17.6201 36.1783 19.7028 34.3968 21.9553 33.817C23.0436 33.537 22.9921 33.2235 21.8417 33.1272L20.9493 33.0523V31.5563L21.8787 31.5118L22.8084 31.4672V27.6593C22.8084 25.565 22.7771 23.8513 22.7393 23.8513C22.701 23.8513 21.5795 24.7434 20.2465 25.8337C18.9135 26.9239 17.6396 27.9603 17.4154 28.1367C17.1912 28.3132 17.0087 28.5153 17.0099 28.5856C17.0111 28.6561 17.2389 28.9829 17.5163 29.312C18.0055 29.893 18.0135 29.9226 17.7819 30.3177C17.6509 30.5417 17.3591 30.7897 17.1339 30.8684C16.7583 31.0001 16.6748 30.9536 16.1332 30.3117C15.7075 29.807 15.4966 29.6563 15.3784 29.7724C15.2594 29.8896 15.3452 30.2144 15.6904 30.9568C16.1031 31.8436 16.1754 32.1831 16.2341 33.5115C16.2897 34.7724 16.2469 35.2239 15.9917 36.0673C15.2895 38.3861 13.6089 40.0763 11.3032 40.7825C10.4653 41.0392 10.0283 41.0813 8.84891 41.0197C7.20775 40.9338 6.26101 40.6147 4.92443 39.6973C4.45491 39.3749 4.02006 39.1142 3.9577 39.1175C3.89534 39.1209 3.617 39.3193 3.3389 39.5584C2.86022 39.9701 2.81038 39.9817 2.41189 39.7744C2.00208 39.5613 1.53906 38.8763 1.53906 38.4831C1.53906 38.3759 1.78634 38.0798 2.08852 37.8246L2.63822 37.3603L2.2419 36.441C0.500095 32.4012 2.27416 27.9896 6.23524 26.5103C6.95277 26.2423 7.40688 26.1843 8.67844 26.1982C10.5166 26.2182 11.4183 26.5002 12.9528 27.5353C14.167 28.3539 14.4675 28.2174 13.6525 27.217C13.1009 26.5394 13.0922 26.5105 13.3245 26.1214C13.456 25.9013 13.744 25.6553 13.9645 25.5741C14.3315 25.4393 14.4184 25.4874 14.9804 26.1342L15.5946 26.8413L18.7927 24.2325C20.5513 22.7977 21.9902 21.5536 21.9902 21.4676C21.9902 21.3819 20.5848 20.171 18.8671 18.7769L15.7434 16.2422L15.3343 16.6337C14.8089 17.1369 14.8181 17.4319 15.3717 17.8434C15.9163 18.2486 15.9199 18.3206 15.4251 18.912L15.0326 19.3815L14.5629 18.9235C14.0014 18.376 13.9402 18.3685 13.5709 18.8022C12.9682 19.5101 12.9636 19.6047 13.515 19.9822C13.7989 20.1765 14.0315 20.4108 14.0319 20.5023C14.0332 20.6981 13.463 21.4582 13.3156 21.4573C13.1806 21.4563 10.4007 19.2216 10.3451 19.0687C10.321 19.0027 11.0068 18.5599 11.8695 18.0846C12.7322 17.6096 13.4379 17.169 13.4379 17.1054C13.4379 17.0418 13.2446 16.8514 13.0082 16.6821L12.5784 16.3741L11.1289 17.2C10.3314 17.6541 9.65456 18.0011 9.62447 17.971C9.59461 17.9409 9.79711 17.1974 10.0742 16.3185L10.5784 14.7205L10.1982 14.4197C9.98925 14.2543 9.75449 14.1404 9.67672 14.1664C9.5987 14.1924 9.3064 14.9485 9.02709 15.8463C8.74779 16.7445 8.49256 17.5056 8.46005 17.5383C8.39986 17.5985 5.40624 15.1811 5.40624 15.0722C5.40624 14.9292 6.06959 14.1269 6.18781 14.1269C6.2598 14.1269 6.55379 14.3075 6.84105 14.5278L7.36354 14.9287L7.79791 14.4611C8.03676 14.204 8.23227 13.9466 8.23227 13.889C8.23227 13.8315 7.98427 13.569 7.68137 13.3056L7.13046 12.8265L7.49549 12.363C7.94286 11.7947 8.00353 11.7887 8.55685 12.257C8.80003 12.4627 9.04948 12.631 9.1116 12.631C9.25511 12.631 10.0193 11.7735 10.0104 11.6223C10.0066 11.5597 9.44075 11.0712 8.75284 10.5364C7.36065 9.45411 7.25109 9.19768 7.86677 8.46137C8.63967 7.53749 7.90578 7.05762 16.7101 14.2413C21.4699 18.1246 22.6406 19.0641 22.7207 19.0641C22.7689 19.0641 22.8084 17.3474 22.8084 15.249V11.434H21.3211V12.93H19.9824V11.434H18.4951V12.93H17.1563V8.89501L17.863 9.17552C18.2516 9.32962 18.9995 9.63156 19.5246 9.84658C20.0498 10.0616 20.5354 10.2371 20.6031 10.2371C20.6707 10.2371 20.7259 9.98479 20.7252 9.67611L20.7242 9.11509L19.0684 8.45752L17.4123 7.7997L19.0693 7.13274L20.7261 6.46578V5.88309C20.7261 5.56237 20.6941 5.30016 20.6549 5.30016C20.6156 5.30016 19.8959 5.57682 19.0561 5.91487L17.3424 6.60423C17.1992 6.66153 17.1566 6.21152 17.1566 4.64283V2.60727H18.4953V4.10324H19.9824V2.60727H21.3211V4.10324H22.8084V0.673804L23.3815 0.518742C23.786 0.409186 24.0927 0.411835 24.4228 0.52741L24.8909 0.691622V9.89377C24.8909 17.6758 24.9227 19.0836 25.097 19.0165C25.2798 18.9459 29.342 15.6689 36.3467 9.94072C37.6166 8.90248 38.7384 8.00148 38.8395 7.93839C39.1227 7.76262 39.5785 7.96849 39.8898 8.41345C40.5082 9.29664 40.4771 9.37802 39.101 10.4786C38.4025 11.0372 37.8309 11.5508 37.8309 11.6199C37.8309 11.8116 38.4642 12.631 38.6125 12.631C38.6845 12.631 38.9804 12.4489 39.2703 12.2265L39.7974 11.8222L40.2187 12.3387L40.6406 12.8554L40.0545 13.3788L39.4685 13.9025L39.9334 14.413C40.2517 14.7626 40.4559 14.8806 40.5811 14.7872C41.5873 14.0359 41.5392 14.0482 41.9223 14.4397C42.1161 14.6381 42.2955 14.8779 42.321 14.9726C42.3718 15.1618 39.4774 17.5922 39.3189 17.4935C39.2648 17.4598 38.9977 16.6886 38.7254 15.7797C38.4531 14.8707 38.1572 14.1291 38.0678 14.132C37.9785 14.1346 37.75 14.2668 37.5605 14.426L37.2155 14.7152L37.7288 16.366C38.0113 17.2737 38.2099 18.0167 38.1704 18.0167C38.1309 18.0167 37.4303 17.6394 36.6133 17.1783L35.1282 16.3397L34.6957 16.7563L34.2633 17.173L35.192 17.6893C35.7024 17.9734 36.4443 18.389 36.8404 18.6132L37.56 19.0208L36.0077 20.2957L34.4552 21.5707L34.0391 21.0462L33.623 20.5216L34.1913 20.0417L34.7595 19.5618L34.3442 19.0138C34.1154 18.7124 33.8958 18.4656 33.8559 18.4656C33.8161 18.4656 33.5303 18.6671 33.2212 18.9134L32.659 19.3613L32.2559 18.8296L31.8526 18.298L32.4146 17.8092L32.9765 17.3206L32.5439 16.7755C32.174 16.3091 32.0743 16.2566 31.8552 16.4129C31.2246 16.8624 25.6503 21.391 25.6431 21.4597C25.6383 21.502 26.0194 21.8387 26.4897 22.2078C26.9602 22.5769 28.4349 23.7709 29.7669 24.8612C31.0989 25.9514 32.2162 26.8435 32.2491 26.8435C32.2821 26.8435 32.5256 26.5406 32.7899 26.1703C33.3584 25.3738 33.6698 25.328 34.2883 25.9502L34.7388 26.4034L34.3478 26.8854C33.84 27.5105 33.591 28.0147 33.7237 28.1481C33.7817 28.2063 33.9146 28.1892 34.0191 28.11C35.008 27.3581 36.2064 26.6694 36.8391 26.4896C40.5115 25.446 43.8502 26.8459 45.4543 30.1015L46.0858 31.3842V33.2654C46.0858 35.209 46.0745 35.2583 45.1812 37.2472C45.1427 37.3326 45.3813 37.6018 45.7114 37.8455C46.2096 38.2134 46.2965 38.3521 46.2248 38.6625C46.1313 39.0658 45.6529 39.6494 45.226 39.8808C45.0192 39.993 44.8287 39.9107 44.3573 39.5045L43.7534 38.9844L43.0751 39.5052C41.6853 40.5723 40.2491 41.0587 38.5061 41.0527C36.444 41.0455 34.9497 40.4346 33.5917 39.0443C32.5371 37.964 31.9725 36.9722 31.6645 35.6575C31.2706 33.9769 31.4182 32.4898 32.1425 30.839C32.4247 30.1959 32.4796 29.9289 32.3551 29.8037C32.2306 29.6785 32.1143 29.7283 31.9034 29.997C30.9932 31.1571 31.0936 31.0947 30.5755 30.8253C30.3169 30.6907 30.0318 30.4422 29.9418 30.273C29.7713 29.9527 29.8081 29.8684 30.537 28.919L30.8384 28.5261L28.016 26.2271C26.4637 24.9625 25.1242 23.9048 25.0397 23.8764C24.9354 23.8415 24.8986 25.0509 24.9253 27.6157L24.9651 31.4065L25.854 31.4523C26.8167 31.5021 26.9686 31.6184 26.9686 32.3042C26.9686 32.9902 26.8167 33.1062 25.854 33.1561C24.5863 33.2215 24.6781 33.5261 26.0888 33.9352C27.9637 34.4794 29.2991 35.4637 30.3614 37.0854C31.6448 39.0441 31.7844 41.8576 30.7089 44.0848C29.9764 45.6018 28.0213 47.2559 26.4047 47.7267C24.8519 48.1786 24.8909 48.1468 24.8909 48.9676C24.8909 49.6594 24.8623 49.7141 24.4223 49.8684C23.8931 50.0538 23.942 50.054 23.2919 49.8653ZM22.8363 45.5493C22.8787 44.9387 22.9244 44.8688 23.366 44.7422C23.6629 44.6572 24.0361 44.6572 24.333 44.7422C24.7794 44.8703 24.822 44.9379 24.8909 45.6242C24.9595 46.3109 24.9935 46.3643 25.3371 46.3282C26.0611 46.2521 27.5231 45.3995 28.2264 44.6435C29.3179 43.4694 29.7106 42.4634 29.714 40.8319C29.7157 40.0913 29.6292 39.2312 29.5221 38.9206C28.793 36.8065 26.201 36.2108 25.0797 37.8992C24.4115 38.9052 24.7809 40.4601 25.8155 40.9983C26.2711 41.2352 27.3709 41.2318 27.9028 40.992C28.1332 40.888 28.1629 40.9689 28.1629 41.699C28.1629 42.4887 28.1436 42.5299 27.6945 42.6874C26.626 43.062 25.0166 42.6994 24.3819 41.9405C24.1816 41.7011 23.9892 41.5051 23.9545 41.5051C23.9196 41.5051 23.6571 41.7271 23.3709 41.9987C22.5418 42.7851 21.3146 43.0408 20.1112 42.6782L19.5362 42.5048V41.6898C19.5362 40.9651 19.5651 40.8887 19.7965 41.0017C19.9397 41.0715 20.4707 41.1293 20.9768 41.1297C21.7945 41.131 21.9481 41.0816 22.356 40.6884C23.2695 39.8079 23.2685 38.3174 22.3545 37.4586C20.9773 36.1644 18.7163 37.2349 18.1934 39.4289C17.6547 41.6864 18.5555 44.1499 20.3811 45.4135C21.1205 45.9251 22.5288 46.4787 22.6875 46.3198C22.7436 46.2637 22.8106 45.9169 22.8363 45.5493ZM10.9947 39.1202C12.5839 38.5585 13.9978 37.2125 14.3392 35.9366C14.617 34.8991 14.4003 34.0556 13.6664 33.3176C13.0994 32.747 12.9561 32.6784 12.3347 32.6784C11.139 32.6784 10.2464 33.4091 10.0644 34.5372C9.93965 35.311 10.4754 36.319 11.2042 36.6818L11.7811 36.9691L11.1696 37.4417C10.8332 37.7018 10.4682 37.9146 10.3586 37.9146C10.2488 37.9146 9.86308 37.6401 9.50095 37.3042C8.6859 36.5484 8.30571 35.6277 8.43044 34.7113L8.52049 34.0515L7.78515 33.9499C6.65757 33.7939 5.54589 32.8621 5.10911 31.7068C4.96729 31.3317 5.00365 31.2498 5.51435 30.7957C5.82303 30.5214 6.11509 30.2941 6.16349 30.2908C6.21189 30.2874 6.32915 30.5446 6.42353 30.8626C6.65564 31.6408 7.58963 32.3042 8.45331 32.3042C9.62543 32.3042 10.6121 31.3064 10.6121 30.121C10.6121 28.822 9.51467 27.8897 7.98885 27.8924C5.23408 27.8969 2.84746 31.126 3.33721 34.1856C3.50455 35.2306 3.83153 36.1191 4.04872 36.1191C4.12817 36.1191 4.3964 35.9477 4.64417 35.7377C5.07781 35.3708 5.11224 35.3652 5.55359 35.5949C5.80593 35.7262 6.12569 36.0724 6.26414 36.3645L6.51599 36.8956L5.96099 37.407C5.65592 37.6883 5.40624 37.9442 5.40624 37.9758C5.40624 38.1436 7.02861 39.0441 7.61949 39.2042C8.66231 39.4869 10.0557 39.4522 10.9947 39.1199V39.1202ZM40.9093 38.8972C41.4164 38.6673 41.9519 38.3449 42.0992 38.1807C42.36 37.8905 42.3542 37.8713 41.884 37.4761C41.3239 37.0054 41.276 36.618 41.7097 36.0637C42.2815 35.3325 42.5497 35.2882 43.2039 35.8169L43.7881 36.2891L44.1189 35.5684C44.391 34.9756 44.4497 34.582 44.4497 33.3516C44.4497 32.0128 44.4054 31.7648 44.0298 30.9953C43.399 29.7028 42.2969 28.5682 41.3128 28.1979C39.5585 27.5377 38.0587 27.9513 37.4055 29.2759C36.9427 30.2149 37.0546 30.8503 37.8189 31.6187C38.794 32.5999 40.0504 32.569 40.9469 31.5419C41.1965 31.2561 41.4007 30.8561 41.4007 30.6534C41.4007 30.1752 41.5141 30.1882 42.1847 30.7442C42.8184 31.2695 42.8483 31.4292 42.4563 32.198C41.9574 33.1765 40.9156 33.8745 39.8927 33.9157L39.2941 33.9398L39.3888 34.5735C39.5318 35.5338 39.2125 36.383 38.3999 37.2038C38.013 37.5948 37.5889 37.9146 37.4575 37.9146C37.326 37.9146 36.9535 37.7003 36.6294 37.4383L36.0405 36.9623L36.4522 36.7841C37.1755 36.4716 37.5694 35.9029 37.6503 35.0532C37.7442 34.0686 37.3961 33.3651 36.6169 32.9651C35.4665 32.3747 34.3784 32.6921 33.7285 33.8076C32.8345 35.3421 33.69 37.4258 35.7005 38.6112C36.7546 39.2324 37.4967 39.4123 38.7977 39.3617C39.7126 39.3261 40.2007 39.2187 40.9093 38.8972Z" fill="#171321"/>
</g>
<defs>
<clipPath id="clip0_1055_6233">
<rect width="130" height="49.972" fill="white" transform="translate(0.5 0.245605)"/>
</clipPath>
</defs>
</svg>
