<svg width="32" height="32" viewBox="0 0 32 32" fill="none" xmlns="http://www.w3.org/2000/svg">
<g clip-path="url(#clip0_1386_12946)">
<path d="M24.3903 14.6016C24.2205 14.6016 24.0578 14.5342 23.9377 14.4141C23.8177 14.2941 23.7503 14.1313 23.7503 13.9616V9.0304C23.7503 6.97487 22.9337 5.00352 21.4802 3.55004C20.0268 2.09656 18.0554 1.28 15.9999 1.28C13.9443 1.28 11.973 2.09656 10.5195 3.55004C9.06604 5.00352 8.24948 6.97487 8.24948 9.0304V13.9616C8.24948 14.1313 8.18205 14.2941 8.06203 14.4141C7.94201 14.5342 7.77922 14.6016 7.60948 14.6016C7.43974 14.6016 7.27696 14.5342 7.15693 14.4141C7.03691 14.2941 6.96948 14.1313 6.96948 13.9616V9.0304C6.96948 6.63539 7.9209 4.33847 9.61443 2.64494C11.308 0.951414 13.6049 0 15.9999 0C18.3949 0 20.6918 0.951414 22.3853 2.64494C24.0789 4.33847 25.0303 6.63539 25.0303 9.0304V13.9616C25.0303 14.1313 24.9629 14.2941 24.8428 14.4141C24.7228 14.5342 24.56 14.6016 24.3903 14.6016Z" fill="#171321"/>
<path d="M27.9872 32H4.0128C3.84306 32 3.68028 31.9325 3.56025 31.8125C3.44023 31.6925 3.3728 31.5297 3.3728 31.36V16.5248C3.3728 16.355 3.44023 16.1922 3.56025 16.0722C3.68028 15.9522 3.84306 15.8848 4.0128 15.8848C4.18254 15.8848 4.34533 15.9522 4.46535 16.0722C4.58537 16.1922 4.6528 16.355 4.6528 16.5248V30.72H27.9872C28.1569 30.72 28.3197 30.7874 28.4398 30.9074C28.5598 31.0274 28.6272 31.1902 28.6272 31.36C28.6272 31.5297 28.5598 31.6925 28.4398 31.8125C28.3197 31.9325 28.1569 32 27.9872 32Z" fill="#171321"/>
<path d="M27.9872 29.4401C27.8175 29.4401 27.6547 29.3726 27.5347 29.2526C27.4146 29.1326 27.3472 28.9698 27.3472 28.8001V14.6017H4.0128C3.84306 14.6017 3.68028 14.5342 3.56025 14.4142C3.44023 14.2942 3.3728 14.1314 3.3728 13.9617C3.3728 13.7919 3.44023 13.6291 3.56025 13.5091C3.68028 13.3891 3.84306 13.3217 4.0128 13.3217H27.9872C28.1569 13.3217 28.3197 13.3891 28.4398 13.5091C28.5598 13.6291 28.6272 13.7919 28.6272 13.9617V28.8001C28.6272 28.9698 28.5598 29.1326 28.4398 29.2526C28.3197 29.3726 28.1569 29.4401 27.9872 29.4401Z" fill="#171321"/>
<path d="M16 27.9552C15.5369 27.9544 15.093 27.77 14.7655 27.4426C14.438 27.1151 14.2536 26.6712 14.2528 26.208V24.288C13.8509 23.9598 13.5496 23.5249 13.3837 23.0332C13.2179 22.5415 13.194 22.013 13.315 21.5084C13.436 21.0037 13.6969 20.5435 14.0677 20.1804C14.4385 19.8174 14.9041 19.5663 15.4112 19.456C15.8145 19.3686 16.2323 19.3726 16.6339 19.4677C17.0355 19.5628 17.4107 19.7466 17.732 20.0056C18.0533 20.2646 18.3125 20.5922 18.4907 20.9645C18.6688 21.3367 18.7614 21.7441 18.7616 22.1568C18.7632 22.5654 18.6729 22.9691 18.4973 23.3381C18.3217 23.707 18.0653 24.0317 17.7472 24.288V26.208C17.7464 26.6712 17.562 27.1151 17.2345 27.4426C16.907 27.77 16.4631 27.9544 16 27.9552ZM16 20.672C15.8924 20.6718 15.785 20.6836 15.68 20.7072C15.3918 20.7706 15.1293 20.919 14.9263 21.1331C14.7234 21.3473 14.5893 21.6174 14.5414 21.9085C14.4935 22.1997 14.534 22.4985 14.6577 22.7664C14.7814 23.0342 14.9825 23.2589 15.2352 23.4112C15.3285 23.4688 15.4054 23.5493 15.4587 23.6451C15.5119 23.741 15.5396 23.8488 15.5392 23.9584V26.1984C15.5392 26.3224 15.5884 26.4412 15.676 26.5288C15.7637 26.6164 15.8825 26.6656 16.0064 26.6656C16.1303 26.6656 16.2491 26.6164 16.3368 26.5288C16.4244 26.4412 16.4736 26.3224 16.4736 26.1984V23.9584C16.4732 23.8488 16.5009 23.741 16.5541 23.6451C16.6074 23.5493 16.6843 23.4688 16.7776 23.4112C17.0528 23.2427 17.2653 22.9889 17.3827 22.6883C17.5 22.3878 17.5159 22.0571 17.4278 21.7467C17.3397 21.4363 17.1524 21.1633 16.8946 20.9692C16.6368 20.7752 16.3227 20.6708 16 20.672Z" fill="#171321"/>
</g>
<defs>
<clipPath id="clip0_1386_12946">
<rect width="32" height="32" fill="white"/>
</clipPath>
</defs>
</svg>
