<svg width="32" height="33" viewBox="0 0 32 33" fill="none" xmlns="http://www.w3.org/2000/svg">
<g clip-path="url(#clip0_7608_14887)">
<path d="M7.60193 16.7177C7.60193 15.0572 8.09432 13.434 9.01684 12.0533C9.93936 10.6727 11.2506 9.5966 12.7847 8.96116C14.3188 8.32572 16.0068 8.15946 17.6354 8.48341C19.264 8.80735 20.76 9.60695 21.9341 10.7811C23.1082 11.9552 23.9078 13.4512 24.2318 15.0798C24.5557 16.7084 24.3895 18.3964 23.754 19.9305C23.1186 21.4646 22.0425 22.7758 20.6619 23.6984C19.2812 24.6209 17.658 25.1133 15.9975 25.1133C13.7709 25.1133 11.6354 24.2287 10.0609 22.6543C8.48646 21.0798 7.60193 18.9443 7.60193 16.7177Z" stroke="#171321" stroke-width="1.27982" stroke-linecap="round" stroke-linejoin="round"/>
<path d="M15.9982 3.68597C18.9956 3.68805 21.9007 4.72308 24.2242 6.61673C26.5476 8.51038 28.1475 11.1469 28.7543 14.0823C29.361 17.0176 28.9376 20.0724 27.5553 22.732C26.1731 25.3917 23.9164 27.4937 21.1655 28.684M15.9982 29.7494C12.9914 29.7484 10.0774 28.7078 7.74994 26.804C5.42252 24.9003 3.82484 22.2504 3.22762 19.3035C2.63039 16.3566 3.07036 13.2938 4.47297 10.6341C5.87558 7.97442 8.15456 5.88145 10.9238 4.70983" stroke="#171321" stroke-width="1.27982" stroke-linecap="round" stroke-linejoin="round"/>
<path d="M17.1634 1.35992L14.8364 3.69011L17.1634 6.0203" stroke="#171321" stroke-width="1.27982" stroke-linecap="round" stroke-linejoin="round"/>
<path d="M14.8364 32.0838L17.1634 29.7536L14.8364 27.4234" stroke="#171321" stroke-width="1.27982" stroke-linecap="round" stroke-linejoin="round"/>
<path d="M12.8106 18.5063L11.0061 16.7017L12.8106 14.894" stroke="#171321" stroke-width="1.27982" stroke-linecap="round" stroke-linejoin="round"/>
<path d="M19.8699 14.894L21.6744 16.7017L19.8699 18.5063" stroke="#171321" stroke-width="1.27982" stroke-linecap="round" stroke-linejoin="round"/>
<path d="M17.2813 13.9437L15.3967 19.4917" stroke="#171321" stroke-width="1.27982" stroke-linecap="round" stroke-linejoin="round"/>
</g>
<defs>
<clipPath id="clip0_7608_14887">
<rect width="31.9954" height="31.9954" fill="white" transform="translate(0 0.719971)"/>
</clipPath>
</defs>
</svg>
