<svg width="27" height="26" viewBox="0 0 27 26" fill="none" xmlns="http://www.w3.org/2000/svg">
<g clip-path="url(#clip0_1095_13192)">
<path d="M24.4861 14.3542V20.8542C24.4861 22.6498 23.0317 24.1042 21.2361 24.1042H1.73608V16.7917" stroke="#171321" stroke-width="0.541667" stroke-miterlimit="10"/>
<path d="M1.73608 11.4833V1.89583H24.4861V9.20833" stroke="#171321" stroke-width="0.541667" stroke-miterlimit="10"/>
<path d="M1.73606 14.3542C2.48395 14.3542 3.09023 13.7479 3.09023 13C3.09023 12.2521 2.48395 11.6458 1.73606 11.6458C0.988178 11.6458 0.381897 12.2521 0.381897 13C0.381897 13.7479 0.988178 14.3542 1.73606 14.3542Z" stroke="#171321" stroke-width="0.541667" stroke-miterlimit="10"/>
<path d="M24.4861 14.3542C25.2339 14.3542 25.8402 13.7479 25.8402 13C25.8402 12.2521 25.2339 11.6458 24.4861 11.6458C23.7382 11.6458 23.1319 12.2521 23.1319 13C23.1319 13.7479 23.7382 14.3542 24.4861 14.3542Z" stroke="#171321" stroke-width="0.541667" stroke-miterlimit="10"/>
<path d="M11.7569 16.7917L14.4652 9.20833" stroke="#171321" stroke-width="0.541667" stroke-miterlimit="10"/>
<path d="M15.8194 10.2917L18.5277 13L15.8194 15.7083" stroke="#171321" stroke-width="0.541667" stroke-miterlimit="10"/>
<path d="M10.4027 15.7083L7.6944 13L10.4027 10.2917" stroke="#171321" stroke-width="0.541667" stroke-miterlimit="10"/>
</g>
<defs>
<clipPath id="clip0_1095_13192">
<rect width="26" height="26" fill="white" transform="translate(0.111084)"/>
</clipPath>
</defs>
</svg>
