<svg width="32" height="32" viewBox="0 0 32 32" fill="none" xmlns="http://www.w3.org/2000/svg">
<g clip-path="url(#clip0_110_591)">
<path d="M7.50891 8.16964C8.63404 8.16964 9.54613 7.24842 9.54613 6.11204C9.54613 4.97566 8.63404 4.05444 7.50891 4.05444C6.38378 4.05444 5.47168 4.97566 5.47168 6.11204C5.47168 7.24842 6.38378 8.16964 7.50891 8.16964Z" fill="#FCA121"/>
<path d="M7.50892 13.9456C9.14371 13.9534 10.7305 13.3879 11.9984 12.3456C11.4388 11.6995 10.7488 11.1816 9.97475 10.8268C9.20072 10.472 8.36052 10.2885 7.5105 10.2885C6.66049 10.2885 5.82029 10.472 5.04626 10.8268C4.27223 11.1816 3.58225 11.6995 3.02258 12.3456C4.28952 13.3875 5.87517 13.953 7.50892 13.9456Z" fill="#FCA121"/>
<path d="M24.7826 14.3872C25.9077 14.3872 26.8198 13.466 26.8198 12.3296C26.8198 11.1932 25.9077 10.272 24.7826 10.272C23.6575 10.272 22.7454 11.1932 22.7454 12.3296C22.7454 13.466 23.6575 14.3872 24.7826 14.3872Z" fill="#FC6D26"/>
<path d="M24.7794 20.16C26.4142 20.1678 28.001 19.6023 29.2689 18.56C28.7093 17.9138 28.0193 17.396 27.2453 17.0412C26.4712 16.6864 25.631 16.5028 24.781 16.5028C23.931 16.5028 23.0908 16.6864 22.3168 17.0412C21.5427 17.396 20.8528 17.9138 20.2931 18.56C21.56 19.6018 23.1457 20.1673 24.7794 20.16Z" fill="#FC6D26"/>
<path d="M10.3351 23.5488H20.7525V26.1088C20.75 27.5024 20.2001 28.838 19.2236 29.8226C18.247 30.8071 16.9236 31.36 15.5438 31.36C14.8595 31.36 14.1819 31.2238 13.5498 30.9593C12.9176 30.6947 12.3433 30.3069 11.8596 29.818C11.3758 29.3292 10.9922 28.7489 10.7307 28.1102C10.4691 27.4716 10.3347 26.7871 10.3351 26.096V23.536V23.5488Z" fill="#AC7FFF"/>
<path d="M15.5438 32C14.0102 31.9983 12.54 31.3821 11.4559 30.2865C10.3718 29.191 9.76242 27.7057 9.76159 26.1568V23.1136C9.76243 22.8776 9.70491 22.6451 9.59425 22.4372C9.4836 22.2294 9.32331 22.0527 9.12792 21.9232C7.08582 20.551 5.51946 18.5684 4.64792 16.2528C4.61475 16.1735 4.59777 16.0882 4.59803 16.002C4.59828 15.9159 4.61574 15.8307 4.64938 15.7515C4.68302 15.6723 4.73213 15.6008 4.79378 15.5413C4.85543 15.4818 4.92834 15.4354 5.00815 15.405C5.08796 15.3746 5.17302 15.3608 5.25824 15.3645C5.34346 15.3681 5.42708 15.389 5.50409 15.426C5.5811 15.4631 5.64991 15.5154 5.70641 15.58C5.7629 15.6445 5.80592 15.7199 5.83287 15.8016C6.61124 17.8677 8.01197 19.635 9.83763 20.8544C10.2061 21.1017 10.5079 21.4377 10.7158 21.832C10.9238 22.2264 11.0314 22.6668 11.0289 23.1136V26.1568C11.0289 27.3662 11.5046 28.5261 12.3513 29.3812C13.198 30.2364 14.3464 30.7168 15.5438 30.7168C16.7412 30.7168 17.8895 30.2364 18.7362 29.3812C19.5829 28.5261 20.0586 27.3662 20.0586 26.1568V23.1136C20.0558 22.5072 20.2556 21.9175 20.6257 21.44C20.7283 21.3055 20.8795 21.2176 21.0462 21.1957C21.2128 21.1738 21.3813 21.2197 21.5145 21.3232C21.6476 21.4268 21.7347 21.5795 21.7563 21.7478C21.778 21.9162 21.7326 22.0863 21.6301 22.2208C21.4293 22.4697 21.3176 22.7798 21.3133 23.1008V26.144C21.3158 27.6929 20.7097 29.1796 19.6279 30.2775C18.5462 31.3754 17.0773 31.9949 15.5438 32Z" fill="#380D75"/>
<path d="M24.7825 6.69444C24.6765 6.69426 24.5722 6.66721 24.4792 6.61578C24.3862 6.56435 24.3075 6.49017 24.2503 6.40004C22.9961 4.44198 21.1305 2.963 18.9494 2.19777C16.7682 1.43254 14.3966 1.42489 12.2107 2.17604C12.1316 2.20272 12.0481 2.21342 11.965 2.20752C11.8818 2.20162 11.8006 2.17923 11.7261 2.14164C11.5754 2.06573 11.4608 1.93249 11.4075 1.77124C11.3541 1.60999 11.3664 1.43393 11.4415 1.2818C11.5167 1.12967 11.6486 1.01393 11.8083 0.960038C14.2611 0.122511 16.9204 0.134393 19.3658 0.993807C21.8112 1.85322 23.9034 3.51116 25.3116 5.70564C25.4028 5.84751 25.4346 6.02003 25.4001 6.18552C25.3657 6.35101 25.2678 6.496 25.1279 6.58884C25.0253 6.6571 24.9054 6.69378 24.7825 6.69444Z" fill="#380D75"/>
<path d="M20.6923 23.7536H10.3953C10.2272 23.7536 10.066 23.6862 9.94719 23.5662C9.82836 23.4462 9.7616 23.2834 9.7616 23.1136C9.7616 22.9439 9.82836 22.7811 9.94719 22.6611C10.066 22.5411 10.2272 22.4736 10.3953 22.4736H20.6923C20.8603 22.4736 21.0215 22.5411 21.1404 22.6611C21.2592 22.7811 21.3259 22.9439 21.3259 23.1136C21.3259 23.2834 21.2592 23.4462 21.1404 23.5662C21.0215 23.6862 20.8603 23.7536 20.6923 23.7536Z" fill="#380D75"/>
<path d="M21.4685 26.5024H9.61901C9.45096 26.5024 9.28978 26.435 9.17095 26.315C9.05211 26.1949 8.98535 26.0321 8.98535 25.8624C8.98535 25.6927 9.05211 25.5299 9.17095 25.4099C9.28978 25.2898 9.45096 25.2224 9.61901 25.2224H21.4685C21.6366 25.2224 21.7978 25.2898 21.9166 25.4099C22.0354 25.5299 22.1022 25.6927 22.1022 25.8624C22.1022 26.0321 22.0354 26.1949 21.9166 26.315C21.7978 26.435 21.6366 26.5024 21.4685 26.5024Z" fill="#380D75"/>
<path d="M20.9521 29.2512H10.3097C10.1416 29.2512 9.98046 29.1838 9.86162 29.0637C9.74279 28.9437 9.67603 28.7809 9.67603 28.6112C9.67603 28.4415 9.74279 28.2787 9.86162 28.1586C9.98046 28.0386 10.1416 27.9712 10.3097 27.9712H20.9521C21.1201 27.9712 21.2813 28.0386 21.4001 28.1586C21.519 28.2787 21.5857 28.4415 21.5857 28.6112C21.5857 28.7809 21.519 28.9437 21.4001 29.0637C21.2813 29.1838 21.1201 29.2512 20.9521 29.2512Z" fill="#380D75"/>
<path d="M3.16834 12.8608C3.03906 12.8631 2.91217 12.8255 2.80468 12.7529C2.69719 12.6804 2.61426 12.5763 2.56701 12.4547C2.51977 12.3332 2.51047 12.1999 2.54037 12.0729C2.57027 11.9458 2.63793 11.8311 2.73428 11.744C4.05055 10.5631 5.74996 9.91089 7.51052 9.91089C9.27107 9.91089 10.9705 10.5631 12.2868 11.744C12.3492 11.7999 12.4001 11.8676 12.4365 11.9434C12.473 12.0192 12.4944 12.1014 12.4994 12.1855C12.5044 12.2696 12.4929 12.3539 12.4657 12.4335C12.4385 12.5131 12.396 12.5865 12.3406 12.6496C12.2853 12.7126 12.2182 12.764 12.1432 12.8009C12.0682 12.8377 11.9867 12.8593 11.9035 12.8643C11.8202 12.8694 11.7368 12.8578 11.6579 12.8303C11.5791 12.8028 11.5064 12.7599 11.444 12.704C10.3601 11.7312 8.96051 11.1938 7.51052 11.1938C6.06052 11.1938 4.66092 11.7312 3.57705 12.704C3.46355 12.8036 3.31868 12.8591 3.16834 12.8608Z" fill="#380D75"/>
<path d="M7.50895 8.88955C7.00397 8.88891 6.51055 8.73688 6.0912 8.45272C5.67186 8.16857 5.34546 7.76508 5.15338 7.29339C4.9613 6.8217 4.91218 6.30304 5.01224 5.80312C5.1123 5.30321 5.35704 4.84454 5.71544 4.48525C6.07385 4.12596 6.52979 3.8822 7.02549 3.78488C7.52119 3.68756 8.03433 3.74105 8.4999 3.93857C8.96548 4.13609 9.36252 4.46875 9.64071 4.8944C9.91891 5.32005 10.0657 5.81953 10.0626 6.32955C10.0576 7.01026 9.78633 7.66137 9.30797 8.14092C8.82961 8.62047 8.18294 8.88957 7.50895 8.88955ZM7.50895 5.01755C7.2553 5.01818 7.00752 5.09473 6.79692 5.23752C6.58632 5.38031 6.42235 5.58294 6.32572 5.8198C6.22908 6.05667 6.20412 6.31715 6.25399 6.56834C6.30386 6.81953 6.42632 7.05016 6.6059 7.23108C6.78548 7.41201 7.01412 7.53513 7.26295 7.58488C7.51177 7.63462 7.76961 7.60877 8.00389 7.51059C8.23818 7.4124 8.43839 7.24629 8.57925 7.03323C8.72011 6.82018 8.79528 6.56974 8.79528 6.31355C8.79529 6.14309 8.76199 5.9743 8.69731 5.81685C8.63262 5.6594 8.53782 5.51639 8.41833 5.396C8.29885 5.27562 8.15702 5.18022 8.00097 5.11528C7.84492 5.05034 7.67772 5.01713 7.50895 5.01755Z" fill="#380D75"/>
<path d="M7.53432 14.5856C6.10622 14.5856 4.71019 14.1579 3.52277 13.3565C2.33535 12.5552 1.40987 11.4162 0.863359 10.0836C0.316849 8.75105 0.173857 7.28471 0.452466 5.87005C0.731074 4.45538 1.41877 3.15593 2.42859 2.13601C3.43841 1.1161 4.72499 0.421527 6.12565 0.140132C7.52631 -0.141262 8.97813 0.00315987 10.2975 0.555135C11.6169 1.10711 12.7446 2.04185 13.538 3.24114C14.3314 4.44043 14.7549 5.85042 14.7549 7.2928C14.7532 9.22645 13.992 11.0804 12.6382 12.4477C11.2844 13.815 9.44882 14.5839 7.53432 14.5856ZM7.53432 1.28C6.35687 1.28 5.20587 1.63265 4.22686 2.29334C3.24785 2.95404 2.4848 3.89311 2.03422 4.9918C1.58363 6.0905 1.46573 7.29947 1.69544 8.46584C1.92515 9.63221 2.49214 10.7036 3.32472 11.5445C4.1573 12.3854 5.21807 12.9581 6.37289 13.1901C7.52771 13.4221 8.72472 13.303 9.81253 12.8479C10.9004 12.3928 11.8301 11.6221 12.4843 10.6333C13.1384 9.64454 13.4876 8.48202 13.4876 7.2928C13.4867 5.69837 12.8593 4.16948 11.743 3.04205C10.6267 1.91461 9.11296 1.28085 7.53432 1.28Z" fill="#380D75"/>
<path d="M29.1105 18.88C28.9554 18.8805 28.8054 18.8236 28.6891 18.72C27.6052 17.7472 26.2056 17.2098 24.7556 17.2098C23.3056 17.2098 21.906 17.7472 20.8222 18.72C20.6961 18.8329 20.5308 18.8905 20.3627 18.8803C20.1945 18.8701 20.0373 18.7929 19.9255 18.6656C19.8138 18.5383 19.7567 18.3713 19.7668 18.2015C19.7769 18.0317 19.8534 17.8729 19.9794 17.76C21.2957 16.5791 22.9951 15.9269 24.7556 15.9269C26.5162 15.9269 28.2156 16.5791 29.5319 17.76C29.6569 17.873 29.7324 18.0314 29.7419 18.2006C29.7514 18.3698 29.6941 18.5358 29.5826 18.6624C29.5235 18.7302 29.451 18.7847 29.3696 18.8222C29.2882 18.8597 29.1999 18.8794 29.1105 18.88Z" fill="#380D75"/>
<path d="M24.7541 14.8512C24.2491 14.8506 23.7557 14.6985 23.3363 14.4144C22.917 14.1302 22.5906 13.7268 22.3985 13.2551C22.2064 12.7834 22.1573 12.2647 22.2574 11.7648C22.3574 11.2649 22.6022 10.8062 22.9606 10.4469C23.319 10.0876 23.7749 9.84387 24.2706 9.74655C24.7663 9.64923 25.2794 9.70272 25.745 9.90024C26.2106 10.0978 26.6076 10.4304 26.8858 10.8561C27.164 11.2817 27.3109 11.7812 27.3077 12.2912C27.3027 12.9719 27.0315 13.623 26.5531 14.1026C26.0747 14.5821 25.4281 14.8512 24.7541 14.8512ZM24.7541 10.9792C24.4997 10.9799 24.2514 11.0568 24.0404 11.2004C23.8295 11.3439 23.6655 11.5474 23.5694 11.7852C23.4732 12.023 23.4492 12.2843 23.5004 12.536C23.5516 12.7876 23.6756 13.0181 23.8568 13.1984C24.0379 13.3787 24.2681 13.5005 24.5179 13.5485C24.7678 13.5964 25.0261 13.5682 25.2601 13.4676C25.4941 13.367 25.6932 13.1984 25.8321 12.9832C25.971 12.7681 26.0435 12.5161 26.0404 12.2592C26.0354 11.918 25.8977 11.5924 25.657 11.3529C25.4163 11.1134 25.092 10.9792 24.7541 10.9792Z" fill="#380D75"/>
<path d="M24.7794 20.6048C23.3513 20.6048 21.9553 20.1771 20.7679 19.3757C19.5805 18.5744 18.655 17.4354 18.1085 16.1028C17.562 14.7702 17.419 13.3039 17.6976 11.8892C17.9762 10.4745 18.6639 9.1751 19.6737 8.15518C20.6835 7.13526 21.9701 6.44069 23.3708 6.1593C24.7714 5.8779 26.2232 6.02232 27.5426 6.5743C28.862 7.12627 29.9897 8.06101 30.7831 9.26031C31.5765 10.4596 32 11.8696 32 13.312C31.9984 15.2456 31.2371 17.0996 29.8833 18.4669C28.5296 19.8342 26.6939 20.6031 24.7794 20.6048ZM24.7794 7.30237C23.6019 7.30237 22.4507 7.65509 21.4716 8.31593C20.4926 8.97677 19.7295 9.91603 19.279 11.0149C18.8285 12.1138 18.7108 13.3229 18.9408 14.4894C19.1708 15.6558 19.7381 16.7272 20.571 17.568C21.4039 18.4088 22.4649 18.9812 23.62 19.2128C24.775 19.4445 25.9721 19.3249 27.0598 18.8694C28.1476 18.4138 29.0772 17.6426 29.7309 16.6534C30.3847 15.6642 30.7333 14.5013 30.7327 13.312C30.7302 11.7183 30.1021 10.1908 28.9861 9.06422C27.8701 7.93765 26.3573 7.30406 24.7794 7.30237Z" fill="#380D75"/>
</g>
<defs>
<clipPath id="clip0_110_591">
<rect width="32" height="32" fill="white"/>
</clipPath>
</defs>
</svg>
